harmony-alerts mailing list archives

Site index · List index
Message view « Date » · « Thread »
Top « Date » · « Thread »
From nom...@intel.com
Subject [build-test alert] BUILD FAILED Linux SUSE 9 gcc debug: classlib over drlvm
Date Tue, 29 May 2007 16:33:18 GMT
BUILD FAILED:
	Ant Error Message:
/export/cruise/trunk/cc/projects/classlib/trunk/build.xml:169: The following error occurred
while executing this line: /export/cruise/trunk/cc/projects/classlib/trunk/make/build-test.xml:147:
There were test errors.

Date of build:	05/29/2007 22:50:46
Time to build:	42 minutes 3 seconds
Last changed:	05/29/2007 21:02:18
Last log entry:	HAEMONY-3941: [drlvm][gc_gen] EUT suite 'ui' crashes during stress test execution
when gc_gen is used with Out of Memory. This patch gives a fix in two folds: to reserve more
space in MOS when LOS extension; to slide-compact LOS during los_alloc failure. This patch
also enhances the GC verifier to catch the corner case bug.

***********************************************************
Execution log (errors/warnings messages):	

========================================
Testing class libraries...
========================================
Checking for depends/jars/yoko_M2-20070130/yoko.jar
Checking for depends/jars/yoko_M2-20070130/yoko-core.jar
Checking for depends/jars/yoko_M2-20070130/yoko-rmi-impl.jar
Checking for depends/jars/yoko_M2-20070130/yoko-rmi-spec.jar
Checking for depends/jars/bcel-5.2/bcel-5.2.jar
Checking for depends/jars/xalan-j_2.7.0/xalan.jar
Checking for depends/jars/xerces_2.9.0/xerces.zip
Checking for depends/jars/junit_3.8.2/junit.jar
Checking for depends/jars/bcprov-jdk15-136/bcprov.jar
Checking for depends/jars/icu4j_3.4.4/icu4j_3_4_4.jar
Checking for depends/jars/mx4j_3.0.2/mx4j.zip
Checking for depends/jars/jetty/jetty-6.0.0.jar
Checking for depends/jars/jetty/jetty-util-6.0.0.jar
Checking for depends/jars/jetty/servlet-api-2.5-6.0.0.jar
Checking for depends/libs/build/lcms/icc34.h
Checking for depends/libs/build/lcms/lcms.h
Checking for depends/libs/build/png/pngconf.h
Checking for depends/libs/build/png/png.h
Checking for depends/libs/build/jpeg/jconfig.lnx
Checking for depends/libs/build/jpeg/jpeglib.h
Checking for depends/libs/build/jpeg/jmorecfg.h
Checking for depends/libs/build/jpeg/jerror.h
Checking for depends/libs/build/lcms/liblcms.linux.x86
Checking for depends/libs/build/png/libpng.linux.x86
Checking for depends/libs/build/jpeg/libjpeg.linux.x86
hy.test.vm.name = drl
Compiling ACCESSIBILITY classes
Compiling ACCESSIBILITY tests
Since fork is false, ignoring memoryMaximumSize setting
Compiling ANNOTATION classes
Compiling ANNOTATION tests
Since fork is false, ignoring memoryMaximumSize setting
----------
1. WARNING in /export/cruise/trunk/cc/projects/classlib/trunk/modules/annotation/src/test/java/org/apache/harmony/annotation/tests/java/lang/annotation/IncompleteAnnotationExceptionTest.java
 (at line 53)
	clazz, elementName);
	^^^^^
Type safety: The expression of type Class needs unchecked conversion to conform to Class<?
extends Annotation>
----------
1 problem (1 warning)
Compiling APPLET classes
Compiling APPLET tests
Since fork is false, ignoring memoryMaximumSize setting
Compiling ARCHIVE classes
Compiling ARCHIVE tests
Since fork is false, ignoring memoryMaximumSize setting
The GC did not provide gc_add_weak_root_set_entry()
Compiling AUTH classes
Compiling AUTH tests
Since fork is false, ignoring memoryMaximumSize setting
The GC did not provide gc_add_weak_root_set_entry()
Compiling AWT classes
Compiling AWT tests
Since fork is false, ignoring memoryMaximumSize setting
The GC did not provide gc_add_weak_root_set_entry()
The GC did not provide gc_add_weak_root_set_entry()
Compiling BEANS classes
Compiling support classes for BEANS tests
Compiling internal BEANS tests
Compiling BEANS tests
Since fork is false, ignoring memoryMaximumSize setting
Running internal BEANS tests
Running BEANS tests
The GC did not provide gc_add_weak_root_set_entry()
Compiling CRYPTO classes
Compiling CRYPTO test support files
Compiling CRYPTO api tests
Since fork is false, ignoring memoryMaximumSize setting
Compiling CRYPTO api injected tests
Since fork is false, ignoring memoryMaximumSize setting
Compiling CRYPTO impl injected tests
Since fork is false, ignoring memoryMaximumSize setting
Compiling CRYPTO impl tests
Since fork is false, ignoring memoryMaximumSize setting
Running CRYPTO api tests
The GC did not provide gc_add_weak_root_set_entry()
Running CRYPTO api.injected tests
The GC did not provide gc_add_weak_root_set_entry()
Running CRYPTO impl tests
The GC did not provide gc_add_weak_root_set_entry()
Running CRYPTO impl injected tests
Compiling ImageIO classes
Compiling ImageIO tests
Since fork is false, ignoring memoryMaximumSize setting
Compiling INSTRUMENT classes
Compiling INSTRUMENT tests
Since fork is false, ignoring memoryMaximumSize setting
Compiling JNDI classes
Compiling JNDI tests
Since fork is false, ignoring memoryMaximumSize setting
The GC did not provide gc_add_weak_root_set_entry()
Compiling LANG-MANAGEMENT classes
Compiling LANG-MANAGEMENT API tests
Since fork is false, ignoring memoryMaximumSize setting
Compiling LANG-MANAGEMENT Implementation tests
Since fork is false, ignoring memoryMaximumSize setting
Compiling LOGGING classes
Compiling LOGGING tests
Since fork is false, ignoring memoryMaximumSize setting
The GC did not provide gc_add_weak_root_set_entry()
Compiling LUNI classes
Compiling LUNI JUnit Tests
Since fork is false, ignoring memoryMaximumSize setting
Running LUNI JUnit Tests
The GC did not provide gc_add_weak_root_set_entry()
2007-05-29 23:07:18.715::INFO:  Logging to STDERR via org.mortbay.log.StdErrLog
2007-05-29 23:07:18.972::INFO:  jetty-6.0.x
2007-05-29 23:07:19.280::INFO:  Started SocketConnector @ 0.0.0.0:56230
2007-05-29 23:07:59.461::INFO:  jetty-6.0.x
2007-05-29 23:07:59.466::INFO:  Started SocketConnector @ 0.0.0.0:56339
2007-05-29 23:08:00.198::INFO:  jetty-6.0.x
2007-05-29 23:08:00.201::INFO:  Started SocketConnector @ 0.0.0.0:56348
Compiling MATH classes
Compiling MATH tests
Since fork is false, ignoring memoryMaximumSize setting
The GC did not provide gc_add_weak_root_set_entry()
Compiling MISC classes
Compiling MISC tests
Since fork is false, ignoring memoryMaximumSize setting
Compiling NIO classes
Compiling NIO tests
Since fork is false, ignoring memoryMaximumSize setting
The GC did not provide gc_add_weak_root_set_entry()
Compiling NIO_CHAR classes
Compiling NIO_CHAR tests
Since fork is false, ignoring memoryMaximumSize setting
The GC did not provide gc_add_weak_root_set_entry()
Cannot find unmappable byte array for US-ASCII
Cannot find unmappable byte array for gb18030
Cannot find unmappable byte array for ISO-8859-1
Cannot find malform byte array for ISO-8859-1
Cannot find unmappable byte array for UTF-16BE
Cannot find malform byte array for UTF-16BE
Cannot find unmappable byte array for UTF-16
Cannot find malform byte array for UTF-16
Cannot find unmappable byte array for UTF-16LE
Cannot find malform byte array for UTF-16LE
Cannot find unmappable byte array for UTF-8
Compiling PACK200 classes
Compiling PACK200 tests
Since fork is false, ignoring memoryMaximumSize setting
Running PACK200 tests
init: passed
hyerror: passed
hytime: passed
hyfile: passed
Compiling PREFS classes
Compiling PREFS tests
Since fork is false, ignoring memoryMaximumSize setting
The GC did not provide gc_add_weak_root_set_entry()
Compiling PRINT classes
Compiling Print tests
Since fork is false, ignoring memoryMaximumSize setting
java.net.ConnectException: localhost/127.0.0.1:631 - Connection refused
	at org.apache.harmony.luni.net.PlainSocketImpl.connect(PlainSocketImpl.java:229)
	at org.apache.harmony.luni.net.PlainSocketImpl.connect(PlainSocketImpl.java:509)
	at java.net.Socket.connect(Socket.java:932)
	at org.apache.harmony.luni.internal.net.www.protocol.http.HttpURLConnection.getHTTPConnection(HttpURLConnection.java:635)
	at org.apache.harmony.luni.internal.net.www.protocol.http.HttpURLConnection.connect(HttpURLConnection.java:619)
	at org.apache.harmony.x.print.ipp.IppClient.request(IppClient.java:111)
	at org.apache.harmony.x.print.ipp.IppClient.request(IppClient.java:87)
	at org.apache.harmony.x.print.cups.CUPSPrintServiceProvider.findDefaultPrintService(CUPSPrintServiceProvider.java:471)
	at org.apache.harmony.x.print.cups.CUPSPrintServiceProvider.getDefaultPrintService(CUPSPrintServiceProvider.java:169)
	at javax.print.PrintServiceLookup.lookupDefaultPrintService(PrintServiceLookup.java:139)
	at javax.print.attribute.HashAttributeTest.testAdd2(HashAttributeTest.java:128)
	at java.lang.reflect.VMReflection.invokeMethod(VMReflection.java)
	at java.lang.reflect.Method.invoke(Method.java:382)
	at junit.framework.TestCase.runTest(TestCase.java:154)
	at junit.framework.TestCase.runBare(TestCase.java:127)
	at junit.framework.TestResult$1.protect(TestResult.java:106)
	at junit.framework.TestResult.runProtected(TestResult.java:124)
	at junit.framework.TestResult.run(TestResult.java:109)
	at junit.framework.TestCase.run(TestCase.java:118)
	at junit.framework.TestSuite.runTest(TestSuite.java:208)
	at junit.framework.TestSuite.run(TestSuite.java:203)
	at org.apache.tools.ant.taskdefs.optional.junit.JUnitTestRunner.run(JUnitTestRunner.java:297)
	at org.apache.tools.ant.taskdefs.optional.junit.JUnitTestRunner.launch(JUnitTestRunner.java:672)
	at org.apache.tools.ant.taskdefs.optional.junit.JUnitTestRunner.main(JUnitTestRunner.java:546)
java.net.ConnectException: localhost/127.0.0.1:631 - Connection refused
	at org.apache.harmony.luni.net.PlainSocketImpl.connect(PlainSocketImpl.java:229)
	at org.apache.harmony.luni.net.PlainSocketImpl.connect(PlainSocketImpl.java:509)
	at java.net.Socket.connect(Socket.java:932)
	at org.apache.harmony.luni.internal.net.www.protocol.http.HttpURLConnection.getHTTPConnection(HttpURLConnection.java:635)
	at org.apache.harmony.luni.internal.net.www.protocol.http.HttpURLConnection.connect(HttpURLConnection.java:619)
	at org.apache.harmony.x.print.ipp.IppClient.request(IppClient.java:111)
	at org.apache.harmony.x.print.ipp.IppClient.request(IppClient.java:87)
	at org.apache.harmony.x.print.cups.CUPSPrintServiceProvider.findDefaultPrintService(CUPSPrintServiceProvider.java:471)
	at org.apache.harmony.x.print.cups.CUPSPrintServiceProvider.getDefaultPrintService(CUPSPrintServiceProvider.java:169)
	at javax.print.PrintServiceLookup.lookupDefaultPrintService(PrintServiceLookup.java:139)
	at javax.print.attribute.HashAttributeTest.testEquals(HashAttributeTest.java:284)
	at java.lang.reflect.VMReflection.invokeMethod(VMReflection.java)
	at java.lang.reflect.Method.invoke(Method.java:382)
	at junit.framework.TestCase.runTest(TestCase.java:154)
	at junit.framework.TestCase.runBare(TestCase.java:127)
	at junit.framework.TestResult$1.protect(TestResult.java:106)
	at junit.framework.TestResult.runProtected(TestResult.java:124)
	at junit.framework.TestResult.run(TestResult.java:109)
	at junit.framework.TestCase.run(TestCase.java:118)
	at junit.framework.TestSuite.runTest(TestSuite.java:208)
	at junit.framework.TestSuite.run(TestSuite.java:203)
	at org.apache.tools.ant.taskdefs.optional.junit.JUnitTestRunner.run(JUnitTestRunner.java:297)
	at org.apache.tools.ant.taskdefs.optional.junit.JUnitTestRunner.launch(JUnitTestRunner.java:672)
	at org.apache.tools.ant.taskdefs.optional.junit.JUnitTestRunner.main(JUnitTestRunner.java:546)
java.net.ConnectException: localhost/127.0.0.1:631 - Connection refused
	at org.apache.harmony.luni.net.PlainSocketImpl.connect(PlainSocketImpl.java:229)
	at org.apache.harmony.luni.net.PlainSocketImpl.connect(PlainSocketImpl.java:509)
	at java.net.Socket.connect(Socket.java:932)
	at org.apache.harmony.luni.internal.net.www.protocol.http.HttpURLConnection.getHTTPConnection(HttpURLConnection.java:635)
	at org.apache.harmony.luni.internal.net.www.protocol.http.HttpURLConnection.connect(HttpURLConnection.java:619)
	at org.apache.harmony.x.print.ipp.IppClient.request(IppClient.java:111)
	at org.apache.harmony.x.print.ipp.IppClient.request(IppClient.java:87)
	at org.apache.harmony.x.print.cups.CUPSPrintServiceProvider.findDefaultPrintService(CUPSPrintServiceProvider.java:471)
	at org.apache.harmony.x.print.cups.CUPSPrintServiceProvider.getDefaultPrintService(CUPSPrintServiceProvider.java:169)
	at javax.print.PrintServiceLookup.lookupDefaultPrintService(PrintServiceLookup.java:139)
	at javax.print.attribute.HashAttributeTest.testAdd2(HashAttributeTest.java:128)
	at java.lang.reflect.VMReflection.invokeMethod(VMReflection.java)
	at java.lang.reflect.Method.invoke(Method.java:382)
	at junit.framework.TestCase.runTest(TestCase.java:154)
	at junit.framework.TestCase.runBare(TestCase.java:127)
	at junit.framework.TestResult$1.protect(TestResult.java:106)
	at junit.framework.TestResult.runProtected(TestResult.java:124)
	at junit.framework.TestResult.run(TestResult.java:109)
	at junit.framework.TestCase.run(TestCase.java:118)
	at junit.framework.TestSuite.runTest(TestSuite.java:208)
	at junit.framework.TestSuite.run(TestSuite.java:203)
	at junit.framework.TestSuite.runTest(TestSuite.java:208)
	at junit.framework.TestSuite.run(TestSuite.java:203)
	at org.apache.tools.ant.taskdefs.optional.junit.JUnitTestRunner.run(JUnitTestRunner.java:297)
	at org.apache.tools.ant.taskdefs.optional.junit.JUnitTestRunner.launch(JUnitTestRunner.java:672)
	at org.apache.tools.ant.taskdefs.optional.junit.JUnitTestRunner.main(JUnitTestRunner.java:546)
java.net.ConnectException: localhost/127.0.0.1:631 - Connection refused
	at org.apache.harmony.luni.net.PlainSocketImpl.connect(PlainSocketImpl.java:229)
	at org.apache.harmony.luni.net.PlainSocketImpl.connect(PlainSocketImpl.java:509)
	at java.net.Socket.connect(Socket.java:932)
	at org.apache.harmony.luni.internal.net.www.protocol.http.HttpURLConnection.getHTTPConnection(HttpURLConnection.java:635)
	at org.apache.harmony.luni.internal.net.www.protocol.http.HttpURLConnection.connect(HttpURLConnection.java:619)
	at org.apache.harmony.x.print.ipp.IppClient.request(IppClient.java:111)
	at org.apache.harmony.x.print.ipp.IppClient.request(IppClient.java:87)
	at org.apache.harmony.x.print.cups.CUPSPrintServiceProvider.findDefaultPrintService(CUPSPrintServiceProvider.java:471)
	at org.apache.harmony.x.print.cups.CUPSPrintServiceProvider.getDefaultPrintService(CUPSPrintServiceProvider.java:169)
	at javax.print.PrintServiceLookup.lookupDefaultPrintService(PrintServiceLookup.java:139)
	at javax.print.attribute.HashAttributeTest.testEquals(HashAttributeTest.java:284)
	at java.lang.reflect.VMReflection.invokeMethod(VMReflection.java)
	at java.lang.reflect.Method.invoke(Method.java:382)
	at junit.framework.TestCase.runTest(TestCase.java:154)
	at junit.framework.TestCase.runBare(TestCase.java:127)
	at junit.framework.TestResult$1.protect(TestResult.java:106)
	at junit.framework.TestResult.runProtected(TestResult.java:124)
	at junit.framework.TestResult.run(TestResult.java:109)
	at junit.framework.TestCase.run(TestCase.java:118)
	at junit.framework.TestSuite.runTest(TestSuite.java:208)
	at junit.framework.TestSuite.run(TestSuite.java:203)
	at junit.framework.TestSuite.runTest(TestSuite.java:208)
	at junit.framework.TestSuite.run(TestSuite.java:203)
	at org.apache.tools.ant.taskdefs.optional.junit.JUnitTestRunner.run(JUnitTestRunner.java:297)
	at org.apache.tools.ant.taskdefs.optional.junit.JUnitTestRunner.launch(JUnitTestRunner.java:672)
	at org.apache.tools.ant.taskdefs.optional.junit.JUnitTestRunner.main(JUnitTestRunner.java:546)
The GC did not provide gc_add_weak_root_set_entry()
Compiling REGEX classes
Compiling REGEX tests
Since fork is false, ignoring memoryMaximumSize setting
The GC did not provide gc_add_weak_root_set_entry()
Compiling RMI classes
Compiling RMI api tests
Since fork is false, ignoring memoryMaximumSize setting
Running RMI api tests
testDirectSocket_SingleVM starting
Test server started.
Object: MyRemoteObject[UnicastServerRef[endpoint:[[10.125.122.35:56995]](local), ObjID[65536,
UID[42aff038:112d89faaf6:-8000]]]] created and exported.
May 29, 2007 11:16:25 PM org.apache.harmony.rmi.server.RMIReference makeStrong
FINER: main: Strongly referenced RegistryImpl
Registry created.
Object bound in the registry.
Registry located.
May 29, 2007 11:16:27 PM org.apache.harmony.rmi.client.ClientConnection sendDGCAck
FINER: main: Sent DGC ack to [localhost:1099] for UID[42aff038:112d89faaf6:-7ffd]
Lookup object is: Proxy[interf:[org.apache.harmony.rmi.test.MyRemoteInterface, java.rmi.Remote],
RemoteObjectInvocationHandler[UnicastRef[endpoint:[[10.125.122.35:56995]](remote), ObjID[65536,
UID[42aff038:112d89faaf6:-8000]]]]]
Testing test_String_Void...
Done.
Testing test_Void_String...
Returned: MyRemoteObject.test_Void_String
Done.
Testing test_Int_Void...
Done.
Testing test_Void_Int...
Returned: 987654321
Done.
Testing test_Remote_Void...
Done.
Testing test_Remote_Void with remote object extending another remote object...
Done.
Testing test_Void_Remote...
May 29, 2007 11:16:28 PM org.apache.harmony.rmi.client.ClientConnection sendDGCAck
FINER: main: Sent DGC ack to [10.125.122.35:56995] for UID[42aff038:112d89faaf6:-7fe8]
Returned: Proxy[interf:[org.apache.harmony.rmi.test.MyRemoteInterface2, java.rmi.Remote],
RemoteObjectInvocationHandler[UnicastRef[endpoint:[[10.125.122.35:57003]](remote), ObjID[65539,
UID[42aff038:112d89faaf6:-7fe9]]]]]
Done.
Testing test_Long_Long...
Returned: 998877665544332211
Done.
Testing test_String_String...
Returned: MyRemoteObject.test_String_String
Done.
Testing test_Remote_Remote...
May 29, 2007 11:16:28 PM org.apache.harmony.rmi.client.ClientConnection sendDGCAck
FINER: main: Sent DGC ack to [10.125.122.35:56995] for UID[42aff038:112d89faaf6:-7fde]
Returned: Proxy[interf:[org.apache.harmony.rmi.test.MyRemoteInterface2, java.rmi.Remote],
RemoteObjectInvocationHandler[UnicastRef[endpoint:[[10.125.122.35:57007]](remote), ObjID[65541,
UID[42aff038:112d89faaf6:-7fdf]]]]]
Done.
Testing test_RemoteString_Void...
Done.
Testing test_RemoteRemote_Remote...
The GC did not provide gc_add_weak_root_set_entry()
May 29, 2007 11:16:29 PM org.apache.harmony.rmi.client.ClientConnection sendDGCAck
FINER: main: Sent DGC ack to [10.125.122.35:56995] for UID[42aff038:112d89faaf6:-7fd0]
Returned: Proxy[interf:[org.apache.harmony.rmi.test.MyRemoteInterface2, java.rmi.Remote],
RemoteObjectInvocationHandler[UnicastRef[endpoint:[[10.125.122.35:57014]](remote), ObjID[65545,
UID[42aff038:112d89faaf6:-7fd1]]]]]
Done.
Testing test_BooleanStringRemote_Void...
Done.
Testing test_Proxy_Void...
Done.
Testing test_Array_Void...
Done.
Testing test_Void_Array...
Done.
Testing test_RemoteArray_Void...
Done.
Testing test_Void_RemoteArray...
May 29, 2007 11:16:29 PM org.apache.harmony.rmi.client.ClientConnection sendDGCAck
FINER: main: Sent DGC ack to [10.125.122.35:56995] for UID[42aff038:112d89faaf6:-7fbd]
Done.
Testing test_Exception...
org.apache.harmony.rmi.test.MyException: MyRemoteObject.test_Exception
Done.
Testing test_Error...
java.rmi.ServerError: Error occurred while remote method invocation; nested exception is:
	java.lang.Error: MyRemoteObject.test_Error
Done.
Testing test_RuntimeException...
java.lang.RuntimeException: MyRemoteObject.text_RuntimeException
Done.
Testing test_RemoteException...
java.rmi.ServerException: RemoteException occurred while remote method invocation; nested
exception is:
	java.rmi.RemoteException: MyRemoteObject.text_RemoteException
Done.
Test server complete.
Test server closing.
Unexporting MyRemoteObject[UnicastServerRef[endpoint:[[10.125.122.35:56995]](local), ObjID[65536,
UID[42aff038:112d89faaf6:-8000]]]] ...
Done.
Unexporting RegistryImpl ...
Done.
Unexporting MyRemoteObject1[UnicastServerRef[endpoint:[[10.125.122.35:56999]](local), ObjID[65537,
UID[42aff038:112d89faaf6:-7ff4]]]] ...
Done.
Unexporting MyRemoteObject4[UnicastServerRef[endpoint:[[10.125.122.35:57001]](local), ObjID[65538,
UID[42aff038:112d89faaf6:-7fef]]]] ...
Done.
Unexporting MyRemoteObject1[UnicastServerRef[endpoint:[[10.125.122.35:57005]](local), ObjID[65540,
UID[42aff038:112d89faaf6:-7fe3]]]] ...
Done.
Unexporting MyRemoteObject1[UnicastServerRef[endpoint:[[10.125.122.35:57008]](local), ObjID[65542,
UID[42aff038:112d89faaf6:-7fdd]]]] ...
Done.
Unexporting MyRemoteObject1[UnicastServerRef[endpoint:[[10.125.122.35:57010]](local), ObjID[65543,
UID[42aff038:112d89faaf6:-7fd8]]]] ...
Done.
Unexporting MyRemoteObject3[UnicastServerRef[endpoint:[[10.125.122.35:57011]](local), ObjID[65544,
UID[42aff038:112d89faaf6:-7fd7]]]] ...
Done.
Unexporting MyRemoteObject1[UnicastServerRef[endpoint:[[10.125.122.35:57015]](local), ObjID[65546,
UID[42aff038:112d89faaf6:-7fcf]]]] ...
Done.
Unexporting MyRemoteObject1[UnicastServerRef[endpoint:[[10.125.122.35:57017]](local), ObjID[65547,
UID[42aff038:112d89faaf6:-7fc4]]]] ...
Done.
Unexporting MyRemoteObject1[UnicastServerRef[endpoint:[[10.125.122.35:57018]](local), ObjID[65548,
UID[42aff038:112d89faaf6:-7fc3]]]] ...
Done.
Test server exiting.
testDirectHTTP_SingleVM starting
Test server started.
Object: MyRemoteObject[UnicastServerRef[endpoint:[[10.125.122.35:57023]](local), ObjID[65536,
UID[42aff038:112d89fd836:-8000]]]] created and exported.
May 29, 2007 11:16:37 PM org.apache.harmony.rmi.server.RMIReference makeStrong
FINER: main: Strongly referenced RegistryImpl
Registry created.
Object bound in the registry.
Registry located.
May 29, 2007 11:16:39 PM org.apache.harmony.rmi.client.ClientConnection sendDGCAck
FINER: main: Sent DGC ack to [localhost:1099] for UID[42aff038:112d89fd836:-7ffd]
Lookup object is: Proxy[interf:[org.apache.harmony.rmi.test.MyRemoteInterface, java.rmi.Remote],
RemoteObjectInvocationHandler[UnicastRef[endpoint:[[10.125.122.35:57023]](remote), ObjID[65536,
UID[42aff038:112d89fd836:-8000]]]]]
Testing test_String_Void...
Done.
Testing test_Void_String...
Returned: MyRemoteObject.test_Void_String
Done.
Testing test_Int_Void...
Done.
Testing test_Void_Int...
Returned: 987654321
Done.
Testing test_Remote_Void...
Done.
Testing test_Remote_Void with remote object extending another remote object...
Done.
Testing test_Void_Remote...
May 29, 2007 11:16:39 PM org.apache.harmony.rmi.client.ClientConnection sendDGCAck
FINER: main: Sent DGC ack to [10.125.122.35:57023] for UID[42aff038:112d89fd836:-7fe8]
Returned: Proxy[interf:[org.apache.harmony.rmi.test.MyRemoteInterface2, java.rmi.Remote],
RemoteObjectInvocationHandler[UnicastRef[endpoint:[[10.125.122.35:57031]](remote), ObjID[65539,
UID[42aff038:112d89fd836:-7fe9]]]]]
Done.
Testing test_Long_Long...
Returned: 998877665544332211
Done.
Testing test_String_String...
Returned: MyRemoteObject.test_String_String
Done.
Testing test_Remote_Remote...
May 29, 2007 11:16:40 PM org.apache.harmony.rmi.client.ClientConnection sendDGCAck
FINER: main: Sent DGC ack to [10.125.122.35:57023] for UID[42aff038:112d89fd836:-7fde]
Returned: Proxy[interf:[org.apache.harmony.rmi.test.MyRemoteInterface2, java.rmi.Remote],
RemoteObjectInvocationHandler[UnicastRef[endpoint:[[10.125.122.35:57035]](remote), ObjID[65541,
UID[42aff038:112d89fd836:-7fdf]]]]]
Done.
Testing test_RemoteString_Void...
Done.
Testing test_RemoteRemote_Remote...
The GC did not provide gc_add_weak_root_set_entry()
May 29, 2007 11:16:40 PM org.apache.harmony.rmi.client.ClientConnection sendDGCAck
FINER: main: Sent DGC ack to [10.125.122.35:57023] for UID[42aff038:112d89fd836:-7fd0]
Returned: Proxy[interf:[org.apache.harmony.rmi.test.MyRemoteInterface2, java.rmi.Remote],
RemoteObjectInvocationHandler[UnicastRef[endpoint:[[10.125.122.35:57042]](remote), ObjID[65545,
UID[42aff038:112d89fd836:-7fd1]]]]]
Done.
Testing test_BooleanStringRemote_Void...
Done.
Testing test_Proxy_Void...
Done.
Testing test_Array_Void...
Done.
Testing test_Void_Array...
Done.
Testing test_RemoteArray_Void...
Done.
Testing test_Void_RemoteArray...
May 29, 2007 11:16:41 PM org.apache.harmony.rmi.client.ClientConnection sendDGCAck
FINER: main: Sent DGC ack to [10.125.122.35:57023] for UID[42aff038:112d89fd836:-7fbd]
Done.
Testing test_Exception...
org.apache.harmony.rmi.test.MyException: MyRemoteObject.test_Exception
Done.
Testing test_Error...
java.rmi.ServerError: Error occurred while remote method invocation; nested exception is:
	java.lang.Error: MyRemoteObject.test_Error
Done.
Testing test_RuntimeException...
java.lang.RuntimeException: MyRemoteObject.text_RuntimeException
Done.
Testing test_RemoteException...
java.rmi.ServerException: RemoteException occurred while remote method invocation; nested
exception is:
	java.rmi.RemoteException: MyRemoteObject.text_RemoteException
Done.
Test server complete.
Test server closing.
Unexporting MyRemoteObject[UnicastServerRef[endpoint:[[10.125.122.35:57023]](local), ObjID[65536,
UID[42aff038:112d89fd836:-8000]]]] ...
Done.
Unexporting RegistryImpl ...
Done.
Unexporting MyRemoteObject1[UnicastServerRef[endpoint:[[10.125.122.35:57027]](local), ObjID[65537,
UID[42aff038:112d89fd836:-7ff4]]]] ...
Done.
Unexporting MyRemoteObject4[UnicastServerRef[endpoint:[[10.125.122.35:57029]](local), ObjID[65538,
UID[42aff038:112d89fd836:-7fef]]]] ...
Done.
Unexporting MyRemoteObject1[UnicastServerRef[endpoint:[[10.125.122.35:57033]](local), ObjID[65540,
UID[42aff038:112d89fd836:-7fe3]]]] ...
Done.
Unexporting MyRemoteObject1[UnicastServerRef[endpoint:[[10.125.122.35:57036]](local), ObjID[65542,
UID[42aff038:112d89fd836:-7fdd]]]] ...
Done.
Unexporting MyRemoteObject1[UnicastServerRef[endpoint:[[10.125.122.35:57038]](local), ObjID[65543,
UID[42aff038:112d89fd836:-7fd8]]]] ...
Done.
Unexporting MyRemoteObject3[UnicastServerRef[endpoint:[[10.125.122.35:57039]](local), ObjID[65544,
UID[42aff038:112d89fd836:-7fd7]]]] ...
Done.
Unexporting MyRemoteObject1[UnicastServerRef[endpoint:[[10.125.122.35:57043]](local), ObjID[65546,
UID[42aff038:112d89fd836:-7fcf]]]] ...
Done.
Unexporting MyRemoteObject1[UnicastServerRef[endpoint:[[10.125.122.35:57045]](local), ObjID[65547,
UID[42aff038:112d89fd836:-7fc4]]]] ...
Done.
Unexporting MyRemoteObject1[UnicastServerRef[endpoint:[[10.125.122.35:57046]](local), ObjID[65548,
UID[42aff038:112d89fd836:-7fc3]]]] ...
Done.
Test server exiting.
The GC did not provide gc_add_weak_root_set_entry()
Unexporting MyRemoteObject1[UnicastServerRef[endpoint:[[10.125.122.35:57051]](local), ObjID[65536,
UID[4304ba98:112d89ffe2f:-7ff7]]]] ...
Done.
Unexporting MyRemoteObject1[UnicastServerRef[endpoint:[[10.125.122.35:57052]](local), ObjID[65537,
UID[4304ba98:112d89ffe2f:-7ff6]]]] ...
Done.
Unexporting MyRemoteObject1[UnicastServerRef[endpoint:[[10.125.122.35:57053]](local), ObjID[65538,
UID[4304ba98:112d89ffe2f:-7ff5]]]] ...
Done.
Unexporting MyRemoteObject1[UnicastServerRef[endpoint:[[10.125.122.35:57054]](local), ObjID[65539,
UID[4304ba98:112d89ffe2f:-7ff4]]]] ...
Done.
Unexporting MyRemoteObject1[UnicastServerRef[endpoint:[[10.125.122.35:57055]](local), ObjID[65540,
UID[4304ba98:112d89ffe2f:-7ff3]]]] ...
Done.
Unexporting MyRemoteObject1[UnicastServerRef[endpoint:[[10.125.122.35:57056]](local), ObjID[65541,
UID[4304ba98:112d89ffe2f:-7ff2]]]] ...
Done.
Unexporting MyRemoteObject1[UnicastServerRef[endpoint:[[10.125.122.35:57057]](local), ObjID[65542,
UID[4304ba98:112d89ffe2f:-7ff1]]]] ...
Done.
Unexporting MyRemoteObject1[UnicastServerRef[endpoint:[[10.125.122.35:57058]](local), ObjID[65543,
UID[4304ba98:112d89ffe2f:-7ff0]]]] ...
Done.
LogStream[tst]:
Compiling SECURITY classes
Compiling SECURITY test support files
Since fork is false, ignoring memoryMaximumSize setting
Compiling SECURITY api tests
Since fork is false, ignoring memoryMaximumSize setting
Compiling SECURITY api injected tests
Since fork is false, ignoring memoryMaximumSize setting
Compiling SECURITY impl injected tests
Since fork is false, ignoring memoryMaximumSize setting
Compiling SECURITY impl tests
Since fork is false, ignoring memoryMaximumSize setting
Running SECURITY api tests
The GC did not provide gc_add_weak_root_set_entry()
Running SECURITY api.injected tests
Running SECURITY impl tests
The GC did not provide gc_add_weak_root_set_entry()
Running SECURITY impl injected tests
The GC did not provide gc_add_weak_root_set_entry()
Compiling SOUND classes
Compiling SOUND tests
Since fork is false, ignoring memoryMaximumSize setting
The GC did not provide gc_add_weak_root_set_entry()
Compiling SQL classes
Compiling SQL tests
Since fork is false, ignoring memoryMaximumSize setting
The GC did not provide gc_add_weak_root_set_entry()
Compiling Sun Compat classes
Compiling SUNCOMPAT tests
Compiling TEXT classes
Compiling TEXT tests
Since fork is false, ignoring memoryMaximumSize setting
The GC did not provide gc_add_weak_root_set_entry()
Compiling X-NET classes
Compiling X-NET test support files
Compiling X-NET api tests
Since fork is false, ignoring memoryMaximumSize setting
Compiling X-NET impl injected tests
Since fork is false, ignoring memoryMaximumSize setting
Compiling X-NET impl tests
Since fork is false, ignoring memoryMaximumSize setting
Running X-NET api tests
The GC did not provide gc_add_weak_root_set_entry()
Running X-NET impl tests
The GC did not provide gc_add_weak_root_set_entry()
Running X-NET impl injected tests
The GC did not provide gc_add_weak_root_set_entry()
The test report is in /export/cruise/trunk/cc/projects/classlib/trunk/build/test_report/html/index.html

***********************************************************
Unit Tests: (16582)
        
error: test_CtorLjava_io_ByteArrayInputStream org.apache.harmony.security.tests.asn1.der.BerInputStreamTest
Unit Test Error Details:	(1)
                
Test: test_CtorLjava_io_ByteArrayInputStreamClass: org.apache.harmony.security.tests.asn1.der.BerInputStreamTestjava.lang.OutOfMemoryError
	<no stack trace available>


***********************************************************
Modifications since last successful build:	(26)
            
modified xli  /harmony/enhanced/drlvm/trunk/vm/gc_gen/src/thread/collector_alloc.h 05/29/2007
21:02:18 HAEMONY-3941: [drlvm][gc_gen] EUT suite 'ui' crashes during stress test execution
when gc_gen is used with Out of Memory. This patch gives a fix in two folds: to reserve more
space in MOS when LOS extension; to slide-compact LOS during los_alloc failure. This patch
also enhances the GC verifier to catch the corner case bug.
modified xli  /harmony/enhanced/drlvm/trunk/vm/gc_gen/src/verify/verifier_metadata.cpp 05/29/2007
21:02:18 HAEMONY-3941: [drlvm][gc_gen] EUT suite 'ui' crashes during stress test execution
when gc_gen is used with Out of Memory. This patch gives a fix in two folds: to reserve more
space in MOS when LOS extension; to slide-compact LOS during los_alloc failure. This patch
also enhances the GC verifier to catch the corner case bug.
modified xli  /harmony/enhanced/drlvm/trunk/vm/gc_gen/src/gen/gen.cpp 05/29/2007 21:02:18
HAEMONY-3941: [drlvm][gc_gen] EUT suite 'ui' crashes during stress test execution when gc_gen
is used with Out of Memory. This patch gives a fix in two folds: to reserve more space in
MOS when LOS extension; to slide-compact LOS during los_alloc failure. This patch also enhances
the GC verifier to catch the corner case bug.
modified xli  /harmony/enhanced/drlvm/trunk/vm/gc_gen/src/mark_sweep/lspace_alloc_collect.cpp
05/29/2007 21:02:18 HAEMONY-3941: [drlvm][gc_gen] EUT suite 'ui' crashes during stress test
execution when gc_gen is used with Out of Memory. This patch gives a fix in two folds: to
reserve more space in MOS when LOS extension; to slide-compact LOS during los_alloc failure.
This patch also enhances the GC verifier to catch the corner case bug.
modified xli  /harmony/enhanced/drlvm/trunk/vm/gc_gen/src/verify/verifier_metadata.h 05/29/2007
21:02:18 HAEMONY-3941: [drlvm][gc_gen] EUT suite 'ui' crashes during stress test execution
when gc_gen is used with Out of Memory. This patch gives a fix in two folds: to reserve more
space in MOS when LOS extension; to slide-compact LOS during los_alloc failure. This patch
also enhances the GC verifier to catch the corner case bug.
modified xli  /harmony/enhanced/drlvm/trunk/vm/gc_gen/src/verify/verify_live_heap.cpp 05/29/2007
21:02:18 HAEMONY-3941: [drlvm][gc_gen] EUT suite 'ui' crashes during stress test execution
when gc_gen is used with Out of Memory. This patch gives a fix in two folds: to reserve more
space in MOS when LOS extension; to slide-compact LOS during los_alloc failure. This patch
also enhances the GC verifier to catch the corner case bug.
modified xli  /harmony/enhanced/drlvm/trunk/vm/gc_gen/src/verify/verifier_common.cpp 05/29/2007
21:02:18 HAEMONY-3941: [drlvm][gc_gen] EUT suite 'ui' crashes during stress test execution
when gc_gen is used with Out of Memory. This patch gives a fix in two folds: to reserve more
space in MOS when LOS extension; to slide-compact LOS during los_alloc failure. This patch
also enhances the GC verifier to catch the corner case bug.
modified xli  /harmony/enhanced/drlvm/trunk/vm/gc_gen/src/verify/verifier_scanner.cpp 05/29/2007
21:02:18 HAEMONY-3941: [drlvm][gc_gen] EUT suite 'ui' crashes during stress test execution
when gc_gen is used with Out of Memory. This patch gives a fix in two folds: to reserve more
space in MOS when LOS extension; to slide-compact LOS during los_alloc failure. This patch
also enhances the GC verifier to catch the corner case bug.
modified xli  /harmony/enhanced/drlvm/trunk/vm/gc_gen/src/common/gc_for_vm.cpp 05/29/2007
21:02:18 HAEMONY-3941: [drlvm][gc_gen] EUT suite 'ui' crashes during stress test execution
when gc_gen is used with Out of Memory. This patch gives a fix in two folds: to reserve more
space in MOS when LOS extension; to slide-compact LOS during los_alloc failure. This patch
also enhances the GC verifier to catch the corner case bug.
modified xli  /harmony/enhanced/drlvm/trunk/vm/gc_gen/src/common/gc_common.cpp 05/29/2007
21:02:18 HAEMONY-3941: [drlvm][gc_gen] EUT suite 'ui' crashes during stress test execution
when gc_gen is used with Out of Memory. This patch gives a fix in two folds: to reserve more
space in MOS when LOS extension; to slide-compact LOS during los_alloc failure. This patch
also enhances the GC verifier to catch the corner case bug.
modified xli  /harmony/enhanced/drlvm/trunk/vm/gc_gen/src/verify/verifier_common.h 05/29/2007
21:02:18 HAEMONY-3941: [drlvm][gc_gen] EUT suite 'ui' crashes during stress test execution
when gc_gen is used with Out of Memory. This patch gives a fix in two folds: to reserve more
space in MOS when LOS extension; to slide-compact LOS during los_alloc failure. This patch
also enhances the GC verifier to catch the corner case bug.
modified xli  /harmony/enhanced/drlvm/trunk/vm/gc_gen/src/verify/verify_gc_effect.cpp 05/29/2007
21:02:18 HAEMONY-3941: [drlvm][gc_gen] EUT suite 'ui' crashes during stress test execution
when gc_gen is used with Out of Memory. This patch gives a fix in two folds: to reserve more
space in MOS when LOS extension; to slide-compact LOS during los_alloc failure. This patch
also enhances the GC verifier to catch the corner case bug.
modified xli  /harmony/enhanced/drlvm/trunk/vm/gc_gen/src/common/gc_common.h 05/29/2007 21:02:18
HAEMONY-3941: [drlvm][gc_gen] EUT suite 'ui' crashes during stress test execution when gc_gen
is used with Out of Memory. This patch gives a fix in two folds: to reserve more space in
MOS when LOS extension; to slide-compact LOS during los_alloc failure. This patch also enhances
the GC verifier to catch the corner case bug.
modified xli  /harmony/enhanced/drlvm/trunk/vm/gc_gen/src/verify/verify_mutator_effect.cpp
05/29/2007 21:02:18 HAEMONY-3941: [drlvm][gc_gen] EUT suite 'ui' crashes during stress test
execution when gc_gen is used with Out of Memory. This patch gives a fix in two folds: to
reserve more space in MOS when LOS extension; to slide-compact LOS during los_alloc failure.
This patch also enhances the GC verifier to catch the corner case bug.
modified xli  /harmony/enhanced/drlvm/trunk/vm/gc_gen/src/common/space_tuner.cpp 05/29/2007
21:02:18 HAEMONY-3941: [drlvm][gc_gen] EUT suite 'ui' crashes during stress test execution
when gc_gen is used with Out of Memory. This patch gives a fix in two folds: to reserve more
space in MOS when LOS extension; to slide-compact LOS during los_alloc failure. This patch
also enhances the GC verifier to catch the corner case bug.
modified xli  /harmony/enhanced/drlvm/trunk/vm/gc_gen/src/verify/verify_gc_effect.h 05/29/2007
21:02:18 HAEMONY-3941: [drlvm][gc_gen] EUT suite 'ui' crashes during stress test execution
when gc_gen is used with Out of Memory. This patch gives a fix in two folds: to reserve more
space in MOS when LOS extension; to slide-compact LOS during los_alloc failure. This patch
also enhances the GC verifier to catch the corner case bug.
modified xli  /harmony/enhanced/drlvm/trunk/vm/gc_gen/src/utils/bit_ops.h 05/29/2007 21:02:18
HAEMONY-3941: [drlvm][gc_gen] EUT suite 'ui' crashes during stress test execution when gc_gen
is used with Out of Memory. This patch gives a fix in two folds: to reserve more space in
MOS when LOS extension; to slide-compact LOS during los_alloc failure. This patch also enhances
the GC verifier to catch the corner case bug.
modified xli  /harmony/enhanced/drlvm/trunk/vm/gc_gen/src/mark_sweep/lspace.h 05/29/2007 21:02:18
HAEMONY-3941: [drlvm][gc_gen] EUT suite 'ui' crashes during stress test execution when gc_gen
is used with Out of Memory. This patch gives a fix in two folds: to reserve more space in
MOS when LOS extension; to slide-compact LOS during los_alloc failure. This patch also enhances
the GC verifier to catch the corner case bug.
modified gshimansky  /harmony/enhanced/drlvm/trunk/vm/vmcore/src/jni/jni.cpp 05/29/2007 20:39:56
Applied HARMONY-3990 [drlvm][thread]agent test detects the thread event problem
added varlax  /harmony/enhanced/drlvm/trunk/vm/jitrino/src/codegenerator/ia32/Ia32RegAlloc0.cpp
05/29/2007 20:34:48 Applied HARMONY-3991 [drlvm][jit][opt] graph coloring register allocator
uses too much memory
modified varlax  /harmony/enhanced/drlvm/trunk/vm/jitrino/config/ia32/server.emconf 05/29/2007
20:34:48 Applied HARMONY-3991 [drlvm][jit][opt] graph coloring register allocator uses too
much memory
modified varlax  /harmony/enhanced/drlvm/trunk/vm/jitrino/config/em64t/server.emconf 05/29/2007
20:34:48 Applied HARMONY-3991 [drlvm][jit][opt] graph coloring register allocator uses too
much memory
modified varlax  /harmony/enhanced/drlvm/trunk/vm/jitrino/src/codegenerator/ia32/Ia32RegAlloc3.cpp
05/29/2007 20:34:48 Applied HARMONY-3991 [drlvm][jit][opt] graph coloring register allocator
uses too much memory
modified tellison  /harmony/enhanced/classlib/trunk/modules/luni/src/main/java/java/util/Hashtable.java
05/29/2007 19:51:40 Remove unnecessary synchronization in Hashtable.java
modified tellison  /harmony/enhanced/classlib/trunk/modules/luni/src/main/java/java/util/Vector.java
05/29/2007 19:20:46 Code formatting and fixing compiler warnings.
modified apetrenko  /harmony/enhanced/classlib/trunk/modules/luni/src/main/native/launcher/shared/main.c
05/29/2007 19:17:57 Patch for HARMONY-3876 "[classlib][launcher] 'java -help' does not print
a list of options end returns 1"

Mime
View raw message