harmony-alerts mailing list archives

Site index · List index
Message view « Date » · « Thread »
Top « Date » · « Thread »
From nom...@intel.com
Subject [build-test alert] BUILD FAILED Linux SUSE 9 64bit gcc debug: classlib over drlvm
Date Fri, 25 May 2007 08:22:07 GMT
BUILD FAILED:
	Ant Error Message:
/export/cruise/trunk/cc/projects/classlib/trunk/build.xml:169: The following error occurred while executing this line: /export/cruise/trunk/cc/projects/classlib/trunk/make/build-test.xml:142: There were test crashes: /export/cruise/trunk/cc/projects/classlib/trunk/build/test_report/TEST-java.awt.AccessibleAWTTextFieldTest.xml:/export/cruise/trunk/cc/projects/classlib/trunk/build/test_report/TEST-org.apache.harmony.auth.tests.javax.security.auth.callback.LanguageCallbackTest.xml:/export/cruise/trunk/cc/projects/classlib/trunk/build/test_report/TEST-org.apache.harmony.beans.tests.java.beans.PropertyEditorSupportTest.xml:/export/cruise/trunk/cc/projects/classlib/trunk/build/test_report/TEST-org.apache.harmony.crypto.tests.javax.crypto.serialization.ExemptionMechanismExceptionTest.xml:/export/cruise/trunk/cc/projects/classlib/trunk/build/test_report/TEST-org.apache.harmony.jndi.tests.javax.naming.directory.AttributeModificationExceptionTest.xml:/export/cruise/trunk/cc/projects/c!
 lasslib/trunk/build/test_report/TEST-org.apache.harmony.luni.tests.java.lang.ByteTest.xml:/export/cruise/trunk/cc/projects/classlib/trunk/build/test_report/TEST-org.apache.harmony.nio.tests.java.nio.HeapIntBufferTest.xml:/export/cruise/trunk/cc/projects/classlib/trunk/build/test_report/TEST-org.apache.harmony.rmi.server.RMIClassLoaderTest.xml:/export/cruise/trunk/cc/projects/classlib/trunk/build/test_report/TEST-org.apache.harmony.security.tests.fortress.EngineTest.xml:/export/cruise/trunk/cc/projects/classlib/trunk/build/test_report/TEST-org.apache.harmony.security.tests.java.security.Identity2Test.xml:/export/cruise/trunk/cc/projects/classlib/trunk/build/test_report/TEST-org.apache.harmony.sql.tests.javax.transaction.InvalidTransactionExceptionTest.xml:/export/cruise/trunk/cc/projects/classlib/trunk/build/test_report/TEST-org.apache.harmony.tests.java.util.regex.PatternTest.xml:/export/cruise/trunk/cc/projects/classlib/trunk/build/test_report/TEST-org.apache.harmony.xnet.!
 provider.jsse.SSLSessionImplTest.xml:/export/cruise/trunk/cc/projects/
classlib/trunk/build/test_report/TEST-org.apache.harmony.xnet.tests.javax.net.ssl.TrustManagerFactory2Test.xml:/export/cruise/trunk/cc/projects/classlib/trunk/build/test_report/TEST-tests.api.java.nio.charset.UTF16CharsetTest.xml

Date of build:	05/25/2007 15:04:45
Time to build:	16 minutes 58 seconds
Last changed:	05/25/2007 14:47:16
Last log entry:	Fix JUnit style

***********************************************************
Execution log (errors/warnings messages):	
Tests FAILED
Tests FAILED
Tests FAILED
Tests FAILED
Tests FAILED
Tests FAILED
Tests FAILED
Tests FAILED
Tests FAILED
Tests FAILED
Tests FAILED
Tests FAILED
Tests FAILED
Tests FAILED

========================================
Testing class libraries...
========================================
Checking for depends/jars/yoko_M2-20070130/yoko.jar
Checking for depends/jars/yoko_M2-20070130/yoko-core.jar
Checking for depends/jars/yoko_M2-20070130/yoko-rmi-impl.jar
Checking for depends/jars/yoko_M2-20070130/yoko-rmi-spec.jar
Checking for depends/jars/bcel-5.2/bcel-5.2.jar
Checking for depends/jars/xalan-j_2.7.0/xalan.jar
Checking for depends/jars/xerces_2.9.0/xerces.zip
Checking for depends/jars/junit_3.8.2/junit.jar
Checking for depends/jars/bcprov-jdk15-136/bcprov.jar
Checking for depends/jars/icu4j_3.4.4/icu4j_3_4_4.jar
Checking for depends/jars/mx4j_3.0.2/mx4j.zip
Checking for depends/jars/jetty/jetty-6.0.0.jar
Checking for depends/jars/jetty/jetty-util-6.0.0.jar
Checking for depends/jars/jetty/servlet-api-2.5-6.0.0.jar
Checking for depends/libs/build/lcms/icc34.h
Checking for depends/libs/build/lcms/lcms.h
Checking for depends/libs/build/png/pngconf.h
Checking for depends/libs/build/png/png.h
Checking for depends/libs/build/jpeg/jconfig.lnx
Checking for depends/libs/build/jpeg/jpeglib.h
Checking for depends/libs/build/jpeg/jmorecfg.h
Checking for depends/libs/build/jpeg/jerror.h
Checking for depends/libs/build/lcms/liblcms.linux.x86_64
Checking for depends/libs/build/png/libpng.linux.x86_64
Checking for depends/libs/build/jpeg/libjpeg.linux.x86_64
hy.test.vm.name = drl
Compiling ACCESSIBILITY classes
Compiling ACCESSIBILITY tests
Compiling ANNOTATION classes
Compiling ANNOTATION tests
Compiling APPLET classes
Compiling APPLET tests
Compiling ARCHIVE classes
Compiling ARCHIVE tests
The GC did not provide gc_add_weak_root_set_entry()
Compiling AUTH classes
Compiling AUTH tests
The GC did not provide gc_add_weak_root_set_entry()
Uncaught exception in main:
java.lang.ArrayIndexOutOfBoundsException
	at java.util.Vector.insertElementAt(Vector.java)
	at org.apache.xerces.dom.AttributeMap.setNamedItem(Unknown Source)
	at org.apache.xerces.dom.ElementImpl.setAttribute(Unknown Source)
	at org.apache.tools.ant.taskdefs.optional.junit.XMLJUnitResultFormatter.endTestSuite(XMLJUnitResultFormatter.java:130)
	at org.apache.tools.ant.taskdefs.optional.junit.JUnitTestRunner.fireEndTestSuite(JUnitTestRunner.java:449)
	at org.apache.tools.ant.taskdefs.optional.junit.JUnitTestRunner.run(JUnitTestRunner.java:322)
	at org.apache.tools.ant.taskdefs.optional.junit.JUnitTestRunner.launch(JUnitTestRunner.java:672)
	at org.apache.tools.ant.taskdefs.optional.junit.JUnitTestRunner.main(JUnitTestRunner.java:546)
Compiling AWT classes
Compiling AWT tests
The GC did not provide gc_add_weak_root_set_entry()
Uncaught exception in main:
java.lang.ArrayIndexOutOfBoundsException
	at java.util.Vector.insertElementAt(Vector.java)
	at org.apache.xerces.dom.AttributeMap.setNamedItem(Unknown Source)
	at org.apache.xerces.dom.ElementImpl.setAttribute(Unknown Source)
	at org.apache.tools.ant.taskdefs.optional.junit.XMLJUnitResultFormatter.endTestSuite(XMLJUnitResultFormatter.java:130)
	at org.apache.tools.ant.taskdefs.optional.junit.JUnitTestRunner.fireEndTestSuite(JUnitTestRunner.java:449)
	at org.apache.tools.ant.taskdefs.optional.junit.JUnitTestRunner.run(JUnitTestRunner.java:322)
	at org.apache.tools.ant.taskdefs.optional.junit.JUnitTestRunner.launch(JUnitTestRunner.java:672)
	at org.apache.tools.ant.taskdefs.optional.junit.JUnitTestRunner.main(JUnitTestRunner.java:546)
java.lang.NullPointerException
	at java.awt.HeadlessEventDispatchThread.waitForAnyEvent(HeadlessEventDispatchThread.java:71)
	at java.awt.HeadlessEventDispatchThread.runModalLoop(HeadlessEventDispatchThread.java:56)
	at java.awt.HeadlessEventDispatchThread.run(HeadlessEventDispatchThread.java:31)
java.lang.NullPointerException
	at java.awt.HeadlessEventDispatchThread.waitForAnyEvent(HeadlessEventDispatchThread.java:71)
	at java.awt.HeadlessEventDispatchThread.runModalLoop(HeadlessEventDispatchThread.java:56)
	at java.awt.HeadlessEventDispatchThread.run(HeadlessEventDispatchThread.java:31)
java.lang.NullPointerException
	at java.awt.HeadlessEventDispatchThread.waitForAnyEvent(HeadlessEventDispatchThread.java:71)
	at java.awt.HeadlessEventDispatchThread.runModalLoop(HeadlessEventDispatchThread.java:56)
	at java.awt.HeadlessEventDispatchThread.run(HeadlessEventDispatchThread.java:31)
java.lang.NullPointerException
	at java.awt.HeadlessEventDispatchThread.waitForAnyEvent(HeadlessEventDispatchThread.java:71)
	at java.awt.HeadlessEventDispatchThread.runModalLoop(HeadlessEventDispatchThread.java:56)
	at java.awt.HeadlessEventDispatchThread.run(HeadlessEventDispatchThread.java:31)
java.lang.NullPointerException
	at java.awt.HeadlessEventDispatchThread.waitForAnyEvent(HeadlessEventDispatchThread.java:71)
	at java.awt.HeadlessEventDispatchThread.runModalLoop(HeadlessEventDispatchThread.java:56)
	at java.awt.HeadlessEventDispatchThread.run(HeadlessEventDispatchThread.java:31)
java.lang.NullPointerException
	at java.awt.HeadlessEventDispatchThread.waitForAnyEvent(HeadlessEventDispatchThread.java:71)
	at java.awt.HeadlessEventDispatchThread.runModalLoop(HeadlessEventDispatchThread.java:56)
	at java.awt.HeadlessEventDispatchThread.run(HeadlessEventDispatchThread.java:31)
java.lang.NullPointerException
	at java.awt.HeadlessEventDispatchThread.waitForAnyEvent(HeadlessEventDispatchThread.java:71)
	at java.awt.HeadlessEventDispatchThread.runModalLoop(HeadlessEventDispatchThread.java:56)
	at java.awt.HeadlessEventDispatchThread.run(HeadlessEventDispatchThread.java:31)
java.lang.NullPointerException
	at java.awt.HeadlessEventDispatchThread.waitForAnyEvent(HeadlessEventDispatchThread.java:71)
	at java.awt.HeadlessEventDispatchThread.runModalLoop(HeadlessEventDispatchThread.java:56)
	at java.awt.HeadlessEventDispatchThread.run(HeadlessEventDispatchThread.java:31)
java.lang.NullPointerException
	at java.awt.HeadlessEventDispatchThread.waitForAnyEvent(HeadlessEventDispatchThread.java:71)
	at java.awt.HeadlessEventDispatchThread.runModalLoop(HeadlessEventDispatchThread.java:56)
	at java.awt.HeadlessEventDispatchThread.run(HeadlessEventDispatchThread.java:31)
java.lang.NullPointerException
	at java.awt.HeadlessEventDispatchThread.waitForAnyEvent(HeadlessEventDispatchThread.java:71)
	at java.awt.HeadlessEventDispatchThread.runModalLoop(HeadlessEventDispatchThread.java:56)
	at java.awt.HeadlessEventDispatchThread.run(HeadlessEventDispatchThread.java:31)
java.lang.NullPointerException
	at java.awt.HeadlessEventDispatchThread.waitForAnyEvent(HeadlessEventDispatchThread.java:71)
	at java.awt.HeadlessEventDispatchThread.runModalLoop(HeadlessEventDispatchThread.java:56)
	at java.awt.HeadlessEventDispatchThread.run(HeadlessEventDispatchThread.java:31)
java.lang.NullPointerException
	at java.awt.HeadlessEventDispatchThread.waitForAnyEvent(HeadlessEventDispatchThread.java:71)
	at java.awt.HeadlessEventDispatchThread.runModalLoop(HeadlessEventDispatchThread.java:56)
	at java.awt.HeadlessEventDispatchThread.run(HeadlessEventDispatchThread.java:31)
java.lang.NullPointerException
	at java.awt.HeadlessEventDispatchThread.waitForAnyEvent(HeadlessEventDispatchThread.java:71)
	at java.awt.HeadlessEventDispatchThread.runModalLoop(HeadlessEventDispatchThread.java:56)
	at java.awt.HeadlessEventDispatchThread.run(HeadlessEventDispatchThread.java:31)
java.lang.NullPointerException
	at java.awt.HeadlessEventDispatchThread.waitForAnyEvent(HeadlessEventDispatchThread.java:71)
	at java.awt.HeadlessEventDispatchThread.runModalLoop(HeadlessEventDispatchThread.java:56)
	at java.awt.HeadlessEventDispatchThread.run(HeadlessEventDispatchThread.java:31)
java.lang.NullPointerException
	at java.awt.HeadlessEventDispatchThread.waitForAnyEvent(HeadlessEventDispatchThread.java:71)
	at java.awt.HeadlessEventDispatchThread.runModalLoop(HeadlessEventDispatchThread.java:56)
	at java.awt.HeadlessEventDispatchThread.run(HeadlessEventDispatchThread.java:31)
java.lang.NullPointerException
	at java.awt.HeadlessEventDispatchThread.waitForAnyEvent(HeadlessEventDispatchThread.java:71)
	at java.awt.HeadlessEventDispatchThread.runModalLoop(HeadlessEventDispatchThread.java:56)
	at java.awt.HeadlessEventDispatchThread.run(HeadlessEventDispatchThread.java:31)
java.lang.NullPointerException
	at java.awt.HeadlessEventDispatchThread.waitForAnyEvent(HeadlessEventDispatchThread.java:71)
	at java.awt.HeadlessEventDispatchThread.runModalLoop(HeadlessEventDispatchThread.java:56)
	at java.awt.HeadlessEventDispatchThread.run(HeadlessEventDispatchThread.java:31)
java.lang.NullPointerException
	at java.awt.HeadlessEventDispatchThread.waitForAnyEvent(HeadlessEventDispatchThread.java:71)
	at java.awt.HeadlessEventDispatchThread.runModalLoop(HeadlessEventDispatchThread.java:56)
	at java.awt.HeadlessEventDispatchThread.run(HeadlessEventDispatchThread.java:31)
java.lang.NullPointerException
	at java.awt.HeadlessEventDispatchThread.waitForAnyEvent(HeadlessEventDispatchThread.java:71)
	at java.awt.HeadlessEventDispatchThread.runModalLoop(HeadlessEventDispatchThread.java:56)
	at java.awt.HeadlessEventDispatchThread.run(HeadlessEventDispatchThread.java:31)
java.lang.NullPointerException
	at java.awt.HeadlessEventDispatchThread.waitForAnyEvent(HeadlessEventDispatchThread.java:71)
	at java.awt.HeadlessEventDispatchThread.runModalLoop(HeadlessEventDispatchThread.java:56)
	at java.awt.HeadlessEventDispatchThread.run(HeadlessEventDispatchThread.java:31)
java.lang.NullPointerException
	at java.awt.HeadlessEventDispatchThread.waitForAnyEvent(HeadlessEventDispatchThread.java:71)
	at java.awt.HeadlessEventDispatchThread.runModalLoop(HeadlessEventDispatchThread.java:56)
	at java.awt.HeadlessEventDispatchThread.run(HeadlessEventDispatchThread.java:31)
java.lang.NullPointerException
	at java.awt.HeadlessEventDispatchThread.waitForAnyEvent(HeadlessEventDispatchThread.java:71)
	at java.awt.HeadlessEventDispatchThread.runModalLoop(HeadlessEventDispatchThread.java:56)
	at java.awt.HeadlessEventDispatchThread.run(HeadlessEventDispatchThread.java:31)
java.lang.NullPointerException
	at java.awt.HeadlessEventDispatchThread.waitForAnyEvent(HeadlessEventDispatchThread.java:71)
	at java.awt.HeadlessEventDispatchThread.runModalLoop(HeadlessEventDispatchThread.java:56)
	at java.awt.HeadlessEventDispatchThread.run(HeadlessEventDispatchThread.java:31)
java.lang.NullPointerException
	at java.awt.HeadlessEventDispatchThread.waitForAnyEvent(HeadlessEventDispatchThread.java:71)
	at java.awt.HeadlessEventDispatchThread.runModalLoop(HeadlessEventDispatchThread.java:56)
	at java.awt.HeadlessEventDispatchThread.run(HeadlessEventDispatchThread.java:31)
java.lang.NullPointerException
	at java.awt.HeadlessEventDispatchThread.waitForAnyEvent(HeadlessEventDispatchThread.java:71)
	at java.awt.HeadlessEventDispatchThread.runModalLoop(HeadlessEventDispatchThread.java:56)
	at java.awt.HeadlessEventDispatchThread.run(HeadlessEventDispatchThread.java:31)
java.lang.NullPointerException
	at java.awt.HeadlessEventDispatchThread.waitForAnyEvent(HeadlessEventDispatchThread.java:71)
	at java.awt.HeadlessEventDispatchThread.runModalLoop(HeadlessEventDispatchThread.java:56)
	at java.awt.HeadlessEventDispatchThread.run(HeadlessEventDispatchThread.java:31)
java.lang.NullPointerException
	at java.awt.HeadlessEventDispatchThread.waitForAnyEvent(HeadlessEventDispatchThread.java:71)
	at java.awt.HeadlessEventDispatchThread.runModalLoop(HeadlessEventDispatchThread.java:56)
	at java.awt.HeadlessEventDispatchThread.run(HeadlessEventDispatchThread.java:31)
java.lang.NullPointerException
	at java.awt.HeadlessEventDispatchThread.waitForAnyEvent(HeadlessEventDispatchThread.java:71)
	at java.awt.HeadlessEventDispatchThread.runModalLoop(HeadlessEventDispatchThread.java:56)
	at java.awt.HeadlessEventDispatchThread.run(HeadlessEventDispatchThread.java:31)
java.lang.NullPointerException
	at java.awt.HeadlessEventDispatchThread.waitForAnyEvent(HeadlessEventDispatchThread.java:71)
	at java.awt.HeadlessEventDispatchThread.runModalLoop(HeadlessEventDispatchThread.java:56)
	at java.awt.HeadlessEventDispatchThread.run(HeadlessEventDispatchThread.java:31)
java.lang.NullPointerException
	at java.awt.HeadlessEventDispatchThread.waitForAnyEvent(HeadlessEventDispatchThread.java:71)
	at java.awt.HeadlessEventDispatchThread.runModalLoop(HeadlessEventDispatchThread.java:56)
	at java.awt.HeadlessEventDispatchThread.run(HeadlessEventDispatchThread.java:31)
java.lang.NullPointerException
	at java.awt.HeadlessEventDispatchThread.waitForAnyEvent(HeadlessEventDispatchThread.java:71)
	at java.awt.HeadlessEventDispatchThread.runModalLoop(HeadlessEventDispatchThread.java:56)
	at java.awt.HeadlessEventDispatchThread.run(HeadlessEventDispatchThread.java:31)
java.lang.NullPointerException
	at java.awt.HeadlessEventDispatchThread.waitForAnyEvent(HeadlessEventDispatchThread.java:71)
	at java.awt.HeadlessEventDispatchThread.runModalLoop(HeadlessEventDispatchThread.java:56)
	at java.awt.HeadlessEventDispatchThread.run(HeadlessEventDispatchThread.java:31)
java.lang.NullPointerException
	at java.awt.HeadlessEventDispatchThread.waitForAnyEvent(HeadlessEventDispatchThread.java:71)
	at java.awt.HeadlessEventDispatchThread.runModalLoop(HeadlessEventDispatchThread.java:56)
	at java.awt.HeadlessEventDispatchThread.run(HeadlessEventDispatchThread.java:31)
java.lang.NullPointerException
	at java.awt.HeadlessEventDispatchThread.waitForAnyEvent(HeadlessEventDispatchThread.java:71)
	at java.awt.HeadlessEventDispatchThread.runModalLoop(HeadlessEventDispatchThread.java:56)
	at java.awt.HeadlessEventDispatchThread.run(HeadlessEventDispatchThread.java:31)
java.lang.NullPointerException
	at java.awt.HeadlessEventDispatchThread.waitForAnyEvent(HeadlessEventDispatchThread.java:71)
	at java.awt.HeadlessEventDispatchThread.runModalLoop(HeadlessEventDispatchThread.java:56)
	at java.awt.HeadlessEventDispatchThread.run(HeadlessEventDispatchThread.java:31)
java.lang.NullPointerException
	at java.awt.HeadlessEventDispatchThread.waitForAnyEvent(HeadlessEventDispatchThread.java:71)
	at java.awt.HeadlessEventDispatchThread.runModalLoop(HeadlessEventDispatchThread.java:56)
	at java.awt.HeadlessEventDispatchThread.run(HeadlessEventDispatchThread.java:31)
java.lang.NullPointerException
	at java.awt.HeadlessEventDispatchThread.waitForAnyEvent(HeadlessEventDispatchThread.java:71)
	at java.awt.HeadlessEventDispatchThread.runModalLoop(HeadlessEventDispatchThread.java:56)
	at java.awt.HeadlessEventDispatchThread.run(HeadlessEventDispatchThread.java:31)
java.lang.NullPointerException
	at java.awt.HeadlessEventDispatchThread.waitForAnyEvent(HeadlessEventDispatchThread.java:71)
	at java.awt.HeadlessEventDispatchThread.runModalLoop(HeadlessEventDispatchThread.java:56)
	at java.awt.HeadlessEventDispatchThread.run(HeadlessEventDispatchThread.java:31)
java.lang.NullPointerException
	at java.awt.HeadlessEventDispatchThread.waitForAnyEvent(HeadlessEventDispatchThread.java:71)
	at java.awt.HeadlessEventDispatchThread.runModalLoop(HeadlessEventDispatchThread.java:56)
	at java.awt.HeadlessEventDispatchThread.run(HeadlessEventDispatchThread.java:31)
java.lang.NullPointerException
	at java.awt.HeadlessEventDispatchThread.waitForAnyEvent(HeadlessEventDispatchThread.java:71)
	at java.awt.HeadlessEventDispatchThread.runModalLoop(HeadlessEventDispatchThread.java:56)
	at java.awt.HeadlessEventDispatchThread.run(HeadlessEventDispatchThread.java:31)
java.lang.NullPointerException
	at java.awt.HeadlessEventDispatchThread.waitForAnyEvent(HeadlessEventDispatchThread.java:71)
	at java.awt.HeadlessEventDispatchThread.runModalLoop(HeadlessEventDispatchThread.java:56)
	at java.awt.HeadlessEventDispatchThread.run(HeadlessEventDispatchThread.java:31)
java.lang.NullPointerException
	at java.awt.HeadlessEventDispatchThread.waitForAnyEvent(HeadlessEventDispatchThread.java:71)
	at java.awt.HeadlessEventDispatchThread.runModalLoop(HeadlessEventDispatchThread.java:56)
	at java.awt.HeadlessEventDispatchThread.run(HeadlessEventDispatchThread.java:31)
The GC did not provide gc_add_weak_root_set_entry()
Compiling BEANS classes
Compiling support classes for BEANS tests
Compiling internal BEANS tests
Compiling BEANS tests
Running internal BEANS tests
Running BEANS tests
The GC did not provide gc_add_weak_root_set_entry()
Uncaught exception in main:
java.lang.ArrayIndexOutOfBoundsException
	at java.util.Vector.insertElementAt(Vector.java)
	at org.apache.xerces.dom.AttributeMap.setNamedItem(Unknown Source)
	at org.apache.xerces.dom.ElementImpl.setAttribute(Unknown Source)
	at org.apache.tools.ant.taskdefs.optional.junit.XMLJUnitResultFormatter.endTestSuite(XMLJUnitResultFormatter.java:130)
	at org.apache.tools.ant.taskdefs.optional.junit.JUnitTestRunner.fireEndTestSuite(JUnitTestRunner.java:449)
	at org.apache.tools.ant.taskdefs.optional.junit.JUnitTestRunner.run(JUnitTestRunner.java:322)
	at org.apache.tools.ant.taskdefs.optional.junit.JUnitTestRunner.launch(JUnitTestRunner.java:672)
	at org.apache.tools.ant.taskdefs.optional.junit.JUnitTestRunner.main(JUnitTestRunner.java:546)
Compiling CRYPTO classes
Compiling CRYPTO test support files
Compiling CRYPTO api tests
Compiling CRYPTO api injected tests
Compiling CRYPTO impl injected tests
Compiling CRYPTO impl tests
Running CRYPTO api tests
The GC did not provide gc_add_weak_root_set_entry()
Uncaught exception in main:
java.lang.ArrayIndexOutOfBoundsException
	at java.util.Vector.insertElementAt(Vector.java)
	at org.apache.xerces.dom.AttributeMap.setNamedItem(Unknown Source)
	at org.apache.xerces.dom.ElementImpl.setAttribute(Unknown Source)
	at org.apache.tools.ant.taskdefs.optional.junit.XMLJUnitResultFormatter.endTestSuite(XMLJUnitResultFormatter.java:130)
	at org.apache.tools.ant.taskdefs.optional.junit.JUnitTestRunner.fireEndTestSuite(JUnitTestRunner.java:449)
	at org.apache.tools.ant.taskdefs.optional.junit.JUnitTestRunner.run(JUnitTestRunner.java:322)
	at org.apache.tools.ant.taskdefs.optional.junit.JUnitTestRunner.launch(JUnitTestRunner.java:672)
	at org.apache.tools.ant.taskdefs.optional.junit.JUnitTestRunner.main(JUnitTestRunner.java:546)
Running CRYPTO api.injected tests
Running CRYPTO impl tests
Running CRYPTO impl injected tests
Compiling ImageIO classes
Compiling ImageIO tests
Compiling INSTRUMENT classes
Compiling INSTRUMENT tests
Compiling JNDI classes
Compiling JNDI tests
The GC did not provide gc_add_weak_root_set_entry()
Uncaught exception in main:
java.lang.ArrayIndexOutOfBoundsException
	at org.apache.xerces.dom.NamedNodeMapImpl.findNamePoint(Unknown Source)
	at org.apache.xerces.dom.NamedNodeMapImpl.getNamedItem(Unknown Source)
	at org.apache.xerces.dom.ElementImpl.getAttributeNode(Unknown Source)
	at org.apache.xerces.dom.ElementImpl.setAttribute(Unknown Source)
	at org.apache.tools.ant.taskdefs.optional.junit.XMLJUnitResultFormatter.endTestSuite(XMLJUnitResultFormatter.java:131)
	at org.apache.tools.ant.taskdefs.optional.junit.JUnitTestRunner.fireEndTestSuite(JUnitTestRunner.java:449)
	at org.apache.tools.ant.taskdefs.optional.junit.JUnitTestRunner.run(JUnitTestRunner.java:322)
	at org.apache.tools.ant.taskdefs.optional.junit.JUnitTestRunner.launch(JUnitTestRunner.java:672)
	at org.apache.tools.ant.taskdefs.optional.junit.JUnitTestRunner.main(JUnitTestRunner.java:546)
Compiling LANG-MANAGEMENT classes
Compiling LANG-MANAGEMENT API tests
Compiling LANG-MANAGEMENT Implementation tests
Compiling LOGGING classes
Compiling LOGGING tests
The GC did not provide gc_add_weak_root_set_entry()
Compiling LUNI classes
Compiling LUNI JUnit Tests
Running LUNI JUnit Tests
The GC did not provide gc_add_weak_root_set_entry()
Uncaught exception in main:
java.lang.ArrayIndexOutOfBoundsException
	at java.util.Vector.insertElementAt(Vector.java)
	at org.apache.xerces.dom.AttributeMap.setNamedItem(Unknown Source)
	at org.apache.xerces.dom.ElementImpl.setAttribute(Unknown Source)
	at org.apache.tools.ant.taskdefs.optional.junit.XMLJUnitResultFormatter.endTestSuite(XMLJUnitResultFormatter.java:130)
	at org.apache.tools.ant.taskdefs.optional.junit.JUnitTestRunner.fireEndTestSuite(JUnitTestRunner.java:449)
	at org.apache.tools.ant.taskdefs.optional.junit.JUnitTestRunner.run(JUnitTestRunner.java:322)
	at org.apache.tools.ant.taskdefs.optional.junit.JUnitTestRunner.launch(JUnitTestRunner.java:672)
	at org.apache.tools.ant.taskdefs.optional.junit.JUnitTestRunner.main(JUnitTestRunner.java:546)
Compiling MATH classes
Compiling MATH tests
The GC did not provide gc_add_weak_root_set_entry()
Compiling MISC classes
Compiling MISC tests
Compiling NIO classes
Compiling NIO tests
The GC did not provide gc_add_weak_root_set_entry()
Uncaught exception in main:
java.lang.ArrayIndexOutOfBoundsException
	at java.util.Vector.insertElementAt(Vector.java)
	at org.apache.xerces.dom.AttributeMap.setNamedItem(Unknown Source)
	at org.apache.xerces.dom.ElementImpl.setAttribute(Unknown Source)
	at org.apache.tools.ant.taskdefs.optional.junit.XMLJUnitResultFormatter.endTestSuite(XMLJUnitResultFormatter.java:130)
	at org.apache.tools.ant.taskdefs.optional.junit.JUnitTestRunner.fireEndTestSuite(JUnitTestRunner.java:449)
	at org.apache.tools.ant.taskdefs.optional.junit.JUnitTestRunner.run(JUnitTestRunner.java:322)
	at org.apache.tools.ant.taskdefs.optional.junit.JUnitTestRunner.launch(JUnitTestRunner.java:672)
	at org.apache.tools.ant.taskdefs.optional.junit.JUnitTestRunner.main(JUnitTestRunner.java:546)
Compiling NIO_CHAR classes
Compiling NIO_CHAR tests
Cannot find unmappable byte array for US-ASCII
The GC did not provide gc_add_weak_root_set_entry()
Cannot find unmappable byte array for gb18030
Cannot find unmappable byte array for ISO-8859-1
Cannot find malform byte array for ISO-8859-1
Cannot find unmappable byte array for UTF-16BE
Cannot find malform byte array for UTF-16BE
Cannot find unmappable byte array for UTF-16
Cannot find malform byte array for UTF-16
Uncaught exception in main:
java.lang.ArrayIndexOutOfBoundsException
	at java.util.Vector.insertElementAt(Vector.java)
	at org.apache.xerces.dom.AttributeMap.setNamedItem(Unknown Source)
	at org.apache.xerces.dom.ElementImpl.setAttribute(Unknown Source)
	at org.apache.tools.ant.taskdefs.optional.junit.XMLJUnitResultFormatter.endTestSuite(XMLJUnitResultFormatter.java:130)
	at org.apache.tools.ant.taskdefs.optional.junit.JUnitTestRunner.fireEndTestSuite(JUnitTestRunner.java:449)
	at org.apache.tools.ant.taskdefs.optional.junit.JUnitTestRunner.run(JUnitTestRunner.java:322)
	at org.apache.tools.ant.taskdefs.optional.junit.JUnitTestRunner.launch(JUnitTestRunner.java:672)
	at org.apache.tools.ant.taskdefs.optional.junit.JUnitTestRunner.main(JUnitTestRunner.java:546)
Compiling PACK200 classes
Compiling PACK200 tests
Running PACK200 tests
Compiling PREFS classes
Compiling PREFS tests
The GC did not provide gc_add_weak_root_set_entry()
Compiling PRINT classes
Compiling Print tests
java.net.ConnectException: localhost/127.0.0.1:631 - Connection refused
	at org.apache.harmony.luni.net.PlainSocketImpl.connect(PlainSocketImpl.java:229)
	at org.apache.harmony.luni.net.PlainSocketImpl.connect(PlainSocketImpl.java:509)
	at java.net.Socket.connect(Socket.java:932)
	at org.apache.harmony.luni.internal.net.www.protocol.http.HttpURLConnection.getHTTPConnection(HttpURLConnection.java:635)
	at org.apache.harmony.luni.internal.net.www.protocol.http.HttpURLConnection.connect(HttpURLConnection.java:619)
	at org.apache.harmony.x.print.ipp.IppClient.request(IppClient.java:111)
	at org.apache.harmony.x.print.ipp.IppClient.request(IppClient.java:87)
	at org.apache.harmony.x.print.cups.CUPSPrintServiceProvider.findDefaultPrintService(CUPSPrintServiceProvider.java:471)
	at org.apache.harmony.x.print.cups.CUPSPrintServiceProvider.getDefaultPrintService(CUPSPrintServiceProvider.java:169)
	at javax.print.PrintServiceLookup.lookupDefaultPrintService(PrintServiceLookup.java:139)
	at javax.print.attribute.HashAttributeTest.testAdd2(HashAttributeTest.java:128)
	at java.lang.reflect.VMReflection.invokeMethod(VMReflection.java)
	at java.lang.reflect.Method.invoke(Method.java:382)
	at junit.framework.TestCase.runTest(TestCase.java:154)
	at junit.framework.TestCase.runBare(TestCase.java:127)
	at junit.framework.TestResult$1.protect(TestResult.java:106)
	at junit.framework.TestResult.runProtected(TestResult.java:124)
	at junit.framework.TestResult.run(TestResult.java:109)
	at junit.framework.TestCase.run(TestCase.java:118)
	at junit.framework.TestSuite.runTest(TestSuite.java:208)
	at junit.framework.TestSuite.run(TestSuite.java:203)
	at org.apache.tools.ant.taskdefs.optional.junit.JUnitTestRunner.run(JUnitTestRunner.java:297)
	at org.apache.tools.ant.taskdefs.optional.junit.JUnitTestRunner.launch(JUnitTestRunner.java:672)
	at org.apache.tools.ant.taskdefs.optional.junit.JUnitTestRunner.main(JUnitTestRunner.java:546)
java.net.ConnectException: localhost/127.0.0.1:631 - Connection refused
	at org.apache.harmony.luni.net.PlainSocketImpl.connect(PlainSocketImpl.java:229)
	at org.apache.harmony.luni.net.PlainSocketImpl.connect(PlainSocketImpl.java:509)
	at java.net.Socket.connect(Socket.java:932)
	at org.apache.harmony.luni.internal.net.www.protocol.http.HttpURLConnection.getHTTPConnection(HttpURLConnection.java:635)
	at org.apache.harmony.luni.internal.net.www.protocol.http.HttpURLConnection.connect(HttpURLConnection.java:619)
	at org.apache.harmony.x.print.ipp.IppClient.request(IppClient.java:111)
	at org.apache.harmony.x.print.ipp.IppClient.request(IppClient.java:87)
	at org.apache.harmony.x.print.cups.CUPSPrintServiceProvider.findDefaultPrintService(CUPSPrintServiceProvider.java:471)
	at org.apache.harmony.x.print.cups.CUPSPrintServiceProvider.getDefaultPrintService(CUPSPrintServiceProvider.java:169)
	at javax.print.PrintServiceLookup.lookupDefaultPrintService(PrintServiceLookup.java:139)
	at javax.print.attribute.HashAttributeTest.testEquals(HashAttributeTest.java:284)
	at java.lang.reflect.VMReflection.invokeMethod(VMReflection.java)
	at java.lang.reflect.Method.invoke(Method.java:382)
	at junit.framework.TestCase.runTest(TestCase.java:154)
	at junit.framework.TestCase.runBare(TestCase.java:127)
	at junit.framework.TestResult$1.protect(TestResult.java:106)
	at junit.framework.TestResult.runProtected(TestResult.java:124)
	at junit.framework.TestResult.run(TestResult.java:109)
	at junit.framework.TestCase.run(TestCase.java:118)
	at junit.framework.TestSuite.runTest(TestSuite.java:208)
	at junit.framework.TestSuite.run(TestSuite.java:203)
	at org.apache.tools.ant.taskdefs.optional.junit.JUnitTestRunner.run(JUnitTestRunner.java:297)
	at org.apache.tools.ant.taskdefs.optional.junit.JUnitTestRunner.launch(JUnitTestRunner.java:672)
	at org.apache.tools.ant.taskdefs.optional.junit.JUnitTestRunner.main(JUnitTestRunner.java:546)
java.net.ConnectException: localhost/127.0.0.1:631 - Connection refused
	at org.apache.harmony.luni.net.PlainSocketImpl.connect(PlainSocketImpl.java:229)
	at org.apache.harmony.luni.net.PlainSocketImpl.connect(PlainSocketImpl.java:509)
	at java.net.Socket.connect(Socket.java:932)
	at org.apache.harmony.luni.internal.net.www.protocol.http.HttpURLConnection.getHTTPConnection(HttpURLConnection.java:635)
	at org.apache.harmony.luni.internal.net.www.protocol.http.HttpURLConnection.connect(HttpURLConnection.java:619)
	at org.apache.harmony.x.print.ipp.IppClient.request(IppClient.java:111)
	at org.apache.harmony.x.print.ipp.IppClient.request(IppClient.java:87)
	at org.apache.harmony.x.print.cups.CUPSPrintServiceProvider.findDefaultPrintService(CUPSPrintServiceProvider.java:471)
	at org.apache.harmony.x.print.cups.CUPSPrintServiceProvider.getDefaultPrintService(CUPSPrintServiceProvider.java:169)
	at javax.print.PrintServiceLookup.lookupDefaultPrintService(PrintServiceLookup.java:139)
	at javax.print.attribute.HashAttributeTest.testAdd2(HashAttributeTest.java:128)
	at java.lang.reflect.VMReflection.invokeMethod(VMReflection.java)
	at java.lang.reflect.Method.invoke(Method.java:382)
	at junit.framework.TestCase.runTest(TestCase.java:154)
	at junit.framework.TestCase.runBare(TestCase.java:127)
	at junit.framework.TestResult$1.protect(TestResult.java:106)
	at junit.framework.TestResult.runProtected(TestResult.java:124)
	at junit.framework.TestResult.run(TestResult.java:109)
	at junit.framework.TestCase.run(TestCase.java:118)
	at junit.framework.TestSuite.runTest(TestSuite.java:208)
	at junit.framework.TestSuite.run(TestSuite.java:203)
	at junit.framework.TestSuite.runTest(TestSuite.java:208)
	at junit.framework.TestSuite.run(TestSuite.java:203)
	at org.apache.tools.ant.taskdefs.optional.junit.JUnitTestRunner.run(JUnitTestRunner.java:297)
	at org.apache.tools.ant.taskdefs.optional.junit.JUnitTestRunner.launch(JUnitTestRunner.java:672)
	at org.apache.tools.ant.taskdefs.optional.junit.JUnitTestRunner.main(JUnitTestRunner.java:546)
java.net.ConnectException: localhost/127.0.0.1:631 - Connection refused
	at org.apache.harmony.luni.net.PlainSocketImpl.connect(PlainSocketImpl.java:229)
	at org.apache.harmony.luni.net.PlainSocketImpl.connect(PlainSocketImpl.java:509)
	at java.net.Socket.connect(Socket.java:932)
	at org.apache.harmony.luni.internal.net.www.protocol.http.HttpURLConnection.getHTTPConnection(HttpURLConnection.java:635)
	at org.apache.harmony.luni.internal.net.www.protocol.http.HttpURLConnection.connect(HttpURLConnection.java:619)
	at org.apache.harmony.x.print.ipp.IppClient.request(IppClient.java:111)
	at org.apache.harmony.x.print.ipp.IppClient.request(IppClient.java:87)
	at org.apache.harmony.x.print.cups.CUPSPrintServiceProvider.findDefaultPrintService(CUPSPrintServiceProvider.java:471)
	at org.apache.harmony.x.print.cups.CUPSPrintServiceProvider.getDefaultPrintService(CUPSPrintServiceProvider.java:169)
	at javax.print.PrintServiceLookup.lookupDefaultPrintService(PrintServiceLookup.java:139)
	at javax.print.attribute.HashAttributeTest.testEquals(HashAttributeTest.java:284)
	at java.lang.reflect.VMReflection.invokeMethod(VMReflection.java)
	at java.lang.reflect.Method.invoke(Method.java:382)
	at junit.framework.TestCase.runTest(TestCase.java:154)
	at junit.framework.TestCase.runBare(TestCase.java:127)
	at junit.framework.TestResult$1.protect(TestResult.java:106)
	at junit.framework.TestResult.runProtected(TestResult.java:124)
	at junit.framework.TestResult.run(TestResult.java:109)
	at junit.framework.TestCase.run(TestCase.java:118)
	at junit.framework.TestSuite.runTest(TestSuite.java:208)
	at junit.framework.TestSuite.run(TestSuite.java:203)
	at junit.framework.TestSuite.runTest(TestSuite.java:208)
	at junit.framework.TestSuite.run(TestSuite.java:203)
	at org.apache.tools.ant.taskdefs.optional.junit.JUnitTestRunner.run(JUnitTestRunner.java:297)
	at org.apache.tools.ant.taskdefs.optional.junit.JUnitTestRunner.launch(JUnitTestRunner.java:672)
	at org.apache.tools.ant.taskdefs.optional.junit.JUnitTestRunner.main(JUnitTestRunner.java:546)
The GC did not provide gc_add_weak_root_set_entry()
Compiling REGEX classes
Compiling REGEX tests
The GC did not provide gc_add_weak_root_set_entry()
Compiling RMI classes
Compiling RMI api tests
Running RMI api tests
testDirectSocket_SingleVM starting
Test server started.
Object: MyRemoteObject[UnicastServerRef[endpoint:[[127.0.0.2:59150]](local), ObjID[65536, UID[-65ead2f0:112c24eef5e:-8000]]]] created and exported.
May 25, 2007 3:16:37 PM org.apache.harmony.rmi.server.RMIReference makeStrong
FINER: main: Strongly referenced RegistryImpl
Registry created.
Object bound in the registry.
Registry located.
May 25, 2007 3:16:39 PM org.apache.harmony.rmi.client.ClientConnection sendDGCAck
FINER: main: Sent DGC ack to [localhost:1099] for UID[-65ead2f0:112c24eef5e:-7ffd]
Lookup object is: Proxy[interf:[org.apache.harmony.rmi.test.MyRemoteInterface, java.rmi.Remote], RemoteObjectInvocationHandler[UnicastRef[endpoint:[[127.0.0.2:59150]](remote), ObjID[65536, UID[-65ead2f0:112c24eef5e:-8000]]]]]
Testing test_String_Void...
Done.
Testing test_Void_String...
Returned: MyRemoteObject.test_Void_String
Done.
Testing test_Int_Void...
Done.
Testing test_Void_Int...
Returned: 987654321
Done.
Testing test_Remote_Void...
Done.
Testing test_Remote_Void with remote object extending another remote object...
Done.
Testing test_Void_Remote...
May 25, 2007 3:16:40 PM org.apache.harmony.rmi.client.ClientConnection sendDGCAck
FINER: main: Sent DGC ack to [127.0.0.2:59150] for UID[-65ead2f0:112c24eef5e:-7fe8]
Returned: Proxy[interf:[org.apache.harmony.rmi.test.MyRemoteInterface2, java.rmi.Remote], RemoteObjectInvocationHandler[UnicastRef[endpoint:[[127.0.0.2:59158]](remote), ObjID[65539, UID[-65ead2f0:112c24eef5e:-7fe9]]]]]
Done.
Testing test_Long_Long...
Returned: 998877665544332211
Done.
Testing test_String_String...
Returned: MyRemoteObject.test_String_String
Done.
Testing test_Remote_Remote...
May 25, 2007 3:16:40 PM org.apache.harmony.rmi.client.ClientConnection sendDGCAck
FINER: main: Sent DGC ack to [127.0.0.2:59150] for UID[-65ead2f0:112c24eef5e:-7fde]
Returned: Proxy[interf:[org.apache.harmony.rmi.test.MyRemoteInterface2, java.rmi.Remote], RemoteObjectInvocationHandler[UnicastRef[endpoint:[[127.0.0.2:59162]](remote), ObjID[65541, UID[-65ead2f0:112c24eef5e:-7fdf]]]]]
Done.
Testing test_RemoteString_Void...
Done.
Testing test_RemoteRemote_Remote...
May 25, 2007 3:16:41 PM org.apache.harmony.rmi.client.ClientConnection sendDGCAck
FINER: main: Sent DGC ack to [127.0.0.2:59150] for UID[-65ead2f0:112c24eef5e:-7fd0]
Returned: Proxy[interf:[org.apache.harmony.rmi.test.MyRemoteInterface2, java.rmi.Remote], RemoteObjectInvocationHandler[UnicastRef[endpoint:[[127.0.0.2:59169]](remote), ObjID[65545, UID[-65ead2f0:112c24eef5e:-7fd1]]]]]
Done.
Testing test_BooleanStringRemote_Void...
Done.
Testing test_Proxy_Void...
Done.
Testing test_Array_Void...
Done.
Testing test_Void_Array...
Done.
Testing test_RemoteArray_Void...
Done.
Testing test_Void_RemoteArray...
May 25, 2007 3:16:42 PM org.apache.harmony.rmi.client.ClientConnection sendDGCAck
FINER: main: Sent DGC ack to [127.0.0.2:59150] for UID[-65ead2f0:112c24eef5e:-7fbd]
Done.
Testing test_Exception...
org.apache.harmony.rmi.test.MyException: MyRemoteObject.test_Exception
Done.
Testing test_Error...
java.rmi.ServerError: Error occurred while remote method invocation; nested exception is:
	java.lang.Error: MyRemoteObject.test_Error
Done.
Testing test_RuntimeException...
java.lang.RuntimeException: MyRemoteObject.text_RuntimeException
Done.
Testing test_RemoteException...
java.rmi.ServerException: RemoteException occurred while remote method invocation; nested exception is:
	java.rmi.RemoteException: MyRemoteObject.text_RemoteException
Done.
Test server complete.
Test server closing.
Unexporting MyRemoteObject[UnicastServerRef[endpoint:[[127.0.0.2:59150]](local), ObjID[65536, UID[-65ead2f0:112c24eef5e:-8000]]]] ...
Done.
Unexporting MyRemoteObject1[UnicastServerRef[endpoint:[[127.0.0.2:59154]](local), ObjID[65537, UID[-65ead2f0:112c24eef5e:-7ff4]]]] ...
Done.
Unexporting MyRemoteObject4[UnicastServerRef[endpoint:[[127.0.0.2:59156]](local), ObjID[65538, UID[-65ead2f0:112c24eef5e:-7fef]]]] ...
Done.
Unexporting MyRemoteObject1[UnicastServerRef[endpoint:[[127.0.0.2:59160]](local), ObjID[65540, UID[-65ead2f0:112c24eef5e:-7fe3]]]] ...
Done.
Unexporting MyRemoteObject1[UnicastServerRef[endpoint:[[127.0.0.2:59163]](local), ObjID[65542, UID[-65ead2f0:112c24eef5e:-7fdd]]]] ...
Done.
Unexporting MyRemoteObject1[UnicastServerRef[endpoint:[[127.0.0.2:59165]](local), ObjID[65543, UID[-65ead2f0:112c24eef5e:-7fd8]]]] ...
Done.
Unexporting MyRemoteObject3[UnicastServerRef[endpoint:[[127.0.0.2:59166]](local), ObjID[65544, UID[-65ead2f0:112c24eef5e:-7fd7]]]] ...
Done.
Unexporting RegistryImpl ...
Done.
Unexporting MyRemoteObject1[UnicastServerRef[endpoint:[[127.0.0.2:59170]](local), ObjID[65546, UID[-65ead2f0:112c24eef5e:-7fcf]]]] ...
Done.
Unexporting MyRemoteObject1[UnicastServerRef[endpoint:[[127.0.0.2:59172]](local), ObjID[65547, UID[-65ead2f0:112c24eef5e:-7fc4]]]] ...
Done.
Unexporting MyRemoteObject1[UnicastServerRef[endpoint:[[127.0.0.2:59173]](local), ObjID[65548, UID[-65ead2f0:112c24eef5e:-7fc3]]]] ...
Done.
Test server exiting.
testDirectHTTP_SingleVM starting
Test server started.
Object: MyRemoteObject[UnicastServerRef[endpoint:[[127.0.0.2:59178]](local), ObjID[65536, UID[-65ead2f0:112c24f2622:-8000]]]] created and exported.
May 25, 2007 3:16:50 PM org.apache.harmony.rmi.server.RMIReference makeStrong
FINER: main: Strongly referenced RegistryImpl
Registry created.
Object bound in the registry.
Registry located.
May 25, 2007 3:16:53 PM org.apache.harmony.rmi.client.ClientConnection sendDGCAck
FINER: main: Sent DGC ack to [localhost:1099] for UID[-65ead2f0:112c24f2622:-7ffd]
Lookup object is: Proxy[interf:[org.apache.harmony.rmi.test.MyRemoteInterface, java.rmi.Remote], RemoteObjectInvocationHandler[UnicastRef[endpoint:[[127.0.0.2:59178]](remote), ObjID[65536, UID[-65ead2f0:112c24f2622:-8000]]]]]
Testing test_String_Void...
Done.
Testing test_Void_String...
Returned: MyRemoteObject.test_Void_String
Done.
Testing test_Int_Void...
Done.
Testing test_Void_Int...
Returned: 987654321
Done.
Testing test_Remote_Void...
Done.
Testing test_Remote_Void with remote object extending another remote object...
Done.
Testing test_Void_Remote...
May 25, 2007 3:16:54 PM org.apache.harmony.rmi.client.ClientConnection sendDGCAck
FINER: main: Sent DGC ack to [127.0.0.2:59178] for UID[-65ead2f0:112c24f2622:-7fe8]
Returned: Proxy[interf:[org.apache.harmony.rmi.test.MyRemoteInterface2, java.rmi.Remote], RemoteObjectInvocationHandler[UnicastRef[endpoint:[[127.0.0.2:59186]](remote), ObjID[65539, UID[-65ead2f0:112c24f2622:-7fe9]]]]]
Done.
Testing test_Long_Long...
Returned: 998877665544332211
Done.
Testing test_String_String...
Returned: MyRemoteObject.test_String_String
Done.
Testing test_Remote_Remote...
May 25, 2007 3:16:54 PM org.apache.harmony.rmi.client.ClientConnection sendDGCAck
FINER: main: Sent DGC ack to [127.0.0.2:59178] for UID[-65ead2f0:112c24f2622:-7fde]
Returned: Proxy[interf:[org.apache.harmony.rmi.test.MyRemoteInterface2, java.rmi.Remote], RemoteObjectInvocationHandler[UnicastRef[endpoint:[[127.0.0.2:59190]](remote), ObjID[65541, UID[-65ead2f0:112c24f2622:-7fdf]]]]]
Done.
Testing test_RemoteString_Void...
Done.
Testing test_RemoteRemote_Remote...
May 25, 2007 3:16:55 PM org.apache.harmony.rmi.client.ClientConnection sendDGCAck
FINER: main: Sent DGC ack to [127.0.0.2:59178] for UID[-65ead2f0:112c24f2622:-7fd0]
Returned: Proxy[interf:[org.apache.harmony.rmi.test.MyRemoteInterface2, java.rmi.Remote], RemoteObjectInvocationHandler[UnicastRef[endpoint:[[127.0.0.2:59197]](remote), ObjID[65545, UID[-65ead2f0:112c24f2622:-7fd1]]]]]
Done.
Testing test_BooleanStringRemote_Void...
Done.
Testing test_Proxy_Void...
Done.
Testing test_Array_Void...
Done.
Testing test_Void_Array...
Done.
Testing test_RemoteArray_Void...
Done.
Testing test_Void_RemoteArray...
May 25, 2007 3:16:56 PM org.apache.harmony.rmi.client.ClientConnection sendDGCAck
FINER: main: Sent DGC ack to [127.0.0.2:59178] for UID[-65ead2f0:112c24f2622:-7fbd]
Done.
Testing test_Exception...
org.apache.harmony.rmi.test.MyException: MyRemoteObject.test_Exception
Done.
Testing test_Error...
java.rmi.ServerError: Error occurred while remote method invocation; nested exception is:
	java.lang.Error: MyRemoteObject.test_Error
Done.
Testing test_RuntimeException...
java.lang.RuntimeException: MyRemoteObject.text_RuntimeException
Done.
Testing test_RemoteException...
java.rmi.ServerException: RemoteException occurred while remote method invocation; nested exception is:
	java.rmi.RemoteException: MyRemoteObject.text_RemoteException
Done.
Test server complete.
Test server closing.
Unexporting MyRemoteObject[UnicastServerRef[endpoint:[[127.0.0.2:59178]](local), ObjID[65536, UID[-65ead2f0:112c24f2622:-8000]]]] ...
Done.
Unexporting MyRemoteObject1[UnicastServerRef[endpoint:[[127.0.0.2:59182]](local), ObjID[65537, UID[-65ead2f0:112c24f2622:-7ff4]]]] ...
Done.
Unexporting MyRemoteObject4[UnicastServerRef[endpoint:[[127.0.0.2:59184]](local), ObjID[65538, UID[-65ead2f0:112c24f2622:-7fef]]]] ...
Done.
Unexporting MyRemoteObject1[UnicastServerRef[endpoint:[[127.0.0.2:59188]](local), ObjID[65540, UID[-65ead2f0:112c24f2622:-7fe3]]]] ...
Done.
Unexporting MyRemoteObject1[UnicastServerRef[endpoint:[[127.0.0.2:59191]](local), ObjID[65542, UID[-65ead2f0:112c24f2622:-7fdd]]]] ...
Done.
Unexporting MyRemoteObject1[UnicastServerRef[endpoint:[[127.0.0.2:59193]](local), ObjID[65543, UID[-65ead2f0:112c24f2622:-7fd8]]]] ...
Done.
Unexporting MyRemoteObject3[UnicastServerRef[endpoint:[[127.0.0.2:59194]](local), ObjID[65544, UID[-65ead2f0:112c24f2622:-7fd7]]]] ...
Done.
Unexporting RegistryImpl ...
Done.
Unexporting MyRemoteObject1[UnicastServerRef[endpoint:[[127.0.0.2:59198]](local), ObjID[65546, UID[-65ead2f0:112c24f2622:-7fcf]]]] ...
Done.
Unexporting MyRemoteObject1[UnicastServerRef[endpoint:[[127.0.0.2:59200]](local), ObjID[65547, UID[-65ead2f0:112c24f2622:-7fc4]]]] ...
Done.
Unexporting MyRemoteObject1[UnicastServerRef[endpoint:[[127.0.0.2:59201]](local), ObjID[65548, UID[-65ead2f0:112c24f2622:-7fc3]]]] ...
Done.
Test server exiting.
The GC did not provide gc_add_weak_root_set_entry()
Unexporting MyRemoteObject1[UnicastServerRef[endpoint:[[127.0.0.2:59206]](local), ObjID[65536, UID[-659a6d40:112c24f5575:-7ff7]]]] ...
Done.
Unexporting MyRemoteObject1[UnicastServerRef[endpoint:[[127.0.0.2:59207]](local), ObjID[65537, UID[-659a6d40:112c24f5575:-7ff6]]]] ...
Done.
Unexporting MyRemoteObject1[UnicastServerRef[endpoint:[[127.0.0.2:59208]](local), ObjID[65538, UID[-659a6d40:112c24f5575:-7ff5]]]] ...
Done.
Unexporting MyRemoteObject1[UnicastServerRef[endpoint:[[127.0.0.2:59209]](local), ObjID[65539, UID[-659a6d40:112c24f5575:-7ff4]]]] ...
Done.
Unexporting MyRemoteObject1[UnicastServerRef[endpoint:[[127.0.0.2:59210]](local), ObjID[65540, UID[-659a6d40:112c24f5575:-7ff3]]]] ...
Done.
Unexporting MyRemoteObject1[UnicastServerRef[endpoint:[[127.0.0.2:59211]](local), ObjID[65541, UID[-659a6d40:112c24f5575:-7ff2]]]] ...
Done.
Unexporting MyRemoteObject1[UnicastServerRef[endpoint:[[127.0.0.2:59212]](local), ObjID[65542, UID[-659a6d40:112c24f5575:-7ff1]]]] ...
Done.
Unexporting MyRemoteObject1[UnicastServerRef[endpoint:[[127.0.0.2:59213]](local), ObjID[65543, UID[-659a6d40:112c24f5575:-7ff0]]]] ...
Done.
LogStream[tst]:Uncaught exception in main:
java.lang.ArrayIndexOutOfBoundsException
	at java.util.Vector.insertElementAt(Vector.java)
	at org.apache.xerces.dom.AttributeMap.setNamedItem(Unknown Source)
	at org.apache.xerces.dom.ElementImpl.setAttribute(Unknown Source)
	at org.apache.tools.ant.taskdefs.optional.junit.XMLJUnitResultFormatter.endTestSuite(XMLJUnitResultFormatter.java:130)
	at org.apache.tools.ant.taskdefs.optional.junit.JUnitTestRunner.fireEndTestSuite(JUnitTestRunner.java:449)
	at org.apache.tools.ant.taskdefs.optional.junit.JUnitTestRunner.run(JUnitTestRunner.java:322)
	at org.apache.tools.ant.taskdefs.optional.junit.JUnitTestRunner.launch(JUnitTestRunner.java:672)
	at org.apache.tools.ant.taskdefs.optional.junit.JUnitTestRunner.main(JUnitTestRunner.java:546)
Compiling SECURITY classes
Compiling SECURITY test support files
Compiling SECURITY api tests
Compiling SECURITY api injected tests
Compiling SECURITY impl injected tests
Compiling SECURITY impl tests
Running SECURITY api tests
The GC did not provide gc_add_weak_root_set_entry()
Uncaught exception in main:
java.lang.ArrayIndexOutOfBoundsException
	at java.util.Vector.insertElementAt(Vector.java)
	at org.apache.xerces.dom.AttributeMap.setNamedItem(Unknown Source)
	at org.apache.xerces.dom.ElementImpl.setAttribute(Unknown Source)
	at org.apache.tools.ant.taskdefs.optional.junit.XMLJUnitResultFormatter.endTestSuite(XMLJUnitResultFormatter.java:130)
	at org.apache.tools.ant.taskdefs.optional.junit.JUnitTestRunner.fireEndTestSuite(JUnitTestRunner.java:449)
	at org.apache.tools.ant.taskdefs.optional.junit.JUnitTestRunner.run(JUnitTestRunner.java:322)
	at org.apache.tools.ant.taskdefs.optional.junit.JUnitTestRunner.launch(JUnitTestRunner.java:672)
	at org.apache.tools.ant.taskdefs.optional.junit.JUnitTestRunner.main(JUnitTestRunner.java:546)
Running SECURITY api.injected tests
Running SECURITY impl tests
The GC did not provide gc_add_weak_root_set_entry()
Uncaught exception in main:
java.lang.ArrayIndexOutOfBoundsException
	at org.apache.xerces.dom.NamedNodeMapImpl.findNamePoint(Unknown Source)
	at org.apache.xerces.dom.NamedNodeMapImpl.getNamedItem(Unknown Source)
	at org.apache.xerces.dom.ElementImpl.getAttributeNode(Unknown Source)
	at org.apache.xerces.dom.ElementImpl.setAttribute(Unknown Source)
	at org.apache.tools.ant.taskdefs.optional.junit.XMLJUnitResultFormatter.endTestSuite(XMLJUnitResultFormatter.java:131)
	at org.apache.tools.ant.taskdefs.optional.junit.JUnitTestRunner.fireEndTestSuite(JUnitTestRunner.java:449)
	at org.apache.tools.ant.taskdefs.optional.junit.JUnitTestRunner.run(JUnitTestRunner.java:322)
	at org.apache.tools.ant.taskdefs.optional.junit.JUnitTestRunner.launch(JUnitTestRunner.java:672)
	at org.apache.tools.ant.taskdefs.optional.junit.JUnitTestRunner.main(JUnitTestRunner.java:546)
Running SECURITY impl injected tests
Compiling SOUND classes
Compiling SOUND tests
The GC did not provide gc_add_weak_root_set_entry()
Compiling SQL classes
Compiling SQL tests
The GC did not provide gc_add_weak_root_set_entry()
Uncaught exception in main:
java.lang.ArrayIndexOutOfBoundsException
	at java.util.Vector.insertElementAt(Vector.java)
	at org.apache.xerces.dom.AttributeMap.setNamedItem(Unknown Source)
	at org.apache.xerces.dom.ElementImpl.setAttribute(Unknown Source)
	at org.apache.tools.ant.taskdefs.optional.junit.XMLJUnitResultFormatter.endTestSuite(XMLJUnitResultFormatter.java:130)
	at org.apache.tools.ant.taskdefs.optional.junit.JUnitTestRunner.fireEndTestSuite(JUnitTestRunner.java:449)
	at org.apache.tools.ant.taskdefs.optional.junit.JUnitTestRunner.run(JUnitTestRunner.java:322)
	at org.apache.tools.ant.taskdefs.optional.junit.JUnitTestRunner.launch(JUnitTestRunner.java:672)
	at org.apache.tools.ant.taskdefs.optional.junit.JUnitTestRunner.main(JUnitTestRunner.java:546)
Compiling Sun Compat classes
Compiling SUNCOMPAT tests
Compiling TEXT classes
Compiling TEXT tests
The GC did not provide gc_add_weak_root_set_entry()
Compiling X-NET classes
Compiling X-NET test support files
Compiling X-NET api tests
Compiling X-NET impl injected tests
Compiling X-NET impl tests
Running X-NET api tests
The GC did not provide gc_add_weak_root_set_entry()
Uncaught exception in main:
java.lang.ArrayIndexOutOfBoundsException
	at java.util.Vector.insertElementAt(Vector.java)
	at org.apache.xerces.dom.AttributeMap.setNamedItem(Unknown Source)
	at org.apache.xerces.dom.ElementImpl.setAttribute(Unknown Source)
	at org.apache.tools.ant.taskdefs.optional.junit.XMLJUnitResultFormatter.endTestSuite(XMLJUnitResultFormatter.java:130)
	at org.apache.tools.ant.taskdefs.optional.junit.JUnitTestRunner.fireEndTestSuite(JUnitTestRunner.java:449)
	at org.apache.tools.ant.taskdefs.optional.junit.JUnitTestRunner.run(JUnitTestRunner.java:322)
	at org.apache.tools.ant.taskdefs.optional.junit.JUnitTestRunner.launch(JUnitTestRunner.java:672)
	at org.apache.tools.ant.taskdefs.optional.junit.JUnitTestRunner.main(JUnitTestRunner.java:546)
Running X-NET impl tests
Running X-NET impl injected tests
The GC did not provide gc_add_weak_root_set_entry()
Uncaught exception in main:
java.lang.ArrayIndexOutOfBoundsException
	at java.util.Vector.insertElementAt(Vector.java)
	at org.apache.xerces.dom.AttributeMap.setNamedItem(Unknown Source)
	at org.apache.xerces.dom.ElementImpl.setAttribute(Unknown Source)
	at org.apache.tools.ant.taskdefs.optional.junit.XMLJUnitResultFormatter.endTestSuite(XMLJUnitResultFormatter.java:130)
	at org.apache.tools.ant.taskdefs.optional.junit.JUnitTestRunner.fireEndTestSuite(JUnitTestRunner.java:449)
	at org.apache.tools.ant.taskdefs.optional.junit.JUnitTestRunner.run(JUnitTestRunner.java:322)
	at org.apache.tools.ant.taskdefs.optional.junit.JUnitTestRunner.launch(JUnitTestRunner.java:672)
	at org.apache.tools.ant.taskdefs.optional.junit.JUnitTestRunner.main(JUnitTestRunner.java:546)
The test report is in /export/cruise/trunk/cc/projects/classlib/trunk/build/test_report/html/index.html

***********************************************************
Unit Tests: (6902)
        
error: java.awt.AccessibleAWTTextFieldTest vmcrash.CrashedTests
error: org.apache.harmony.auth.tests.javax.security.auth.callback.LanguageCallbackTest vmcrash.CrashedTests
error: org.apache.harmony.beans.tests.java.beans.PropertyEditorSupportTest vmcrash.CrashedTests
error: org.apache.harmony.crypto.tests.javax.crypto.serialization.ExemptionMechanismExceptionTest vmcrash.CrashedTests
error: org.apache.harmony.jndi.tests.javax.naming.directory.AttributeModificationExceptionTest vmcrash.CrashedTests
error: org.apache.harmony.luni.tests.java.lang.ByteTest vmcrash.CrashedTests
error: org.apache.harmony.nio.tests.java.nio.HeapIntBufferTest vmcrash.CrashedTests
error: org.apache.harmony.rmi.server.RMIClassLoaderTest vmcrash.CrashedTests
error: org.apache.harmony.security.tests.fortress.EngineTest vmcrash.CrashedTests
error: org.apache.harmony.security.tests.java.security.Identity2Test vmcrash.CrashedTests
error: org.apache.harmony.sql.tests.javax.transaction.InvalidTransactionExceptionTest vmcrash.CrashedTests
error: org.apache.harmony.tests.java.util.regex.PatternTest vmcrash.CrashedTests
error: org.apache.harmony.xnet.provider.jsse.SSLSessionImplTest vmcrash.CrashedTests
error: org.apache.harmony.xnet.tests.javax.net.ssl.TrustManagerFactory2Test vmcrash.CrashedTests
error: tests.api.java.nio.charset.UTF16CharsetTest vmcrash.CrashedTests
Unit Test Error Details:	(15)
                
Test: java.awt.AccessibleAWTTextFieldTestClass: vmcrash.CrashedTests
Test: org.apache.harmony.auth.tests.javax.security.auth.callback.LanguageCallbackTestClass: vmcrash.CrashedTests
Test: org.apache.harmony.beans.tests.java.beans.PropertyEditorSupportTestClass: vmcrash.CrashedTests
Test: org.apache.harmony.crypto.tests.javax.crypto.serialization.ExemptionMechanismExceptionTestClass: vmcrash.CrashedTests
Test: org.apache.harmony.jndi.tests.javax.naming.directory.AttributeModificationExceptionTestClass: vmcrash.CrashedTests
Test: org.apache.harmony.luni.tests.java.lang.ByteTestClass: vmcrash.CrashedTests
Test: org.apache.harmony.nio.tests.java.nio.HeapIntBufferTestClass: vmcrash.CrashedTests
Test: org.apache.harmony.rmi.server.RMIClassLoaderTestClass: vmcrash.CrashedTests
Test: org.apache.harmony.security.tests.fortress.EngineTestClass: vmcrash.CrashedTests
Test: org.apache.harmony.security.tests.java.security.Identity2TestClass: vmcrash.CrashedTests
Test: org.apache.harmony.sql.tests.javax.transaction.InvalidTransactionExceptionTestClass: vmcrash.CrashedTests
Test: org.apache.harmony.tests.java.util.regex.PatternTestClass: vmcrash.CrashedTests
Test: org.apache.harmony.xnet.provider.jsse.SSLSessionImplTestClass: vmcrash.CrashedTests
Test: org.apache.harmony.xnet.tests.javax.net.ssl.TrustManagerFactory2TestClass: vmcrash.CrashedTests
Test: tests.api.java.nio.charset.UTF16CharsetTestClass: vmcrash.CrashedTests

***********************************************************
Modifications since last successful build:	(17)
            
modified smishura  /harmony/enhanced/classlib/trunk/modules/security/src/test/api/java/org/apache/harmony/security/tests/java/security/Permissions2Test.java 05/25/2007 14:47:16 Fix JUnit style
add cc-drlvm log20070525143716Lbuild.749 05/25/2007 14:37:16drlvm
modified varlax  /harmony/enhanced/drlvm/trunk/build/make/components/vm/jitrino.xml 05/25/2007 13:14:02 Applied HARMONY-3651 [drlvm][jit] Very slow compilation in Jitrino on Windows x86-64.
modified varlax  /harmony/enhanced/drlvm/trunk/vm/em/src/DrlEMImpl.cpp 05/25/2007 13:08:05 Applied HARMONY-3714 [drlvm][em] Known/proven race condition markup 
added varlax  /harmony/enhanced/drlvm/trunk/src/test/regression/H2057/SyncTest.java 05/25/2007 13:00:17 Applied HARMONY-2057 [drlvm][jit] Jitrino.OPT's bpp.version=6 algorithm (the default) considers that all VM helpers are interruptable.
added varlax  /harmony/enhanced/drlvm/trunk/src/test/regression/H2057 05/25/2007 13:00:17 Applied HARMONY-2057 [drlvm][jit] Jitrino.OPT's bpp.version=6 algorithm (the default) considers that all VM helpers are interruptable.
modified varlax  /harmony/enhanced/drlvm/trunk/vm/jitrino/src/codegenerator/ia32/Ia32IRManager.cpp 05/25/2007 13:00:17 Applied HARMONY-2057 [drlvm][jit] Jitrino.OPT's bpp.version=6 algorithm (the default) considers that all VM helpers are interruptable.
added varlax  /harmony/enhanced/drlvm/trunk/src/test/regression/H2057/run.test.xml 05/25/2007 13:00:17 Applied HARMONY-2057 [drlvm][jit] Jitrino.OPT's bpp.version=6 algorithm (the default) considers that all VM helpers are interruptable.
modified varlax  /harmony/enhanced/drlvm/trunk/vm/jitrino/src/codegenerator/ia32/Ia32BBPolling.cpp 05/25/2007 13:00:17 Applied HARMONY-2057 [drlvm][jit] Jitrino.OPT's bpp.version=6 algorithm (the default) considers that all VM helpers are interruptable.
modified varlax  /harmony/enhanced/drlvm/trunk/vm/include/jit_runtime_support.h 05/25/2007 13:00:17 Applied HARMONY-2057 [drlvm][jit] Jitrino.OPT's bpp.version=6 algorithm (the default) considers that all VM helpers are interruptable.
modified varlax  /harmony/enhanced/drlvm/trunk/vm/jitrino/src/vm/drl/DrlVMInterface.cpp 05/25/2007 13:00:17 Applied HARMONY-2057 [drlvm][jit] Jitrino.OPT's bpp.version=6 algorithm (the default) considers that all VM helpers are interruptable.
modified varlax  /harmony/enhanced/drlvm/trunk/vm/vmcore/src/jit/jit_runtime_support.cpp 05/25/2007 13:00:17 Applied HARMONY-2057 [drlvm][jit] Jitrino.OPT's bpp.version=6 algorithm (the default) considers that all VM helpers are interruptable.
modified varlax  /harmony/enhanced/drlvm/trunk/vm/jitrino/src/vm/VMInterface.h 05/25/2007 13:00:17 Applied HARMONY-2057 [drlvm][jit] Jitrino.OPT's bpp.version=6 algorithm (the default) considers that all VM helpers are interruptable.
modified varlax  /harmony/enhanced/drlvm/trunk/vm/jitrino/src/codegenerator/ia32/Ia32InstCodeSelector.cpp 05/25/2007 12:46:38 Applied HARMONY-3954 [drlvm][jit] Jitrino.OPT arraycopy optimization fails when Class[] array is used
added varlax  /harmony/enhanced/drlvm/trunk/src/test/regression/H3954/Test.java 05/25/2007 12:46:38 Applied HARMONY-3954 [drlvm][jit] Jitrino.OPT arraycopy optimization fails when Class[] array is used
added varlax  /harmony/enhanced/drlvm/trunk/src/test/regression/H3954 05/25/2007 12:46:38 Applied HARMONY-3954 [drlvm][jit] Jitrino.OPT arraycopy optimization fails when Class[] array is used
added varlax  /harmony/enhanced/drlvm/trunk/src/test/regression/H3954/run.test.xml 05/25/2007 12:46:38 Applied HARMONY-3954 [drlvm][jit] Jitrino.OPT arraycopy optimization fails when Class[] array is used

Mime
View raw message