harmony-alerts mailing list archives

Site index · List index
Message view « Date » · « Thread »
Top « Date » · « Thread »
From nom...@intel.com
Subject [build-test alert] BUILD FAILED Linux SUSE 9 64bit gcc debug: drlvm reg.test
Date Fri, 25 May 2007 08:04:45 GMT
BUILD FAILED:
	Ant Error Message:
/export/cruise/trunk/cc/projects/drlvm/trunk/build/make/build.xml:481: The following error
occurred while executing this line: /export/cruise/trunk/cc/projects/drlvm/trunk/build/make/targets/reg.test.run.xml:122:
There were test failures

Date of build:	05/25/2007 14:47:26
Time to build:	17 minutes 9 seconds
Last changed:	05/25/2007 14:37:16
Last log entry:	drlvm

***********************************************************
Execution log (errors/warnings messages):	
Test org.apache.harmony.drlvm.tests.regression.h1748.IntfAccessTest FAILED
Test org.apache.harmony.drlvm.tests.regression.h1802.UnresolvedParamTest FAILED
Test org.apache.harmony.drlvm.tests.regression.h1857.Test FAILED
Test org.apache.harmony.drlvm.tests.regression.H2057.SyncTest FAILED
Test org.apache.harmony.drlvm.tests.regression.h2259.H2259 FAILED
Test org.apache.harmony.drlvm.tests.regression.h2261.RCETest FAILED
Test org.apache.harmony.drlvm.tests.regression.H2773.InfinityTest FAILED
Test org.apache.harmony.drlvm.tests.regression.H2873.RemTest FAILED
Test org.apache.harmony.drlvm.tests.regression.H2874.Test FAILED
Test org.apache.harmony.drlvm.tests.regression.H3110.FieldTest FAILED
Test org.apache.harmony.drlvm.tests.regression.h3121.H3121 FAILED
Test org.apache.harmony.drlvm.tests.regression.h3150.Test FAILED
Test org.apache.harmony.drlvm.tests.regression.h3175.Test FAILED
Test org.apache.harmony.drlvm.tests.regression.h3216.ASETest FAILED
Test org.apache.harmony.drlvm.tests.regression.h3283.JavaLibraryPathTest FAILED
Test org.apache.harmony.drlvm.tests.regression.h3285.Test FAILED
Test org.apache.harmony.drlvm.tests.regression.h3652.Test FAILED
Test org.apache.harmony.drlvm.tests.regression.h3691.Test FAILED
Test org.apache.harmony.drlvm.tests.regression.h3738.Test FAILED
Test org.apache.harmony.drlvm.tests.regression.h3751.Test FAILED
Test org.apache.harmony.drlvm.tests.regression.h3954.Test FAILED
Configuration:
     Hosting Java = 1.5.0_09 (Sun Microsystems Inc.)
    classlib root = /export/cruise/trunk/cc/projects/classlib/trunk
               os = Linux
             arch = em64t
              cxx = gcc
              cfg = debug
     svn revision = ${svn.revision}
       components = deploy

=====================================
DRLVM Regression Testing on platform: linux.x86_64
=====================================
        
SIGSEGV in VM code.
Stack trace:
  0: ?? (??:-1)
  1: java/lang/reflect/VMReflection.newClassInstance(J[Ljava/lang/Object;)Ljava/lang/Object;
(VMReflection.java:-2)
  2: java/lang/reflect/Constructor.newInstance([Ljava/lang/Object;)Ljava/lang/Object; (Constructor.java:299)
  3: java/lang/Class.newInstance()Ljava/lang/Object; (Class.java:718)
  4: org/apache/tools/ant/taskdefs/optional/junit/FormatterElement.createFormatter(Ljava/lang/ClassLoader;)Lorg/apache/tools/ant/taskdefs/optional/junit/JUnitResultFormatter;
(FormatterElement.java:218)
  5: org/apache/tools/ant/taskdefs/optional/junit/FormatterElement.createFormatter()Lorg/apache/tools/ant/taskdefs/optional/junit/JUnitResultFormatter;
(FormatterElement.java:-1)
  6: org/apache/tools/ant/taskdefs/optional/junit/JUnitTestRunner.transferFormatters(Lorg/apache/tools/ant/taskdefs/optional/junit/JUnitTestRunner;Lorg/apache/tools/ant/taskdefs/optional/junit/JUnitTest;)V
(JUnitTestRunner.java:-1)
  7: org/apache/tools/ant/taskdefs/optional/junit/JUnitTestRunner.launch(Lorg/apache/tools/ant/taskdefs/optional/junit/JUnitTest;ZZZZLjava/util/Properties;)I
(JUnitTestRunner.java:670)
  8: org/apache/tools/ant/taskdefs/optional/junit/JUnitTestRunner.main([Ljava/lang/String;)V
(JUnitTestRunner.java:567)
<end of stack trace>
SIGSEGV in VM code.
Stack trace:
  0: ?? (??:-1)
  1: java/lang/reflect/VMReflection.newClassInstance(J[Ljava/lang/Object;)Ljava/lang/Object;
(VMReflection.java:-2)
  2: java/lang/reflect/Constructor.newInstance([Ljava/lang/Object;)Ljava/lang/Object; (Constructor.java:299)
  3: java/lang/Class.newInstance()Ljava/lang/Object; (Class.java:718)
  4: org/apache/tools/ant/taskdefs/optional/junit/FormatterElement.createFormatter(Ljava/lang/ClassLoader;)Lorg/apache/tools/ant/taskdefs/optional/junit/JUnitResultFormatter;
(FormatterElement.java:218)
  5: org/apache/tools/ant/taskdefs/optional/junit/FormatterElement.createFormatter()Lorg/apache/tools/ant/taskdefs/optional/junit/JUnitResultFormatter;
(FormatterElement.java:-1)
  6: org/apache/tools/ant/taskdefs/optional/junit/JUnitTestRunner.transferFormatters(Lorg/apache/tools/ant/taskdefs/optional/junit/JUnitTestRunner;Lorg/apache/tools/ant/taskdefs/optional/junit/JUnitTest;)V
(JUnitTestRunner.java:-1)
  7: org/apache/tools/ant/taskdefs/optional/junit/JUnitTestRunner.launch(Lorg/apache/tools/ant/taskdefs/optional/junit/JUnitTest;ZZZZLjava/util/Properties;)I
(JUnitTestRunner.java:670)
  8: org/apache/tools/ant/taskdefs/optional/junit/JUnitTestRunner.main([Ljava/lang/String;)V
(JUnitTestRunner.java:567)
<end of stack trace>
SIGSEGV in VM code.
Stack trace:
  0: ?? (??:-1)
  1: java/lang/reflect/VMReflection.newClassInstance(J[Ljava/lang/Object;)Ljava/lang/Object;
(VMReflection.java:-2)
  2: java/lang/reflect/Constructor.newInstance([Ljava/lang/Object;)Ljava/lang/Object; (Constructor.java:299)
  3: java/lang/Class.newInstance()Ljava/lang/Object; (Class.java:718)
  4: org/apache/tools/ant/taskdefs/optional/junit/FormatterElement.createFormatter(Ljava/lang/ClassLoader;)Lorg/apache/tools/ant/taskdefs/optional/junit/JUnitResultFormatter;
(FormatterElement.java:218)
  5: org/apache/tools/ant/taskdefs/optional/junit/FormatterElement.createFormatter()Lorg/apache/tools/ant/taskdefs/optional/junit/JUnitResultFormatter;
(FormatterElement.java:-1)
  6: org/apache/tools/ant/taskdefs/optional/junit/JUnitTestRunner.transferFormatters(Lorg/apache/tools/ant/taskdefs/optional/junit/JUnitTestRunner;Lorg/apache/tools/ant/taskdefs/optional/junit/JUnitTest;)V
(JUnitTestRunner.java:-1)
  7: org/apache/tools/ant/taskdefs/optional/junit/JUnitTestRunner.launch(Lorg/apache/tools/ant/taskdefs/optional/junit/JUnitTest;ZZZZLjava/util/Properties;)I
(JUnitTestRunner.java:670)
  8: org/apache/tools/ant/taskdefs/optional/junit/JUnitTestRunner.main([Ljava/lang/String;)V
(JUnitTestRunner.java:567)
<end of stack trace>
SIGSEGV in VM code.
Stack trace:
  0: ?? (??:-1)
  1: java/lang/reflect/VMReflection.newClassInstance(J[Ljava/lang/Object;)Ljava/lang/Object;
(VMReflection.java:-2)
  2: java/lang/reflect/Constructor.newInstance([Ljava/lang/Object;)Ljava/lang/Object; (Constructor.java:299)
  3: java/lang/Class.newInstance()Ljava/lang/Object; (Class.java:718)
  4: org/apache/tools/ant/taskdefs/optional/junit/FormatterElement.createFormatter(Ljava/lang/ClassLoader;)Lorg/apache/tools/ant/taskdefs/optional/junit/JUnitResultFormatter;
(FormatterElement.java:218)
  5: org/apache/tools/ant/taskdefs/optional/junit/FormatterElement.createFormatter()Lorg/apache/tools/ant/taskdefs/optional/junit/JUnitResultFormatter;
(FormatterElement.java:-1)
  6: org/apache/tools/ant/taskdefs/optional/junit/JUnitTestRunner.transferFormatters(Lorg/apache/tools/ant/taskdefs/optional/junit/JUnitTestRunner;Lorg/apache/tools/ant/taskdefs/optional/junit/JUnitTest;)V
(JUnitTestRunner.java:-1)
  7: org/apache/tools/ant/taskdefs/optional/junit/JUnitTestRunner.launch(Lorg/apache/tools/ant/taskdefs/optional/junit/JUnitTest;ZZZZLjava/util/Properties;)I
(JUnitTestRunner.java:670)
  8: org/apache/tools/ant/taskdefs/optional/junit/JUnitTestRunner.main([Ljava/lang/String;)V
(JUnitTestRunner.java:567)
<end of stack trace>
The GC did not provide gc_add_weak_root_set_entry()
SIGSEGV in VM code.
Stack trace:
  0: ?? (??:-1)
  1: java/lang/reflect/VMReflection.newClassInstance(J[Ljava/lang/Object;)Ljava/lang/Object;
(VMReflection.java:-2)
  2: java/lang/reflect/Constructor.newInstance([Ljava/lang/Object;)Ljava/lang/Object; (Constructor.java:299)
  3: java/lang/Class.newInstance()Ljava/lang/Object; (Class.java:718)
  4: org/apache/tools/ant/taskdefs/optional/junit/FormatterElement.createFormatter(Ljava/lang/ClassLoader;)Lorg/apache/tools/ant/taskdefs/optional/junit/JUnitResultFormatter;
(FormatterElement.java:218)
  5: org/apache/tools/ant/taskdefs/optional/junit/FormatterElement.createFormatter()Lorg/apache/tools/ant/taskdefs/optional/junit/JUnitResultFormatter;
(FormatterElement.java:-1)
  6: org/apache/tools/ant/taskdefs/optional/junit/JUnitTestRunner.transferFormatters(Lorg/apache/tools/ant/taskdefs/optional/junit/JUnitTestRunner;Lorg/apache/tools/ant/taskdefs/optional/junit/JUnitTest;)V
(JUnitTestRunner.java:-1)
  7: org/apache/tools/ant/taskdefs/optional/junit/JUnitTestRunner.launch(Lorg/apache/tools/ant/taskdefs/optional/junit/JUnitTest;ZZZZLjava/util/Properties;)I
(JUnitTestRunner.java:670)
  8: org/apache/tools/ant/taskdefs/optional/junit/JUnitTestRunner.main([Ljava/lang/String;)V
(JUnitTestRunner.java:567)
<end of stack trace>
Running on JET
vf_debug: VerifyError: (class: org/apache/harmony/drlvm/tests/regression/h2103/SupClass, method:
test()I) Incompatible object argument for invokespecial
SIGSEGV in VM code.
Stack trace:
  0: ?? (??:-1)
  1: java/lang/reflect/VMReflection.newClassInstance(J[Ljava/lang/Object;)Ljava/lang/Object;
(VMReflection.java:-2)
  2: java/lang/reflect/Constructor.newInstance([Ljava/lang/Object;)Ljava/lang/Object; (Constructor.java:299)
  3: java/lang/Class.newInstance()Ljava/lang/Object; (Class.java:718)
  4: org/apache/tools/ant/taskdefs/optional/junit/FormatterElement.createFormatter(Ljava/lang/ClassLoader;)Lorg/apache/tools/ant/taskdefs/optional/junit/JUnitResultFormatter;
(FormatterElement.java:218)
  5: org/apache/tools/ant/taskdefs/optional/junit/FormatterElement.createFormatter()Lorg/apache/tools/ant/taskdefs/optional/junit/JUnitResultFormatter;
(FormatterElement.java:-1)
  6: org/apache/tools/ant/taskdefs/optional/junit/JUnitTestRunner.transferFormatters(Lorg/apache/tools/ant/taskdefs/optional/junit/JUnitTestRunner;Lorg/apache/tools/ant/taskdefs/optional/junit/JUnitTest;)V
(JUnitTestRunner.java:-1)
  7: org/apache/tools/ant/taskdefs/optional/junit/JUnitTestRunner.launch(Lorg/apache/tools/ant/taskdefs/optional/junit/JUnitTest;ZZZZLjava/util/Properties;)I
(JUnitTestRunner.java:670)
  8: org/apache/tools/ant/taskdefs/optional/junit/JUnitTestRunner.main([Ljava/lang/String;)V
(JUnitTestRunner.java:567)
<end of stack trace>
SIGSEGV in VM code.
Stack trace:
  0: ?? (??:-1)
  1: java/lang/reflect/VMReflection.newClassInstance(J[Ljava/lang/Object;)Ljava/lang/Object;
(VMReflection.java:-2)
  2: java/lang/reflect/Constructor.newInstance([Ljava/lang/Object;)Ljava/lang/Object; (Constructor.java:299)
  3: java/lang/Class.newInstance()Ljava/lang/Object; (Class.java:718)
  4: org/apache/tools/ant/taskdefs/optional/junit/FormatterElement.createFormatter(Ljava/lang/ClassLoader;)Lorg/apache/tools/ant/taskdefs/optional/junit/JUnitResultFormatter;
(FormatterElement.java:218)
  5: org/apache/tools/ant/taskdefs/optional/junit/FormatterElement.createFormatter()Lorg/apache/tools/ant/taskdefs/optional/junit/JUnitResultFormatter;
(FormatterElement.java:-1)
  6: org/apache/tools/ant/taskdefs/optional/junit/JUnitTestRunner.transferFormatters(Lorg/apache/tools/ant/taskdefs/optional/junit/JUnitTestRunner;Lorg/apache/tools/ant/taskdefs/optional/junit/JUnitTest;)V
(JUnitTestRunner.java:-1)
  7: org/apache/tools/ant/taskdefs/optional/junit/JUnitTestRunner.launch(Lorg/apache/tools/ant/taskdefs/optional/junit/JUnitTest;ZZZZLjava/util/Properties;)I
(JUnitTestRunner.java:670)
  8: org/apache/tools/ant/taskdefs/optional/junit/JUnitTestRunner.main([Ljava/lang/String;)V
(JUnitTestRunner.java:567)
<end of stack trace>
SIGSEGV in VM code.
Stack trace:
  0: ?? (??:-1)
  1: java/lang/reflect/VMReflection.newClassInstance(J[Ljava/lang/Object;)Ljava/lang/Object;
(VMReflection.java:-2)
  2: java/lang/reflect/Constructor.newInstance([Ljava/lang/Object;)Ljava/lang/Object; (Constructor.java:299)
  3: java/lang/Class.newInstance()Ljava/lang/Object; (Class.java:718)
  4: org/apache/tools/ant/taskdefs/optional/junit/FormatterElement.createFormatter(Ljava/lang/ClassLoader;)Lorg/apache/tools/ant/taskdefs/optional/junit/JUnitResultFormatter;
(FormatterElement.java:218)
  5: org/apache/tools/ant/taskdefs/optional/junit/FormatterElement.createFormatter()Lorg/apache/tools/ant/taskdefs/optional/junit/JUnitResultFormatter;
(FormatterElement.java:-1)
  6: org/apache/tools/ant/taskdefs/optional/junit/JUnitTestRunner.transferFormatters(Lorg/apache/tools/ant/taskdefs/optional/junit/JUnitTestRunner;Lorg/apache/tools/ant/taskdefs/optional/junit/JUnitTest;)V
(JUnitTestRunner.java:-1)
  7: org/apache/tools/ant/taskdefs/optional/junit/JUnitTestRunner.launch(Lorg/apache/tools/ant/taskdefs/optional/junit/JUnitTest;ZZZZLjava/util/Properties;)I
(JUnitTestRunner.java:670)
  8: org/apache/tools/ant/taskdefs/optional/junit/JUnitTestRunner.main([Ljava/lang/String;)V
(JUnitTestRunner.java:567)
<end of stack trace>
vf_debug: verifying class org/apache/harmony/drlvm/tests/regression/h2808/finTest1 (method
test()V) couldn't load class "org/apache/harmony/drlvm/tests/regression/h2808/finTest2"
vf_debug: VerifyError: Couldn't load class: org/apache/harmony/drlvm/tests/regression/h2808/finTest2
SIGSEGV in VM code.
Stack trace:
  0: ?? (??:-1)
  1: java/lang/reflect/VMReflection.newClassInstance(J[Ljava/lang/Object;)Ljava/lang/Object;
(VMReflection.java:-2)
  2: java/lang/reflect/Constructor.newInstance([Ljava/lang/Object;)Ljava/lang/Object; (Constructor.java:299)
  3: java/lang/Class.newInstance()Ljava/lang/Object; (Class.java:718)
  4: org/apache/tools/ant/taskdefs/optional/junit/FormatterElement.createFormatter(Ljava/lang/ClassLoader;)Lorg/apache/tools/ant/taskdefs/optional/junit/JUnitResultFormatter;
(FormatterElement.java:218)
  5: org/apache/tools/ant/taskdefs/optional/junit/FormatterElement.createFormatter()Lorg/apache/tools/ant/taskdefs/optional/junit/JUnitResultFormatter;
(FormatterElement.java:-1)
  6: org/apache/tools/ant/taskdefs/optional/junit/JUnitTestRunner.transferFormatters(Lorg/apache/tools/ant/taskdefs/optional/junit/JUnitTestRunner;Lorg/apache/tools/ant/taskdefs/optional/junit/JUnitTest;)V
(JUnitTestRunner.java:-1)
  7: org/apache/tools/ant/taskdefs/optional/junit/JUnitTestRunner.launch(Lorg/apache/tools/ant/taskdefs/optional/junit/JUnitTest;ZZZZLjava/util/Properties;)I
(JUnitTestRunner.java:670)
  8: org/apache/tools/ant/taskdefs/optional/junit/JUnitTestRunner.main([Ljava/lang/String;)V
(JUnitTestRunner.java:567)
<end of stack trace>
SIGSEGV in VM code.
Stack trace:
  0: ?? (??:-1)
  1: java/lang/reflect/VMReflection.newClassInstance(J[Ljava/lang/Object;)Ljava/lang/Object;
(VMReflection.java:-2)
  2: java/lang/reflect/Constructor.newInstance([Ljava/lang/Object;)Ljava/lang/Object; (Constructor.java:299)
  3: java/lang/Class.newInstance()Ljava/lang/Object; (Class.java:718)
  4: org/apache/tools/ant/taskdefs/optional/junit/FormatterElement.createFormatter(Ljava/lang/ClassLoader;)Lorg/apache/tools/ant/taskdefs/optional/junit/JUnitResultFormatter;
(FormatterElement.java:218)
  5: org/apache/tools/ant/taskdefs/optional/junit/FormatterElement.createFormatter()Lorg/apache/tools/ant/taskdefs/optional/junit/JUnitResultFormatter;
(FormatterElement.java:-1)
  6: org/apache/tools/ant/taskdefs/optional/junit/JUnitTestRunner.transferFormatters(Lorg/apache/tools/ant/taskdefs/optional/junit/JUnitTestRunner;Lorg/apache/tools/ant/taskdefs/optional/junit/JUnitTest;)V
(JUnitTestRunner.java:-1)
  7: org/apache/tools/ant/taskdefs/optional/junit/JUnitTestRunner.launch(Lorg/apache/tools/ant/taskdefs/optional/junit/JUnitTest;ZZZZLjava/util/Properties;)I
(JUnitTestRunner.java:670)
  8: org/apache/tools/ant/taskdefs/optional/junit/JUnitTestRunner.main([Ljava/lang/String;)V
(JUnitTestRunner.java:567)
<end of stack trace>
vf_debug: verifying class org/apache/harmony/drlvm/tests/regression/h3048/MyTestSuper (method
<clinit>()V) couldn't load class "org/apache/harmony/drlvm/tests/regression/h3048/MyException"
vf_debug: VerifyError: Couldn't load class: org/apache/harmony/drlvm/tests/regression/h3048/MyException
SIGSEGV in VM code.
Stack trace:
  0: ?? (??:-1)
  1: java/lang/reflect/VMReflection.newClassInstance(J[Ljava/lang/Object;)Ljava/lang/Object;
(VMReflection.java:-2)
  2: java/lang/reflect/Constructor.newInstance([Ljava/lang/Object;)Ljava/lang/Object; (Constructor.java:299)
  3: java/lang/Class.newInstance()Ljava/lang/Object; (Class.java:718)
  4: org/apache/tools/ant/taskdefs/optional/junit/FormatterElement.createFormatter(Ljava/lang/ClassLoader;)Lorg/apache/tools/ant/taskdefs/optional/junit/JUnitResultFormatter;
(FormatterElement.java:218)
  5: org/apache/tools/ant/taskdefs/optional/junit/FormatterElement.createFormatter()Lorg/apache/tools/ant/taskdefs/optional/junit/JUnitResultFormatter;
(FormatterElement.java:-1)
  6: org/apache/tools/ant/taskdefs/optional/junit/JUnitTestRunner.transferFormatters(Lorg/apache/tools/ant/taskdefs/optional/junit/JUnitTestRunner;Lorg/apache/tools/ant/taskdefs/optional/junit/JUnitTest;)V
(JUnitTestRunner.java:-1)
  7: org/apache/tools/ant/taskdefs/optional/junit/JUnitTestRunner.launch(Lorg/apache/tools/ant/taskdefs/optional/junit/JUnitTest;ZZZZLjava/util/Properties;)I
(JUnitTestRunner.java:670)
  8: org/apache/tools/ant/taskdefs/optional/junit/JUnitTestRunner.main([Ljava/lang/String;)V
(JUnitTestRunner.java:567)
<end of stack trace>
SIGSEGV in VM code.
Stack trace:
  0: ?? (??:-1)
  1: java/lang/reflect/VMReflection.newClassInstance(J[Ljava/lang/Object;)Ljava/lang/Object;
(VMReflection.java:-2)
  2: java/lang/reflect/Constructor.newInstance([Ljava/lang/Object;)Ljava/lang/Object; (Constructor.java:299)
  3: java/lang/Class.newInstance()Ljava/lang/Object; (Class.java:718)
  4: org/apache/tools/ant/taskdefs/optional/junit/FormatterElement.createFormatter(Ljava/lang/ClassLoader;)Lorg/apache/tools/ant/taskdefs/optional/junit/JUnitResultFormatter;
(FormatterElement.java:218)
  5: org/apache/tools/ant/taskdefs/optional/junit/FormatterElement.createFormatter()Lorg/apache/tools/ant/taskdefs/optional/junit/JUnitResultFormatter;
(FormatterElement.java:-1)
  6: org/apache/tools/ant/taskdefs/optional/junit/JUnitTestRunner.transferFormatters(Lorg/apache/tools/ant/taskdefs/optional/junit/JUnitTestRunner;Lorg/apache/tools/ant/taskdefs/optional/junit/JUnitTest;)V
(JUnitTestRunner.java:-1)
  7: org/apache/tools/ant/taskdefs/optional/junit/JUnitTestRunner.launch(Lorg/apache/tools/ant/taskdefs/optional/junit/JUnitTest;ZZZZLjava/util/Properties;)I
(JUnitTestRunner.java:670)
  8: org/apache/tools/ant/taskdefs/optional/junit/JUnitTestRunner.main([Ljava/lang/String;)V
(JUnitTestRunner.java:567)
<end of stack trace>
Running on OPT
SIGSEGV in VM code.
Stack trace:
  0: ?? (??:-1)
  1: java/lang/reflect/VMReflection.newClassInstance(J[Ljava/lang/Object;)Ljava/lang/Object;
(VMReflection.java:-2)
  2: java/lang/reflect/Constructor.newInstance([Ljava/lang/Object;)Ljava/lang/Object; (Constructor.java:299)
  3: java/lang/Class.newInstance()Ljava/lang/Object; (Class.java:718)
  4: org/apache/tools/ant/taskdefs/optional/junit/FormatterElement.createFormatter(Ljava/lang/ClassLoader;)Lorg/apache/tools/ant/taskdefs/optional/junit/JUnitResultFormatter;
(FormatterElement.java:218)
  5: org/apache/tools/ant/taskdefs/optional/junit/FormatterElement.createFormatter()Lorg/apache/tools/ant/taskdefs/optional/junit/JUnitResultFormatter;
(FormatterElement.java:-1)
  6: org/apache/tools/ant/taskdefs/optional/junit/JUnitTestRunner.transferFormatters(Lorg/apache/tools/ant/taskdefs/optional/junit/JUnitTestRunner;Lorg/apache/tools/ant/taskdefs/optional/junit/JUnitTest;)V
(JUnitTestRunner.java:-1)
  7: org/apache/tools/ant/taskdefs/optional/junit/JUnitTestRunner.launch(Lorg/apache/tools/ant/taskdefs/optional/junit/JUnitTest;ZZZZLjava/util/Properties;)I
(JUnitTestRunner.java:670)
  8: org/apache/tools/ant/taskdefs/optional/junit/JUnitTestRunner.main([Ljava/lang/String;)V
(JUnitTestRunner.java:567)
<end of stack trace>
Running on OPT
SIGSEGV in VM code.
Stack trace:
  0: ?? (??:-1)
  1: java/lang/reflect/VMReflection.newClassInstance(J[Ljava/lang/Object;)Ljava/lang/Object;
(VMReflection.java:-2)
  2: java/lang/reflect/Constructor.newInstance([Ljava/lang/Object;)Ljava/lang/Object; (Constructor.java:299)
  3: java/lang/Class.newInstance()Ljava/lang/Object; (Class.java:718)
  4: org/apache/tools/ant/taskdefs/optional/junit/FormatterElement.createFormatter(Ljava/lang/ClassLoader;)Lorg/apache/tools/ant/taskdefs/optional/junit/JUnitResultFormatter;
(FormatterElement.java:218)
  5: org/apache/tools/ant/taskdefs/optional/junit/FormatterElement.createFormatter()Lorg/apache/tools/ant/taskdefs/optional/junit/JUnitResultFormatter;
(FormatterElement.java:-1)
  6: org/apache/tools/ant/taskdefs/optional/junit/JUnitTestRunner.transferFormatters(Lorg/apache/tools/ant/taskdefs/optional/junit/JUnitTestRunner;Lorg/apache/tools/ant/taskdefs/optional/junit/JUnitTest;)V
(JUnitTestRunner.java:-1)
  7: org/apache/tools/ant/taskdefs/optional/junit/JUnitTestRunner.launch(Lorg/apache/tools/ant/taskdefs/optional/junit/JUnitTest;ZZZZLjava/util/Properties;)I
(JUnitTestRunner.java:670)
  8: org/apache/tools/ant/taskdefs/optional/junit/JUnitTestRunner.main([Ljava/lang/String;)V
(JUnitTestRunner.java:567)
<end of stack trace>
SIGSEGV in VM code.
Stack trace:
  0: ?? (??:-1)
  1: java/lang/reflect/VMReflection.newClassInstance(J[Ljava/lang/Object;)Ljava/lang/Object;
(VMReflection.java:-2)
  2: java/lang/reflect/Constructor.newInstance([Ljava/lang/Object;)Ljava/lang/Object; (Constructor.java:299)
  3: java/lang/Class.newInstance()Ljava/lang/Object; (Class.java:718)
  4: org/apache/tools/ant/taskdefs/optional/junit/FormatterElement.createFormatter(Ljava/lang/ClassLoader;)Lorg/apache/tools/ant/taskdefs/optional/junit/JUnitResultFormatter;
(FormatterElement.java:218)
  5: org/apache/tools/ant/taskdefs/optional/junit/FormatterElement.createFormatter()Lorg/apache/tools/ant/taskdefs/optional/junit/JUnitResultFormatter;
(FormatterElement.java:-1)
  6: org/apache/tools/ant/taskdefs/optional/junit/JUnitTestRunner.transferFormatters(Lorg/apache/tools/ant/taskdefs/optional/junit/JUnitTestRunner;Lorg/apache/tools/ant/taskdefs/optional/junit/JUnitTest;)V
(JUnitTestRunner.java:-1)
  7: org/apache/tools/ant/taskdefs/optional/junit/JUnitTestRunner.launch(Lorg/apache/tools/ant/taskdefs/optional/junit/JUnitTest;ZZZZLjava/util/Properties;)I
(JUnitTestRunner.java:670)
  8: org/apache/tools/ant/taskdefs/optional/junit/JUnitTestRunner.main([Ljava/lang/String;)V
(JUnitTestRunner.java:567)
<end of stack trace>
SIGSEGV in VM code.
Stack trace:
  0: ?? (??:-1)
  1: java/lang/reflect/VMReflection.newClassInstance(J[Ljava/lang/Object;)Ljava/lang/Object;
(VMReflection.java:-2)
  2: java/lang/reflect/Constructor.newInstance([Ljava/lang/Object;)Ljava/lang/Object; (Constructor.java:299)
  3: java/lang/Class.newInstance()Ljava/lang/Object; (Class.java:718)
  4: org/apache/tools/ant/taskdefs/optional/junit/FormatterElement.createFormatter(Ljava/lang/ClassLoader;)Lorg/apache/tools/ant/taskdefs/optional/junit/JUnitResultFormatter;
(FormatterElement.java:218)
  5: org/apache/tools/ant/taskdefs/optional/junit/FormatterElement.createFormatter()Lorg/apache/tools/ant/taskdefs/optional/junit/JUnitResultFormatter;
(FormatterElement.java:-1)
  6: org/apache/tools/ant/taskdefs/optional/junit/JUnitTestRunner.transferFormatters(Lorg/apache/tools/ant/taskdefs/optional/junit/JUnitTestRunner;Lorg/apache/tools/ant/taskdefs/optional/junit/JUnitTest;)V
(JUnitTestRunner.java:-1)
  7: org/apache/tools/ant/taskdefs/optional/junit/JUnitTestRunner.launch(Lorg/apache/tools/ant/taskdefs/optional/junit/JUnitTest;ZZZZLjava/util/Properties;)I
(JUnitTestRunner.java:670)
  8: org/apache/tools/ant/taskdefs/optional/junit/JUnitTestRunner.main([Ljava/lang/String;)V
(JUnitTestRunner.java:567)
<end of stack trace>
SIGSEGV in VM code.
Stack trace:
  0: ?? (??:-1)
  1: java/lang/reflect/VMReflection.newClassInstance(J[Ljava/lang/Object;)Ljava/lang/Object;
(VMReflection.java:-2)
  2: java/lang/reflect/Constructor.newInstance([Ljava/lang/Object;)Ljava/lang/Object; (Constructor.java:299)
  3: java/lang/Class.newInstance()Ljava/lang/Object; (Class.java:718)
  4: org/apache/tools/ant/taskdefs/optional/junit/FormatterElement.createFormatter(Ljava/lang/ClassLoader;)Lorg/apache/tools/ant/taskdefs/optional/junit/JUnitResultFormatter;
(FormatterElement.java:218)
  5: org/apache/tools/ant/taskdefs/optional/junit/FormatterElement.createFormatter()Lorg/apache/tools/ant/taskdefs/optional/junit/JUnitResultFormatter;
(FormatterElement.java:-1)
  6: org/apache/tools/ant/taskdefs/optional/junit/JUnitTestRunner.transferFormatters(Lorg/apache/tools/ant/taskdefs/optional/junit/JUnitTestRunner;Lorg/apache/tools/ant/taskdefs/optional/junit/JUnitTest;)V
(JUnitTestRunner.java:-1)
  7: org/apache/tools/ant/taskdefs/optional/junit/JUnitTestRunner.launch(Lorg/apache/tools/ant/taskdefs/optional/junit/JUnitTest;ZZZZLjava/util/Properties;)I
(JUnitTestRunner.java:670)
  8: org/apache/tools/ant/taskdefs/optional/junit/JUnitTestRunner.main([Ljava/lang/String;)V
(JUnitTestRunner.java:567)
<end of stack trace>
SIGSEGV in VM code.
Stack trace:
  0: ?? (??:-1)
  1: java/lang/reflect/VMReflection.newClassInstance(J[Ljava/lang/Object;)Ljava/lang/Object;
(VMReflection.java:-2)
  2: java/lang/reflect/Constructor.newInstance([Ljava/lang/Object;)Ljava/lang/Object; (Constructor.java:299)
  3: java/lang/Class.newInstance()Ljava/lang/Object; (Class.java:718)
  4: org/apache/tools/ant/taskdefs/optional/junit/FormatterElement.createFormatter(Ljava/lang/ClassLoader;)Lorg/apache/tools/ant/taskdefs/optional/junit/JUnitResultFormatter;
(FormatterElement.java:218)
  5: org/apache/tools/ant/taskdefs/optional/junit/FormatterElement.createFormatter()Lorg/apache/tools/ant/taskdefs/optional/junit/JUnitResultFormatter;
(FormatterElement.java:-1)
  6: org/apache/tools/ant/taskdefs/optional/junit/JUnitTestRunner.transferFormatters(Lorg/apache/tools/ant/taskdefs/optional/junit/JUnitTestRunner;Lorg/apache/tools/ant/taskdefs/optional/junit/JUnitTest;)V
(JUnitTestRunner.java:-1)
  7: org/apache/tools/ant/taskdefs/optional/junit/JUnitTestRunner.launch(Lorg/apache/tools/ant/taskdefs/optional/junit/JUnitTest;ZZZZLjava/util/Properties;)I
(JUnitTestRunner.java:670)
  8: org/apache/tools/ant/taskdefs/optional/junit/JUnitTestRunner.main([Ljava/lang/String;)V
(JUnitTestRunner.java:567)
<end of stack trace>
SIGSEGV in VM code.
Stack trace:
  0: ?? (??:-1)
  1: java/lang/reflect/VMReflection.newClassInstance(J[Ljava/lang/Object;)Ljava/lang/Object;
(VMReflection.java:-2)
  2: java/lang/reflect/Constructor.newInstance([Ljava/lang/Object;)Ljava/lang/Object; (Constructor.java:299)
  3: java/lang/Class.newInstance()Ljava/lang/Object; (Class.java:718)
  4: org/apache/tools/ant/taskdefs/optional/junit/FormatterElement.createFormatter(Ljava/lang/ClassLoader;)Lorg/apache/tools/ant/taskdefs/optional/junit/JUnitResultFormatter;
(FormatterElement.java:218)
  5: org/apache/tools/ant/taskdefs/optional/junit/FormatterElement.createFormatter()Lorg/apache/tools/ant/taskdefs/optional/junit/JUnitResultFormatter;
(FormatterElement.java:-1)
  6: org/apache/tools/ant/taskdefs/optional/junit/JUnitTestRunner.transferFormatters(Lorg/apache/tools/ant/taskdefs/optional/junit/JUnitTestRunner;Lorg/apache/tools/ant/taskdefs/optional/junit/JUnitTest;)V
(JUnitTestRunner.java:-1)
  7: org/apache/tools/ant/taskdefs/optional/junit/JUnitTestRunner.launch(Lorg/apache/tools/ant/taskdefs/optional/junit/JUnitTest;ZZZZLjava/util/Properties;)I
(JUnitTestRunner.java:670)
  8: org/apache/tools/ant/taskdefs/optional/junit/JUnitTestRunner.main([Ljava/lang/String;)V
(JUnitTestRunner.java:567)
<end of stack trace>
SIGSEGV in VM code.
Stack trace:
  0: ?? (??:-1)
  1: java/lang/reflect/VMReflection.newClassInstance(J[Ljava/lang/Object;)Ljava/lang/Object;
(VMReflection.java:-2)
  2: java/lang/reflect/Constructor.newInstance([Ljava/lang/Object;)Ljava/lang/Object; (Constructor.java:299)
  3: java/lang/Class.newInstance()Ljava/lang/Object; (Class.java:718)
  4: org/apache/tools/ant/taskdefs/optional/junit/FormatterElement.createFormatter(Ljava/lang/ClassLoader;)Lorg/apache/tools/ant/taskdefs/optional/junit/JUnitResultFormatter;
(FormatterElement.java:218)
  5: org/apache/tools/ant/taskdefs/optional/junit/FormatterElement.createFormatter()Lorg/apache/tools/ant/taskdefs/optional/junit/JUnitResultFormatter;
(FormatterElement.java:-1)
  6: org/apache/tools/ant/taskdefs/optional/junit/JUnitTestRunner.transferFormatters(Lorg/apache/tools/ant/taskdefs/optional/junit/JUnitTestRunner;Lorg/apache/tools/ant/taskdefs/optional/junit/JUnitTest;)V
(JUnitTestRunner.java:-1)
  7: org/apache/tools/ant/taskdefs/optional/junit/JUnitTestRunner.launch(Lorg/apache/tools/ant/taskdefs/optional/junit/JUnitTest;ZZZZLjava/util/Properties;)I
(JUnitTestRunner.java:670)
  8: org/apache/tools/ant/taskdefs/optional/junit/JUnitTestRunner.main([Ljava/lang/String;)V
(JUnitTestRunner.java:567)
<end of stack trace>
SIGSEGV in VM code.
Stack trace:
  0: ?? (??:-1)
  1: java/lang/reflect/VMReflection.newClassInstance(J[Ljava/lang/Object;)Ljava/lang/Object;
(VMReflection.java:-2)
  2: java/lang/reflect/Constructor.newInstance([Ljava/lang/Object;)Ljava/lang/Object; (Constructor.java:299)
  3: java/lang/Class.newInstance()Ljava/lang/Object; (Class.java:718)
  4: org/apache/tools/ant/taskdefs/optional/junit/FormatterElement.createFormatter(Ljava/lang/ClassLoader;)Lorg/apache/tools/ant/taskdefs/optional/junit/JUnitResultFormatter;
(FormatterElement.java:218)
  5: org/apache/tools/ant/taskdefs/optional/junit/FormatterElement.createFormatter()Lorg/apache/tools/ant/taskdefs/optional/junit/JUnitResultFormatter;
(FormatterElement.java:-1)
  6: org/apache/tools/ant/taskdefs/optional/junit/JUnitTestRunner.transferFormatters(Lorg/apache/tools/ant/taskdefs/optional/junit/JUnitTestRunner;Lorg/apache/tools/ant/taskdefs/optional/junit/JUnitTest;)V
(JUnitTestRunner.java:-1)
  7: org/apache/tools/ant/taskdefs/optional/junit/JUnitTestRunner.launch(Lorg/apache/tools/ant/taskdefs/optional/junit/JUnitTest;ZZZZLjava/util/Properties;)I
(JUnitTestRunner.java:670)
  8: org/apache/tools/ant/taskdefs/optional/junit/JUnitTestRunner.main([Ljava/lang/String;)V
(JUnitTestRunner.java:567)
<end of stack trace>
SIGSEGV in VM code.
Stack trace:
  0: ?? (??:-1)
  1: java/lang/reflect/VMReflection.newClassInstance(J[Ljava/lang/Object;)Ljava/lang/Object;
(VMReflection.java:-2)
  2: java/lang/reflect/Constructor.newInstance([Ljava/lang/Object;)Ljava/lang/Object; (Constructor.java:299)
  3: java/lang/Class.newInstance()Ljava/lang/Object; (Class.java:718)
  4: org/apache/tools/ant/taskdefs/optional/junit/FormatterElement.createFormatter(Ljava/lang/ClassLoader;)Lorg/apache/tools/ant/taskdefs/optional/junit/JUnitResultFormatter;
(FormatterElement.java:218)
  5: org/apache/tools/ant/taskdefs/optional/junit/FormatterElement.createFormatter()Lorg/apache/tools/ant/taskdefs/optional/junit/JUnitResultFormatter;
(FormatterElement.java:-1)
  6: org/apache/tools/ant/taskdefs/optional/junit/JUnitTestRunner.transferFormatters(Lorg/apache/tools/ant/taskdefs/optional/junit/JUnitTestRunner;Lorg/apache/tools/ant/taskdefs/optional/junit/JUnitTest;)V
(JUnitTestRunner.java:-1)
  7: org/apache/tools/ant/taskdefs/optional/junit/JUnitTestRunner.launch(Lorg/apache/tools/ant/taskdefs/optional/junit/JUnitTest;ZZZZLjava/util/Properties;)I
(JUnitTestRunner.java:670)
  8: org/apache/tools/ant/taskdefs/optional/junit/JUnitTestRunner.main([Ljava/lang/String;)V
(JUnitTestRunner.java:567)
<end of stack trace>
========================================
Regression testing report was stored in:
========================================
/export/cruise/trunk/cc/projects/drlvm/trunk/build/lnx_em64t_gcc_debug/semis/reg.tests/reports/html
========================================

***********************************************************
Unit Tests: (38)
        

***********************************************************
Modifications since last successful build:	(16)
            
add cc-drlvm log20070525143716Lbuild.749 05/25/2007 14:37:16drlvm
modified varlax  /harmony/enhanced/drlvm/trunk/build/make/components/vm/jitrino.xml 05/25/2007
13:14:02 Applied HARMONY-3651 [drlvm][jit] Very slow compilation in Jitrino on Windows x86-64.
modified varlax  /harmony/enhanced/drlvm/trunk/vm/em/src/DrlEMImpl.cpp 05/25/2007 13:08:05
Applied HARMONY-3714 [drlvm][em] Known/proven race condition markup 
added varlax  /harmony/enhanced/drlvm/trunk/src/test/regression/H2057/SyncTest.java 05/25/2007
13:00:17 Applied HARMONY-2057 [drlvm][jit] Jitrino.OPT's bpp.version=6 algorithm (the default)
considers that all VM helpers are interruptable.
added varlax  /harmony/enhanced/drlvm/trunk/src/test/regression/H2057 05/25/2007 13:00:17
Applied HARMONY-2057 [drlvm][jit] Jitrino.OPT's bpp.version=6 algorithm (the default) considers
that all VM helpers are interruptable.
modified varlax  /harmony/enhanced/drlvm/trunk/vm/jitrino/src/codegenerator/ia32/Ia32IRManager.cpp
05/25/2007 13:00:17 Applied HARMONY-2057 [drlvm][jit] Jitrino.OPT's bpp.version=6 algorithm
(the default) considers that all VM helpers are interruptable.
added varlax  /harmony/enhanced/drlvm/trunk/src/test/regression/H2057/run.test.xml 05/25/2007
13:00:17 Applied HARMONY-2057 [drlvm][jit] Jitrino.OPT's bpp.version=6 algorithm (the default)
considers that all VM helpers are interruptable.
modified varlax  /harmony/enhanced/drlvm/trunk/vm/jitrino/src/codegenerator/ia32/Ia32BBPolling.cpp
05/25/2007 13:00:17 Applied HARMONY-2057 [drlvm][jit] Jitrino.OPT's bpp.version=6 algorithm
(the default) considers that all VM helpers are interruptable.
modified varlax  /harmony/enhanced/drlvm/trunk/vm/include/jit_runtime_support.h 05/25/2007
13:00:17 Applied HARMONY-2057 [drlvm][jit] Jitrino.OPT's bpp.version=6 algorithm (the default)
considers that all VM helpers are interruptable.
modified varlax  /harmony/enhanced/drlvm/trunk/vm/jitrino/src/vm/drl/DrlVMInterface.cpp 05/25/2007
13:00:17 Applied HARMONY-2057 [drlvm][jit] Jitrino.OPT's bpp.version=6 algorithm (the default)
considers that all VM helpers are interruptable.
modified varlax  /harmony/enhanced/drlvm/trunk/vm/vmcore/src/jit/jit_runtime_support.cpp 05/25/2007
13:00:17 Applied HARMONY-2057 [drlvm][jit] Jitrino.OPT's bpp.version=6 algorithm (the default)
considers that all VM helpers are interruptable.
modified varlax  /harmony/enhanced/drlvm/trunk/vm/jitrino/src/vm/VMInterface.h 05/25/2007
13:00:17 Applied HARMONY-2057 [drlvm][jit] Jitrino.OPT's bpp.version=6 algorithm (the default)
considers that all VM helpers are interruptable.
modified varlax  /harmony/enhanced/drlvm/trunk/vm/jitrino/src/codegenerator/ia32/Ia32InstCodeSelector.cpp
05/25/2007 12:46:38 Applied HARMONY-3954 [drlvm][jit] Jitrino.OPT arraycopy optimization fails
when Class[] array is used
added varlax  /harmony/enhanced/drlvm/trunk/src/test/regression/H3954/Test.java 05/25/2007
12:46:38 Applied HARMONY-3954 [drlvm][jit] Jitrino.OPT arraycopy optimization fails when Class[]
array is used
added varlax  /harmony/enhanced/drlvm/trunk/src/test/regression/H3954 05/25/2007 12:46:38
Applied HARMONY-3954 [drlvm][jit] Jitrino.OPT arraycopy optimization fails when Class[] array
is used
added varlax  /harmony/enhanced/drlvm/trunk/src/test/regression/H3954/run.test.xml 05/25/2007
12:46:38 Applied HARMONY-3954 [drlvm][jit] Jitrino.OPT arraycopy optimization fails when Class[]
array is used

Mime
View raw message