harmony-alerts mailing list archives

Site index · List index
Message view « Date » · « Thread »
Top « Date » · « Thread »
From nom...@intel.com
Subject [build-test alert] BUILD FAILED Linux SUSE 9 gcc debug: drlvm test
Date Wed, 23 May 2007 16:00:00 GMT
BUILD FAILED:
	Ant Error Message:
/export/cruise/trunk/cc/projects/drlvm/trunk/build/make/build.xml:400: The following error occurred while executing this line: /export/cruise/trunk/cc/projects/drlvm/trunk/build/make/build_component.xml:73: The following error occurred while executing this line: /export/cruise/trunk/cc/projects/drlvm/trunk/build/lnx_ia32_gcc_debug/semis/build/targets/test.xml:6: Some tests failed

Date of build:	05/23/2007 21:45:02
Time to build:	74 minutes 35 seconds
Last changed:	05/23/2007 21:31:24
Last log entry:	Fixed compilation on gcc 4.1.1 after HARMONY-3874 was committed. The redundant initialization of helperArgs causes compiler to report a warning



***********************************************************
Execution log (errors/warnings messages):	
Test PopFrame1.PopFrame1 FAILED
Test SingleStep1.SingleStep1 FAILED
Test VMInit1.VMInit1 FAILED
Test Breakpoint1.Breakpoint1 FAILED
Test PopFrame1.PopFrame1 FAILED
Test SingleStep1.SingleStep1 FAILED
Test VMInit1.VMInit1 FAILED
Test Breakpoint1.Breakpoint1 FAILED
Test PopFrame1.PopFrame1 FAILED
Test SingleStep1.SingleStep1 FAILED
Test VMInit1.VMInit1 FAILED
/usr/lib/gcc-lib/i586-suse-linux/3.3.3/../../../../i586-suse-linux/bin/ld: warning: libhysig.so, needed by /export/cruise/trunk/cc/projects/classlib/trunk/deploy/jdk/jre/bin/libhyzlib.so, not found (try using -rpath or -rpath-link)
/usr/lib/gcc-lib/i586-suse-linux/3.3.3/../../../../i586-suse-linux/bin/ld: warning: libhysig.so, needed by /export/cruise/trunk/cc/projects/classlib/trunk/deploy/jdk/jre/bin/libhyzlib.so, not found (try using -rpath or -rpath-link)
/usr/lib/gcc-lib/i586-suse-linux/3.3.3/../../../../i586-suse-linux/bin/ld: warning: libhysig.so, needed by /export/cruise/trunk/cc/projects/classlib/trunk/deploy/jdk/jre/bin/libhyzlib.so, not found (try using -rpath or -rpath-link)
/usr/lib/gcc-lib/i586-suse-linux/3.3.3/../../../../i586-suse-linux/bin/ld: warning: libhysig.so, needed by /export/cruise/trunk/cc/projects/classlib/trunk/deploy/jdk/jre/bin/libhyzlib.so, not found (try using -rpath or -rpath-link)
/usr/lib/gcc-lib/i586-suse-linux/3.3.3/../../../../i586-suse-linux/bin/ld: warning: libhysig.so, needed by /export/cruise/trunk/cc/projects/classlib/trunk/deploy/jdk/jre/bin/libhyzlib.so, not found (try using -rpath or -rpath-link)
/usr/lib/gcc-lib/i586-suse-linux/3.3.3/../../../../i586-suse-linux/bin/ld: warning: libhysig.so, needed by /export/cruise/trunk/cc/projects/classlib/trunk/deploy/jdk/jre/bin/libhyzlib.so, not found (try using -rpath or -rpath-link)
/usr/lib/gcc-lib/i586-suse-linux/3.3.3/../../../../i586-suse-linux/bin/ld: warning: libhysig.so, needed by /export/cruise/trunk/cc/projects/classlib/trunk/deploy/jdk/jre/bin/libhyzlib.so, not found (try using -rpath or -rpath-link)
/usr/lib/gcc-lib/i586-suse-linux/3.3.3/../../../../i586-suse-linux/bin/ld: warning: libhysig.so, needed by /export/cruise/trunk/cc/projects/classlib/trunk/deploy/jdk/jre/bin/libhyzlib.so, not found (try using -rpath or -rpath-link)
/usr/lib/gcc-lib/i586-suse-linux/3.3.3/../../../../i586-suse-linux/bin/ld: warning: libhysig.so, needed by /export/cruise/trunk/cc/projects/classlib/trunk/deploy/jdk/jre/bin/libhyzlib.so, not found (try using -rpath or -rpath-link)
/usr/lib/gcc-lib/i586-suse-linux/3.3.3/../../../../i586-suse-linux/bin/ld: warning: libhysig.so, needed by /export/cruise/trunk/cc/projects/classlib/trunk/deploy/jdk/jre/bin/libhyzlib.so, not found (try using -rpath or -rpath-link)
/usr/lib/gcc-lib/i586-suse-linux/3.3.3/../../../../i586-suse-linux/bin/ld: warning: libhysig.so, needed by /export/cruise/trunk/cc/projects/classlib/trunk/deploy/jdk/jre/bin/libhyzlib.so, not found (try using -rpath or -rpath-link)
/usr/lib/gcc-lib/i586-suse-linux/3.3.3/../../../../i586-suse-linux/bin/ld: warning: libhysig.so, needed by /export/cruise/trunk/cc/projects/classlib/trunk/deploy/jdk/jre/bin/libhyzlib.so, not found (try using -rpath or -rpath-link)
/usr/lib/gcc-lib/i586-suse-linux/3.3.3/../../../../i586-suse-linux/bin/ld: warning: libhysig.so, needed by /export/cruise/trunk/cc/projects/classlib/trunk/deploy/jdk/jre/bin/libhyzlib.so, not found (try using -rpath or -rpath-link)
/usr/lib/gcc-lib/i586-suse-linux/3.3.3/../../../../i586-suse-linux/bin/ld: warning: libhysig.so, needed by /export/cruise/trunk/cc/projects/classlib/trunk/deploy/jdk/jre/bin/libhyzlib.so, not found (try using -rpath or -rpath-link)
/usr/lib/gcc-lib/i586-suse-linux/3.3.3/../../../../i586-suse-linux/bin/ld: warning: libhysig.so, needed by /export/cruise/trunk/cc/projects/classlib/trunk/deploy/jdk/jre/bin/libhyzlib.so, not found (try using -rpath or -rpath-link)
/usr/lib/gcc-lib/i586-suse-linux/3.3.3/../../../../i586-suse-linux/bin/ld: warning: libhysig.so, needed by /export/cruise/trunk/cc/projects/classlib/trunk/deploy/jdk/jre/bin/libhyzlib.so, not found (try using -rpath or -rpath-link)
/usr/lib/gcc-lib/i586-suse-linux/3.3.3/../../../../i586-suse-linux/bin/ld: warning: libhysig.so, needed by /export/cruise/trunk/cc/projects/classlib/trunk/deploy/jdk/jre/bin/libhyzlib.so, not found (try using -rpath or -rpath-link)
/usr/lib/gcc-lib/i586-suse-linux/3.3.3/../../../../i586-suse-linux/bin/ld: warning: libhysig.so, needed by /export/cruise/trunk/cc/projects/classlib/trunk/deploy/jdk/jre/bin/libhyzlib.so, not found (try using -rpath or -rpath-link)
/usr/lib/gcc-lib/i586-suse-linux/3.3.3/../../../../i586-suse-linux/bin/ld: warning: libhysig.so, needed by /export/cruise/trunk/cc/projects/classlib/trunk/deploy/jdk/jre/bin/libhyzlib.so, not found (try using -rpath or -rpath-link)
/export/cruise/trunk/cc/projects/drlvm/trunk/vm/tests/smoke/shutdown/TestFatalError.c:7:2: warning: no newline at end of file
/export/cruise/trunk/cc/projects/drlvm/trunk/vm/tests/smoke/shutdown/TestInterrupt.c:24:7: warning: no newline at end of file
Java Result: 134
Java Result: 134
Java Result: 134
Java Result: 134
Java Result: 134
Java Result: 134
Java Result: 134
Java Result: 134
Java Result: 134
Java Result: 134
Java Result: 134
Java Result: 134
Java Result: 134
Java Result: 134
Java Result: 134
Java Result: 134
Java Result: 134
Java Result: 134
Java Result: 134
Java Result: 134
Java Result: 134
Java Result: 134
Java Result: 134
Java Result: 134
Java Result: 134
Java Result: 134
Java Result: 134
Java Result: 134
Java Result: 134
Java Result: 134
Java Result: 134
Java Result: 134
Java Result: 134
Java Result: 134
Java Result: 134
Java Result: 134
Java Result: 134
Java Result: 134
Java Result: 134
Java Result: 134
Java Result: 134
Java Result: 134
Java Result: 134
Java Result: 134
Java Result: 134
Java Result: 134
Java Result: 134
Java Result: 134
Java Result: 134
Java Result: 134
Java Result: 134
Java Result: 134
Java Result: 134
Java Result: 134
Java Result: 134
Java Result: 134
Java Result: 134
Java Result: 134
Java Result: 134
Java Result: 134
Java Result: 134
Java Result: 134
Java Result: 134
Java Result: 134
Java Result: 134
Java Result: 134
Java Result: 134
Java Result: 134
Java Result: 134
Java Result: 134
Java Result: 134
Java Result: 134
Java Result: 134
Java Result: 134
Java Result: 134
Java Result: 134
Java Result: 134
Java Result: 134
Java Result: 134
Java Result: 134
Java Result: 134
Java Result: 134
Java Result: 134
Java Result: 134
Java Result: 134
Java Result: 134
Java Result: 134
Java Result: 134
Java Result: 134
Java Result: 134
Java Result: 134
Java Result: 134
Java Result: 134
Java Result: 134
Java Result: 134
Java Result: 134
Java Result: 134
Java Result: 134
Java Result: 134
Java Result: 134
Java Result: 134
Java Result: 134
Java Result: 134
Java Result: 134
Java Result: 134
Java Result: 134
Java Result: 134
Java Result: 134
Java Result: 134
Java Result: 134
Java Result: 134
Java Result: 134
Java Result: 134
Java Result: 134
Java Result: 134
Java Result: 134
Java Result: 134
Java Result: 134
Java Result: 134
Java Result: 134
Java Result: 134
Java Result: 134
Java Result: 134
Java Result: 134
Java Result: 134
Java Result: 134
Java Result: 134
Java Result: 134
Java Result: 134
Java Result: 134
Java Result: 134
Java Result: 134
Java Result: 134
Java Result: 134
Java Result: 134
Java Result: 134
Java Result: 134
Java Result: 134
Java Result: 134
Java Result: 134
Java Result: 134
Java Result: 134
Java Result: 134
Java Result: 134
Java Result: 134
Java Result: 134
Java Result: 134
Java Result: 134
Java Result: 134
Java Result: 134
Java Result: 134
Java Result: 134
Java Result: 134
Java Result: 134
Java Result: 134
Java Result: 134
Java Result: 134
Java Result: 134
Java Result: 134
Java Result: 134
Java Result: 134
Java Result: 134
Java Result: 134
Java Result: 134
Java Result: 134
Java Result: 134
Java Result: 134
Java Result: 134
Java Result: 134
Java Result: 134
Java Result: 134
Java Result: 134
Java Result: 134
Java Result: 134
Java Result: 134
Java Result: 134
Java Result: 134
Java Result: 134
Java Result: 134
Java Result: 134
Java Result: 134
Java Result: 134
Java Result: 134
Java Result: 134
Java Result: 134
Java Result: 134
Java Result: 134
Java Result: 134
Java Result: 134
Java Result: 134
Java Result: 134
Java Result: 134
Java Result: 134
Java Result: 134
Java Result: 134
Java Result: 134
Java Result: 134
Java Result: 134
Java Result: 134
Java Result: 134
Java Result: 134
Java Result: 134
Java Result: 134
Java Result: 134
Java Result: 134
Java Result: 134
Java Result: 134
Java Result: 134
Java Result: 134
Java Result: 134
Java Result: 134
Java Result: 134
Java Result: 134
Java Result: 134
Java Result: 134
Java Result: 134
Java Result: 134
Java Result: 134
Java Result: 134
Java Result: 134
Java Result: 134
Java Result: 134
Java Result: 134
Java Result: 134
Java Result: 134
Java Result: 134
Java Result: 134
Java Result: 134
Java Result: 134
Java Result: 134
Java Result: 134
Java Result: 134
Java Result: 134
Java Result: 134
Java Result: 134
Java Result: 134
Java Result: 134
Java Result: 134
Java Result: 134
Java Result: 134
Java Result: 134
Java Result: 134
Java Result: 134
Java Result: 134
Java Result: 134
Java Result: 134
Java Result: 134
Java Result: 134
Java Result: 134
Java Result: 134
Java Result: 134
Java Result: 134
Java Result: 134
Java Result: 134
Java Result: 134
Java Result: 134
Java Result: 134
Java Result: 134
Java Result: 134
Java Result: 134
Java Result: 134
Java Result: 134
Java Result: 134
Java Result: 134
Java Result: 134
Java Result: 134
Java Result: 134
Java Result: 134
Java Result: 134
Java Result: 134
Java Result: 134
Java Result: 134
Java Result: 134
Java Result: 134
Java Result: 134
Java Result: 134
Java Result: 134
Java Result: 134
Java Result: 134
Java Result: 134
Java Result: 134
Java Result: 134
Java Result: 134
Java Result: 134
Java Result: 134
Java Result: 134
Java Result: 134
Java Result: 134
Java Result: 134
Java Result: 134
Java Result: 134
Java Result: 134
Java Result: 134
Java Result: 134
Java Result: 134
Java Result: 134
Java Result: 134
Java Result: 134
Java Result: 134
Java Result: 134
Java Result: 134
Java Result: 134
Java Result: 134
Java Result: 134
Java Result: 134
Java Result: 134
Java Result: 134
Java Result: 134
Java Result: 134
Java Result: 134
Java Result: 134
Java Result: 134
Java Result: 134
Java Result: 134
Java Result: 134
Java Result: 134
Java Result: 134
Java Result: 134
Java Result: 134
Java Result: 134
Java Result: 134
Java Result: 134
Java Result: 134
Java Result: 134
Java Result: 134
Java Result: 134
Java Result: 134
Java Result: 134
Java Result: 134
Java Result: 134
Java Result: 134
Java Result: 134
Java Result: 134
Java Result: 134
Java Result: 134
Java Result: 134
Java Result: 134
Java Result: 134
Java Result: 134
Java Result: 134
Java Result: 134
Java Result: 134
Java Result: 134
Java Result: 134
Java Result: 134
Java Result: 134
Java Result: 134
Java Result: 134
Java Result: 134
Java Result: 134
Java Result: 134
Java Result: 134
Java Result: 134
Java Result: 134
Tests FAILED
Tests FAILED
Tests FAILED
Tests FAILED
Tests FAILED
 Using CLASSLIB = /export/cruise/trunk/cc/projects/classlib/trunk
jars: true
using proxy settings: proxy.ims.intel.com port:911
Configuration:
     Hosting Java = 1.5.0_08 (Sun Microsystems Inc.)
    classlib root = /export/cruise/trunk/cc/projects/classlib/trunk
               os = Linux
             arch = ia32
              cxx = gcc
              cfg = debug
     svn revision = 540957
       components = deploy
## Compiling JVMTI natives in: /export/cruise/trunk/cc/projects/drlvm/trunk/vm/tests/jvmti/Breakpoint1
## Compiling JVMTI natives in: /export/cruise/trunk/cc/projects/drlvm/trunk/vm/tests/jvmti/PopFrame1
## Compiling JVMTI natives in: /export/cruise/trunk/cc/projects/drlvm/trunk/vm/tests/jvmti/SingleStep1
## Compiling JVMTI natives in: /export/cruise/trunk/cc/projects/drlvm/trunk/vm/tests/jvmti/VMInit1

        ==================================
        Run JVMTI tests using interpreter
        ==================================
        
Running Breakpoint1
java: /export/cruise/trunk/cc/projects/drlvm/trunk/vm/vmcore/src/class_support/classloader.cpp:365: Class* ClassLoader::LoadVerifyAndPrepareClass(Global_Env*, const String*): Assertion `hythread_is_suspend_enabled()' failed.
SIGABRT in VM code.
Stack trace:
  0: ?? (??:-1)
  1: abort (??:-1)
  2: __assert_fail (??:-1)
  3: ClassLoader::LoadVerifyAndPrepareClass(Global_Env*, String const*) (/export/cruise/trunk/cc/projects/drlvm/trunk/vm/vmcore/src/class_support/classloader.cpp:367)
  4: Global_Env::LoadCoreClass(String const*) (/export/cruise/trunk/cc/projects/drlvm/trunk/vm/vmcore/src/class_support/Environment.cpp:280)
  5: Global_Env::LoadCoreClass(char const*) (/export/cruise/trunk/cc/projects/drlvm/trunk/vm/vmcore/src/class_support/Environment.cpp:292)
  6: getClassRegistryMethod (/export/cruise/trunk/cc/projects/drlvm/trunk/vm/vmcore/src/class_support/classloader.cpp:1601)
  7: ClassLoader::InsertClass(Class*) (/export/cruise/trunk/cc/projects/drlvm/trunk/vm/vmcore/src/class_support/classloader.cpp:1645)
  8: ClassLoader::DefineClass(Global_Env*, char const*, unsigned char*, unsigned int, unsigned int, String const**) (/export/cruise/trunk/cc/projects/drlvm/trunk/vm/vmcore/src/class_support/classloader.cpp:317)
  9: DefineClass(JNIEnv_External*, char const*, _jobject*, signed char const*, int) (/export/cruise/trunk/cc/projects/drlvm/trunk/vm/vmcore/src/jni/jni.cpp:603)
 10: Java_java_lang_ClassLoader_defineClass0 (/export/cruise/trunk/cc/projects/drlvm/trunk/vm/vmcore/src/kernel_classes/native/java_lang_VMClassRegistry.cpp:64)
 11: invokeJNI (/export/cruise/trunk/cc/projects/drlvm/trunk/vm/interpreter/src/invokeJNI_ia32.asm:37)
 12: interpreterInvokeVirtualNative(StackFrame&, StackFrame&, Method*, int) (/export/cruise/trunk/cc/projects/drlvm/trunk/vm/interpreter/src/interp_native_ia32.cpp:605)
 13: interpreterInvokeSpecial (/export/cruise/trunk/cc/projects/drlvm/trunk/vm/interpreter/src/interpreter.cpp:3578)
 14: Opcode_INVOKESPECIAL(StackFrame&) (/export/cruise/trunk/cc/projects/drlvm/trunk/vm/interpreter/src/interpreter.cpp:2125)
 15: java/lang/ClassLoader.defineClass(Ljava/lang/String;[BIILjava/security/ProtectionDomain;)Ljava/lang/Class; (ClassLoader.java:436)
 16: interpreterInvoke (/export/cruise/trunk/cc/projects/drlvm/trunk/vm/interpreter/src/interpreter.cpp:3406)
 17: interpreterInvokeVirtual (/export/cruise/trunk/cc/projects/drlvm/trunk/vm/interpreter/src/interpreter.cpp:3488)
 18: Opcode_INVOKEVIRTUAL(StackFrame&) (/export/cruise/trunk/cc/projects/drlvm/trunk/vm/interpreter/src/interpreter.cpp:2060)
 19: java/security/SecureClassLoader.defineClass(Ljava/lang/String;[BIILjava/security/CodeSource;)Ljava/lang/Class; (SecureClassLoader.java:70)
 20: interpreterInvoke (/export/cruise/trunk/cc/projects/drlvm/trunk/vm/interpreter/src/interpreter.cpp:3406)
 21: interpreterInvokeVirtual (/export/cruise/trunk/cc/projects/drlvm/trunk/vm/interpreter/src/interpreter.cpp:3488)
 22: Opcode_INVOKEVIRTUAL(StackFrame&) (/export/cruise/trunk/cc/projects/drlvm/trunk/vm/interpreter/src/interpreter.cpp:2060)
 23: java/net/URLClassLoader.findClassImpl([Ljava/net/URL;Ljava/lang/String;)Ljava/lang/Class; (URLClassLoader.java:1214)
 24: interpreterInvoke (/export/cruise/trunk/cc/projects/drlvm/trunk/vm/interpreter/src/interpreter.cpp:3406)
 25: interpreterInvokeVirtual (/export/cruise/trunk/cc/projects/drlvm/trunk/vm/interpreter/src/interpreter.cpp:3488)
 26: Opcode_INVOKEVIRTUAL(StackFrame&) (/export/cruise/trunk/cc/projects/drlvm/trunk/vm/interpreter/src/interpreter.cpp:2060)
 27: java/net/URLClassLoader$4.run()Ljava/lang/Class; (URLClassLoader.java:625)
 28: interpreterInvoke (/export/cruise/trunk/cc/projects/drlvm/trunk/vm/interpreter/src/interpreter.cpp:3406)
 29: interpreterInvokeVirtual (/export/cruise/trunk/cc/projects/drlvm/trunk/vm/interpreter/src/interpreter.cpp:3488)
 30: Opcode_INVOKEVIRTUAL(StackFrame&) (/export/cruise/trunk/cc/projects/drlvm/trunk/vm/interpreter/src/interpreter.cpp:2060)
 31: java/net/URLClassLoader$4.run()Ljava/lang/Object; (URLClassLoader.java:1)
 32: interpreterInvoke (/export/cruise/trunk/cc/projects/drlvm/trunk/vm/interpreter/src/interpreter.cpp:3406)
 33: interpreterInvokeInterface (/export/cruise/trunk/cc/projects/drlvm/trunk/vm/interpreter/src/interpreter.cpp:3543)
 34: Opcode_INVOKEINTERFACE(StackFrame&) (/export/cruise/trunk/cc/projects/drlvm/trunk/vm/interpreter/src/interpreter.cpp:2080)
 35: java/security/AccessController.doPrivilegedImpl(Ljava/security/PrivilegedAction;Ljava/security/AccessControlContext;)Ljava/lang/Object; (AccessController.java:173)
 36: interpreterInvokeStatic (/export/cruise/trunk/cc/projects/drlvm/trunk/vm/interpreter/src/interpreter.cpp:3316)
 37: Opcode_INVOKESTATIC(StackFrame&) (/export/cruise/trunk/cc/projects/drlvm/trunk/vm/interpreter/src/interpreter.cpp:2104)
 38: java/security/AccessController.doPrivileged(Ljava/security/PrivilegedAction;Ljava/security/AccessControlContext;)Ljava/lang/Object; (AccessController.java:64)
 39: interpreterInvokeStatic (/export/cruise/trunk/cc/projects/drlvm/trunk/vm/interpreter/src/interpreter.cpp:3316)
 40: Opcode_INVOKESTATIC(StackFrame&) (/export/cruise/trunk/cc/projects/drlvm/trunk/vm/interpreter/src/interpreter.cpp:2104)
 41: java/net/URLClassLoader.findClass(Ljava/lang/String;)Ljava/lang/Class; (URLClassLoader.java:622)
 42: interpreterInvoke (/export/cruise/trunk/cc/projects/drlvm/trunk/vm/interpreter/src/interpreter.cpp:3406)
 43: interpreterInvokeVirtual (/export/cruise/trunk/cc/projects/drlvm/trunk/vm/interpreter/src/interpreter.cpp:3488)
 44: Opcode_INVOKEVIRTUAL(StackFrame&) (/export/cruise/trunk/cc/projects/drlvm/trunk/vm/interpreter/src/interpreter.cpp:2060)
 45: java/lang/ClassLoader.loadClass(Ljava/lang/String;Z)Ljava/lang/Class; (ClassLoader.java:574)
 46: interpreterInvokeSpecial (/export/cruise/trunk/cc/projects/drlvm/trunk/vm/interpreter/src/interpreter.cpp:3602)
 47: Opcode_INVOKESPECIAL(StackFrame&) (/export/cruise/trunk/cc/projects/drlvm/trunk/vm/interpreter/src/interpreter.cpp:2125)
 48: java/lang/ClassLoader$SystemClassLoader.loadClass(Ljava/lang/String;Z)Ljava/lang/Class; (ClassLoader.java:962)
 49: interpreterInvoke (/export/cruise/trunk/cc/projects/drlvm/trunk/vm/interpreter/src/interpreter.cpp:3406)
 50: interpreterInvokeVirtual (/export/cruise/trunk/cc/projects/drlvm/trunk/vm/interpreter/src/interpreter.cpp:3488)
 51: Opcode_INVOKEVIRTUAL(StackFrame&) (/export/cruise/trunk/cc/projects/drlvm/trunk/vm/interpreter/src/interpreter.cpp:2060)
 52: java/lang/ClassLoader.loadClass(Ljava/lang/String;)Ljava/lang/Class; (ClassLoader.java:319)
 53: interpreter_execute_method(Method*, jvalue*, jvalue*) (/export/cruise/trunk/cc/projects/drlvm/trunk/vm/interpreter/src/interpreter.cpp:3209)
 54: JIT_execute_method (/export/cruise/trunk/cc/projects/drlvm/trunk/vm/interpreter/src/interp_exports.cpp:166)
 55: DrlEMImpl::executeMethod(_jmethodID*, jvalue*, jvalue*) (/export/cruise/trunk/cc/projects/drlvm/trunk/vm/em/src/DrlEMImpl.cpp:509)
 56: ExecuteMethod (/export/cruise/trunk/cc/projects/drlvm/trunk/vm/em/src/em_intf.cpp:43)
 57: vm_execute_java_method_array(_jmethodID*, jvalue*, jvalue*) (/export/cruise/trunk/cc/projects/drlvm/trunk/vm/vmcore/src/jit/ini.cpp:60)
 58: UserDefinedClassLoader::DoLoadClass(Global_Env*, String const*) (/export/cruise/trunk/cc/projects/drlvm/trunk/vm/vmcore/src/class_support/classloader.cpp:1534)
 59: ClassLoader::LoadClass(Global_Env*, String const*) (/export/cruise/trunk/cc/projects/drlvm/trunk/vm/vmcore/src/class_support/classloader.cpp:1400)
 60: ClassLoader::LoadVerifyAndPrepareClass(Global_Env*, String const*) (/export/cruise/trunk/cc/projects/drlvm/trunk/vm/vmcore/src/class_support/classloader.cpp:367)
 61: Class::load_ancestors(Global_Env*) (/export/cruise/trunk/cc/projects/drlvm/trunk/vm/vmcore/src/class_support/Class.cpp:326)
 62: ClassLoader::DefineClass(Global_Env*, char const*, unsigned char*, unsigned int, unsigned int, String const**) (/export/cruise/trunk/cc/projects/drlvm/trunk/vm/vmcore/src/class_support/classloader.cpp:312)
 63: DefineClass(JNIEnv_External*, char const*, _jobject*, signed char const*, int) (/export/cruise/trunk/cc/projects/drlvm/trunk/vm/vmcore/src/jni/jni.cpp:603)
 64: Java_java_lang_ClassLoader_defineClass0 (/export/cruise/trunk/cc/projects/drlvm/trunk/vm/vmcore/src/kernel_classes/native/java_lang_VMClassRegistry.cpp:64)
 65: invokeJNI (/export/cruise/trunk/cc/projects/drlvm/trunk/vm/interpreter/src/invokeJNI_ia32.asm:37)
 66: interpreterInvokeVirtualNative(StackFrame&, StackFrame&, Method*, int) (/export/cruise/trunk/cc/projects/drlvm/trunk/vm/interpreter/src/interp_native_ia32.cpp:605)
 67: interpreterInvokeSpecial (/export/cruise/trunk/cc/projects/drlvm/trunk/vm/interpreter/src/interpreter.cpp:3578)
 68: Opcode_INVOKESPECIAL(StackFrame&) (/export/cruise/trunk/cc/projects/drlvm/trunk/vm/interpreter/src/interpreter.cpp:2125)
 69: java/lang/ClassLoader.defineClass(Ljava/lang/String;[BIILjava/security/ProtectionDomain;)Ljava/lang/Class; (ClassLoader.java:436)
 70: interpreterInvoke (/export/cruise/trunk/cc/projects/drlvm/trunk/vm/interpreter/src/interpreter.cpp:3406)
 71: interpreterInvokeVirtual (/export/cruise/trunk/cc/projects/drlvm/trunk/vm/interpreter/src/interpreter.cpp:3488)
 72: Opcode_INVOKEVIRTUAL(StackFrame&) (/export/cruise/trunk/cc/projects/drlvm/trunk/vm/interpreter/src/interpreter.cpp:2060)
 73: java/security/SecureClassLoader.defineClass(Ljava/lang/String;[BIILjava/security/CodeSource;)Ljava/lang/Class; (SecureClassLoader.java:70)
 74: interpreterInvoke (/export/cruise/trunk/cc/projects/drlvm/trunk/vm/interpreter/src/interpreter.cpp:3406)
 75: interpreterInvokeVirtual (/export/cruise/trunk/cc/projects/drlvm/trunk/vm/interpreter/src/interpreter.cpp:3488)
 76: Opcode_INVOKEVIRTUAL(StackFrame&) (/export/cruise/trunk/cc/projects/drlvm/trunk/vm/interpreter/src/interpreter.cpp:2060)
 77: java/net/URLClassLoader.findClassImpl([Ljava/net/URL;Ljava/lang/String;)Ljava/lang/Class; (URLClassLoader.java:1214)
 78: interpreterInvoke (/export/cruise/trunk/cc/projects/drlvm/trunk/vm/interpreter/src/interpreter.cpp:3406)
 79: interpreterInvokeVirtual (/export/cruise/trunk/cc/projects/drlvm/trunk/vm/interpreter/src/interpreter.cpp:3488)
 80: Opcode_INVOKEVIRTUAL(StackFrame&) (/export/cruise/trunk/cc/projects/drlvm/trunk/vm/interpreter/src/interpreter.cpp:2060)
 81: java/net/URLClassLoader$4.run()Ljava/lang/Class; (URLClassLoader.java:625)
 82: interpreterInvoke (/export/cruise/trunk/cc/projects/drlvm/trunk/vm/interpreter/src/interpreter.cpp:3406)
 83: interpreterInvokeVirtual (/export/cruise/trunk/cc/projects/drlvm/trunk/vm/interpreter/src/interpreter.cpp:3488)
 84: Opcode_INVOKEVIRTUAL(StackFrame&) (/export/cruise/trunk/cc/projects/drlvm/trunk/vm/interpreter/src/interpreter.cpp:2060)
 85: java/net/URLClassLoader$4.run()Ljava/lang/Object; (URLClassLoader.java:1)
 86: interpreterInvoke (/export/cruise/trunk/cc/projects/drlvm/trunk/vm/interpreter/src/interpreter.cpp:3406)
 87: interpreterInvokeInterface (/export/cruise/trunk/cc/projects/drlvm/trunk/vm/interpreter/src/interpreter.cpp:3543)
 88: Opcode_INVOKEINTERFACE(StackFrame&) (/export/cruise/trunk/cc/projects/drlvm/trunk/vm/interpreter/src/interpreter.cpp:2080)
 89: java/security/AccessController.doPrivilegedImpl(Ljava/security/PrivilegedAction;Ljava/security/AccessControlContext;)Ljava/lang/Object; (AccessController.java:173)
 90: interpreterInvokeStatic (/export/cruise/trunk/cc/projects/drlvm/trunk/vm/interpreter/src/interpreter.cpp:3316)
 91: Opcode_INVOKESTATIC(StackFrame&) (/export/cruise/trunk/cc/projects/drlvm/trunk/vm/interpreter/src/interpreter.cpp:2104)
 92: java/security/AccessController.doPrivileged(Ljava/security/PrivilegedAction;Ljava/security/AccessControlContext;)Ljava/lang/Object; (AccessController.java:64)
 93: interpreterInvokeStatic (/export/cruise/trunk/cc/projects/drlvm/trunk/vm/interpreter/src/interpreter.cpp:3316)
 94: Opcode_INVOKESTATIC(StackFrame&) (/export/cruise/trunk/cc/projects/drlvm/trunk/vm/interpreter/src/interpreter.cpp:2104)
 95: java/net/URLClassLoader.findClass(Ljava/lang/String;)Ljava/lang/Class; (URLClassLoader.java:622)
 96: interpreterInvoke (/export/cruise/trunk/cc/projects/drlvm/trunk/vm/interpreter/src/interpreter.cpp:3406)
 97: interpreterInvokeVirtual (/export/cruise/trunk/cc/projects/drlvm/trunk/vm/interpreter/src/interpreter.cpp:3488)
 98: Opcode_INVOKEVIRTUAL(StackFrame&) (/export/cruise/trunk/cc/projects/drlvm/trunk/vm/interpreter/src/interpreter.cpp:2060)
 99: java/lang/ClassLoader.loadClass(Ljava/lang/String;Z)Ljava/lang/Class; (ClassLoader.java:574)
100: interpreterInvokeSpecial (/export/cruise/trunk/cc/projects/drlvm/trunk/vm/interpreter/src/interpreter.cpp:3602)
101: Opcode_INVOKESPECIAL(StackFrame&) (/export/cruise/trunk/cc/projects/drlvm/trunk/vm/interpreter/src/interpreter.cpp:2125)
102: java/lang/ClassLoader$SystemClassLoader.loadClass(Ljava/lang/String;Z)Ljava/lang/Class; (ClassLoader.java:962)
103: interpreterInvoke (/export/cruise/trunk/cc/projects/drlvm/trunk/vm/interpreter/src/interpreter.cpp:3406)
104: interpreterInvokeVirtual (/export/cruise/trunk/cc/projects/drlvm/trunk/vm/interpreter/src/interpreter.cpp:3488)
105: Opcode_INVOKEVIRTUAL(StackFrame&) (/export/cruise/trunk/cc/projects/drlvm/trunk/vm/interpreter/src/interpreter.cpp:2060)
106: java/lang/ClassLoader.loadClass(Ljava/lang/String;)Ljava/lang/Class; (ClassLoader.java:319)
107: interpreter_execute_method(Method*, jvalue*, jvalue*) (/export/cruise/trunk/cc/projects/drlvm/trunk/vm/interpreter/src/interpreter.cpp:3209)
108: JIT_execute_method (/export/cruise/trunk/cc/projects/drlvm/trunk/vm/interpreter/src/interp_exports.cpp:166)
109: DrlEMImpl::executeMethod(_jmethodID*, jvalue*, jvalue*) (/export/cruise/trunk/cc/projects/drlvm/trunk/vm/em/src/DrlEMImpl.cpp:509)
110: ExecuteMethod (/export/cruise/trunk/cc/projects/drlvm/trunk/vm/em/src/em_intf.cpp:43)
111: vm_execute_java_method_array(_jmethodID*, jvalue*, jvalue*) (/export/cruise/trunk/cc/projects/drlvm/trunk/vm/vmcore/src/jit/ini.cpp:60)
112: UserDefinedClassLoader::DoLoadClass(Global_Env*, String const*) (/export/cruise/trunk/cc/projects/drlvm/trunk/vm/vmcore/src/class_support/classloader.cpp:1534)
113: ClassLoader::LoadClass(Global_Env*, String const*) (/export/cruise/trunk/cc/projects/drlvm/trunk/vm/vmcore/src/class_support/classloader.cpp:1400)
114: ClassLoader::LoadVerifyAndPrepareClass(Global_Env*, String const*) (/export/cruise/trunk/cc/projects/drlvm/trunk/vm/vmcore/src/class_support/classloader.cpp:367)
115: class_load_verify_prepare_by_loader_jni(Global_Env*, String const*, ClassLoader*) (/export/cruise/trunk/cc/projects/drlvm/trunk/vm/vmcore/src/class_support/Class_File_Loader.cpp:3644)
116: FindClass(JNIEnv_External*, String*) (/export/cruise/trunk/cc/projects/drlvm/trunk/vm/vmcore/src/jni/jni_utils.cpp:688)
117: FindClass(JNIEnv_External*, char const*) (/export/cruise/trunk/cc/projects/drlvm/trunk/vm/vmcore/src/jni/jni.cpp:638)
118: main_runJavaMain (../shared/main.c:1230)
119: invocation (../shared/main.c:732)
120: gpProtectedMain (../shared/main.c:381)
121: main (../shared/cmain.c:146)
122: __libc_start_main (??:-1)
123: _start (../sysdeps/i386/elf/start.S:105)
<end of stack trace>
Running PopFrame1
java: /export/cruise/trunk/cc/projects/drlvm/trunk/vm/vmcore/src/class_support/classloader.cpp:365: Class* ClassLoader::LoadVerifyAndPrepareClass(Global_Env*, const String*): Assertion `hythread_is_suspend_enabled()' failed.
SIGABRT in VM code.
Stack trace:
  0: ?? (??:-1)
  1: abort (??:-1)
  2: __assert_fail (??:-1)
  3: ClassLoader::LoadVerifyAndPrepareClass(Global_Env*, String const*) (/export/cruise/trunk/cc/projects/drlvm/trunk/vm/vmcore/src/class_support/classloader.cpp:367)
  4: Global_Env::LoadCoreClass(String const*) (/export/cruise/trunk/cc/projects/drlvm/trunk/vm/vmcore/src/class_support/Environment.cpp:280)
  5: Global_Env::LoadCoreClass(char const*) (/export/cruise/trunk/cc/projects/drlvm/trunk/vm/vmcore/src/class_support/Environment.cpp:292)
  6: getClassRegistryMethod (/export/cruise/trunk/cc/projects/drlvm/trunk/vm/vmcore/src/class_support/classloader.cpp:1601)
  7: ClassLoader::InsertClass(Class*) (/export/cruise/trunk/cc/projects/drlvm/trunk/vm/vmcore/src/class_support/classloader.cpp:1645)
  8: ClassLoader::DefineClass(Global_Env*, char const*, unsigned char*, unsigned int, unsigned int, String const**) (/export/cruise/trunk/cc/projects/drlvm/trunk/vm/vmcore/src/class_support/classloader.cpp:317)
  9: DefineClass(JNIEnv_External*, char const*, _jobject*, signed char const*, int) (/export/cruise/trunk/cc/projects/drlvm/trunk/vm/vmcore/src/jni/jni.cpp:603)
 10: Java_java_lang_ClassLoader_defineClass0 (/export/cruise/trunk/cc/projects/drlvm/trunk/vm/vmcore/src/kernel_classes/native/java_lang_VMClassRegistry.cpp:64)
 11: invokeJNI (/export/cruise/trunk/cc/projects/drlvm/trunk/vm/interpreter/src/invokeJNI_ia32.asm:37)
 12: interpreterInvokeVirtualNative(StackFrame&, StackFrame&, Method*, int) (/export/cruise/trunk/cc/projects/drlvm/trunk/vm/interpreter/src/interp_native_ia32.cpp:605)
 13: interpreterInvokeSpecial (/export/cruise/trunk/cc/projects/drlvm/trunk/vm/interpreter/src/interpreter.cpp:3578)
 14: Opcode_INVOKESPECIAL(StackFrame&) (/export/cruise/trunk/cc/projects/drlvm/trunk/vm/interpreter/src/interpreter.cpp:2125)
 15: java/lang/ClassLoader.defineClass(Ljava/lang/String;[BIILjava/security/ProtectionDomain;)Ljava/lang/Class; (ClassLoader.java:436)
 16: interpreterInvoke (/export/cruise/trunk/cc/projects/drlvm/trunk/vm/interpreter/src/interpreter.cpp:3406)
 17: interpreterInvokeVirtual (/export/cruise/trunk/cc/projects/drlvm/trunk/vm/interpreter/src/interpreter.cpp:3488)
 18: Opcode_INVOKEVIRTUAL(StackFrame&) (/export/cruise/trunk/cc/projects/drlvm/trunk/vm/interpreter/src/interpreter.cpp:2060)
 19: java/security/SecureClassLoader.defineClass(Ljava/lang/String;[BIILjava/security/CodeSource;)Ljava/lang/Class; (SecureClassLoader.java:70)
 20: interpreterInvoke (/export/cruise/trunk/cc/projects/drlvm/trunk/vm/interpreter/src/interpreter.cpp:3406)
 21: interpreterInvokeVirtual (/export/cruise/trunk/cc/projects/drlvm/trunk/vm/interpreter/src/interpreter.cpp:3488)
 22: Opcode_INVOKEVIRTUAL(StackFrame&) (/export/cruise/trunk/cc/projects/drlvm/trunk/vm/interpreter/src/interpreter.cpp:2060)
 23: java/net/URLClassLoader.findClassImpl([Ljava/net/URL;Ljava/lang/String;)Ljava/lang/Class; (URLClassLoader.java:1214)
 24: interpreterInvoke (/export/cruise/trunk/cc/projects/drlvm/trunk/vm/interpreter/src/interpreter.cpp:3406)
 25: interpreterInvokeVirtual (/export/cruise/trunk/cc/projects/drlvm/trunk/vm/interpreter/src/interpreter.cpp:3488)
 26: Opcode_INVOKEVIRTUAL(StackFrame&) (/export/cruise/trunk/cc/projects/drlvm/trunk/vm/interpreter/src/interpreter.cpp:2060)
 27: java/net/URLClassLoader$4.run()Ljava/lang/Class; (URLClassLoader.java:625)
 28: interpreterInvoke (/export/cruise/trunk/cc/projects/drlvm/trunk/vm/interpreter/src/interpreter.cpp:3406)
 29: interpreterInvokeVirtual (/export/cruise/trunk/cc/projects/drlvm/trunk/vm/interpreter/src/interpreter.cpp:3488)
 30: Opcode_INVOKEVIRTUAL(StackFrame&) (/export/cruise/trunk/cc/projects/drlvm/trunk/vm/interpreter/src/interpreter.cpp:2060)
 31: java/net/URLClassLoader$4.run()Ljava/lang/Object; (URLClassLoader.java:1)
 32: interpreterInvoke (/export/cruise/trunk/cc/projects/drlvm/trunk/vm/interpreter/src/interpreter.cpp:3406)
 33: interpreterInvokeInterface (/export/cruise/trunk/cc/projects/drlvm/trunk/vm/interpreter/src/interpreter.cpp:3543)
 34: Opcode_INVOKEINTERFACE(StackFrame&) (/export/cruise/trunk/cc/projects/drlvm/trunk/vm/interpreter/src/interpreter.cpp:2080)
 35: java/security/AccessController.doPrivilegedImpl(Ljava/security/PrivilegedAction;Ljava/security/AccessControlContext;)Ljava/lang/Object; (AccessController.java:173)
 36: interpreterInvokeStatic (/export/cruise/trunk/cc/projects/drlvm/trunk/vm/interpreter/src/interpreter.cpp:3316)
 37: Opcode_INVOKESTATIC(StackFrame&) (/export/cruise/trunk/cc/projects/drlvm/trunk/vm/interpreter/src/interpreter.cpp:2104)
 38: java/security/AccessController.doPrivileged(Ljava/security/PrivilegedAction;Ljava/security/AccessControlContext;)Ljava/lang/Object; (AccessController.java:64)
 39: interpreterInvokeStatic (/export/cruise/trunk/cc/projects/drlvm/trunk/vm/interpreter/src/interpreter.cpp:3316)
 40: Opcode_INVOKESTATIC(StackFrame&) (/export/cruise/trunk/cc/projects/drlvm/trunk/vm/interpreter/src/interpreter.cpp:2104)
 41: java/net/URLClassLoader.findClass(Ljava/lang/String;)Ljava/lang/Class; (URLClassLoader.java:622)
 42: interpreterInvoke (/export/cruise/trunk/cc/projects/drlvm/trunk/vm/interpreter/src/interpreter.cpp:3406)
 43: interpreterInvokeVirtual (/export/cruise/trunk/cc/projects/drlvm/trunk/vm/interpreter/src/interpreter.cpp:3488)
 44: Opcode_INVOKEVIRTUAL(StackFrame&) (/export/cruise/trunk/cc/projects/drlvm/trunk/vm/interpreter/src/interpreter.cpp:2060)
 45: java/lang/ClassLoader.loadClass(Ljava/lang/String;Z)Ljava/lang/Class; (ClassLoader.java:574)
 46: interpreterInvokeSpecial (/export/cruise/trunk/cc/projects/drlvm/trunk/vm/interpreter/src/interpreter.cpp:3602)
 47: Opcode_INVOKESPECIAL(StackFrame&) (/export/cruise/trunk/cc/projects/drlvm/trunk/vm/interpreter/src/interpreter.cpp:2125)
 48: java/lang/ClassLoader$SystemClassLoader.loadClass(Ljava/lang/String;Z)Ljava/lang/Class; (ClassLoader.java:962)
 49: interpreterInvoke (/export/cruise/trunk/cc/projects/drlvm/trunk/vm/interpreter/src/interpreter.cpp:3406)
 50: interpreterInvokeVirtual (/export/cruise/trunk/cc/projects/drlvm/trunk/vm/interpreter/src/interpreter.cpp:3488)
 51: Opcode_INVOKEVIRTUAL(StackFrame&) (/export/cruise/trunk/cc/projects/drlvm/trunk/vm/interpreter/src/interpreter.cpp:2060)
 52: java/lang/ClassLoader.loadClass(Ljava/lang/String;)Ljava/lang/Class; (ClassLoader.java:319)
 53: interpreter_execute_method(Method*, jvalue*, jvalue*) (/export/cruise/trunk/cc/projects/drlvm/trunk/vm/interpreter/src/interpreter.cpp:3209)
 54: JIT_execute_method (/export/cruise/trunk/cc/projects/drlvm/trunk/vm/interpreter/src/interp_exports.cpp:166)
 55: DrlEMImpl::executeMethod(_jmethodID*, jvalue*, jvalue*) (/export/cruise/trunk/cc/projects/drlvm/trunk/vm/em/src/DrlEMImpl.cpp:509)
 56: ExecuteMethod (/export/cruise/trunk/cc/projects/drlvm/trunk/vm/em/src/em_intf.cpp:43)
 57: vm_execute_java_method_array(_jmethodID*, jvalue*, jvalue*) (/export/cruise/trunk/cc/projects/drlvm/trunk/vm/vmcore/src/jit/ini.cpp:60)
 58: UserDefinedClassLoader::DoLoadClass(Global_Env*, String const*) (/export/cruise/trunk/cc/projects/drlvm/trunk/vm/vmcore/src/class_support/classloader.cpp:1534)
 59: ClassLoader::LoadClass(Global_Env*, String const*) (/export/cruise/trunk/cc/projects/drlvm/trunk/vm/vmcore/src/class_support/classloader.cpp:1400)
 60: ClassLoader::LoadVerifyAndPrepareClass(Global_Env*, String const*) (/export/cruise/trunk/cc/projects/drlvm/trunk/vm/vmcore/src/class_support/classloader.cpp:367)
 61: Class::load_ancestors(Global_Env*) (/export/cruise/trunk/cc/projects/drlvm/trunk/vm/vmcore/src/class_support/Class.cpp:326)
 62: ClassLoader::DefineClass(Global_Env*, char const*, unsigned char*, unsigned int, unsigned int, String const**) (/export/cruise/trunk/cc/projects/drlvm/trunk/vm/vmcore/src/class_support/classloader.cpp:312)
 63: DefineClass(JNIEnv_External*, char const*, _jobject*, signed char const*, int) (/export/cruise/trunk/cc/projects/drlvm/trunk/vm/vmcore/src/jni/jni.cpp:603)
 64: Java_java_lang_ClassLoader_defineClass0 (/export/cruise/trunk/cc/projects/drlvm/trunk/vm/vmcore/src/kernel_classes/native/java_lang_VMClassRegistry.cpp:64)
 65: invokeJNI (/export/cruise/trunk/cc/projects/drlvm/trunk/vm/interpreter/src/invokeJNI_ia32.asm:37)
 66: interpreterInvokeVirtualNative(StackFrame&, StackFrame&, Method*, int) (/export/cruise/trunk/cc/projects/drlvm/trunk/vm/interpreter/src/interp_native_ia32.cpp:605)
 67: interpreterInvokeSpecial (/export/cruise/trunk/cc/projects/drlvm/trunk/vm/interpreter/src/interpreter.cpp:3578)
 68: Opcode_INVOKESPECIAL(StackFrame&) (/export/cruise/trunk/cc/projects/drlvm/trunk/vm/interpreter/src/interpreter.cpp:2125)
 69: java/lang/ClassLoader.defineClass(Ljava/lang/String;[BIILjava/security/ProtectionDomain;)Ljava/lang/Class; (ClassLoader.java:436)
 70: interpreterInvoke (/export/cruise/trunk/cc/projects/drlvm/trunk/vm/interpreter/src/interpreter.cpp:3406)
 71: interpreterInvokeVirtual (/export/cruise/trunk/cc/projects/drlvm/trunk/vm/interpreter/src/interpreter.cpp:3488)
 72: Opcode_INVOKEVIRTUAL(StackFrame&) (/export/cruise/trunk/cc/projects/drlvm/trunk/vm/interpreter/src/interpreter.cpp:2060)
 73: java/security/SecureClassLoader.defineClass(Ljava/lang/String;[BIILjava/security/CodeSource;)Ljava/lang/Class; (SecureClassLoader.java:70)
 74: interpreterInvoke (/export/cruise/trunk/cc/projects/drlvm/trunk/vm/interpreter/src/interpreter.cpp:3406)
 75: interpreterInvokeVirtual (/export/cruise/trunk/cc/projects/drlvm/trunk/vm/interpreter/src/interpreter.cpp:3488)
 76: Opcode_INVOKEVIRTUAL(StackFrame&) (/export/cruise/trunk/cc/projects/drlvm/trunk/vm/interpreter/src/interpreter.cpp:2060)
 77: java/net/URLClassLoader.findClassImpl([Ljava/net/URL;Ljava/lang/String;)Ljava/lang/Class; (URLClassLoader.java:1214)
 78: interpreterInvoke (/export/cruise/trunk/cc/projects/drlvm/trunk/vm/interpreter/src/interpreter.cpp:3406)
 79: interpreterInvokeVirtual (/export/cruise/trunk/cc/projects/drlvm/trunk/vm/interpreter/src/interpreter.cpp:3488)
 80: Opcode_INVOKEVIRTUAL(StackFrame&) (/export/cruise/trunk/cc/projects/drlvm/trunk/vm/interpreter/src/interpreter.cpp:2060)
 81: java/net/URLClassLoader$4.run()Ljava/lang/Class; (URLClassLoader.java:625)
 82: interpreterInvoke (/export/cruise/trunk/cc/projects/drlvm/trunk/vm/interpreter/src/interpreter.cpp:3406)
 83: interpreterInvokeVirtual (/export/cruise/trunk/cc/projects/drlvm/trunk/vm/interpreter/src/interpreter.cpp:3488)
 84: Opcode_INVOKEVIRTUAL(StackFrame&) (/export/cruise/trunk/cc/projects/drlvm/trunk/vm/interpreter/src/interpreter.cpp:2060)
 85: java/net/URLClassLoader$4.run()Ljava/lang/Object; (URLClassLoader.java:1)
 86: interpreterInvoke (/export/cruise/trunk/cc/projects/drlvm/trunk/vm/interpreter/src/interpreter.cpp:3406)
 87: interpreterInvokeInterface (/export/cruise/trunk/cc/projects/drlvm/trunk/vm/interpreter/src/interpreter.cpp:3543)
 88: Opcode_INVOKEINTERFACE(StackFrame&) (/export/cruise/trunk/cc/projects/drlvm/trunk/vm/interpreter/src/interpreter.cpp:2080)
 89: java/security/AccessController.doPrivilegedImpl(Ljava/security/PrivilegedAction;Ljava/security/AccessControlContext;)Ljava/lang/Object; (AccessController.java:173)
 90: interpreterInvokeStatic (/export/cruise/trunk/cc/projects/drlvm/trunk/vm/interpreter/src/interpreter.cpp:3316)
 91: Opcode_INVOKESTATIC(StackFrame&) (/export/cruise/trunk/cc/projects/drlvm/trunk/vm/interpreter/src/interpreter.cpp:2104)
 92: java/security/AccessController.doPrivileged(Ljava/security/PrivilegedAction;Ljava/security/AccessControlContext;)Ljava/lang/Object; (AccessController.java:64)
 93: interpreterInvokeStatic (/export/cruise/trunk/cc/projects/drlvm/trunk/vm/interpreter/src/interpreter.cpp:3316)
 94: Opcode_INVOKESTATIC(StackFrame&) (/export/cruise/trunk/cc/projects/drlvm/trunk/vm/interpreter/src/interpreter.cpp:2104)
 95: java/net/URLClassLoader.findClass(Ljava/lang/String;)Ljava/lang/Class; (URLClassLoader.java:622)
 96: interpreterInvoke (/export/cruise/trunk/cc/projects/drlvm/trunk/vm/interpreter/src/interpreter.cpp:3406)
 97: interpreterInvokeVirtual (/export/cruise/trunk/cc/projects/drlvm/trunk/vm/interpreter/src/interpreter.cpp:3488)
 98: Opcode_INVOKEVIRTUAL(StackFrame&) (/export/cruise/trunk/cc/projects/drlvm/trunk/vm/interpreter/src/interpreter.cpp:2060)
 99: java/lang/ClassLoader.loadClass(Ljava/lang/String;Z)Ljava/lang/Class; (ClassLoader.java:574)
100: interpreterInvokeSpecial (/export/cruise/trunk/cc/projects/drlvm/trunk/vm/interpreter/src/interpreter.cpp:3602)
101: Opcode_INVOKESPECIAL(StackFrame&) (/export/cruise/trunk/cc/projects/drlvm/trunk/vm/interpreter/src/interpreter.cpp:2125)
102: java/lang/ClassLoader$SystemClassLoader.loadClass(Ljava/lang/String;Z)Ljava/lang/Class; (ClassLoader.java:962)
103: interpreterInvoke (/export/cruise/trunk/cc/projects/drlvm/trunk/vm/interpreter/src/interpreter.cpp:3406)
104: interpreterInvokeVirtual (/export/cruise/trunk/cc/projects/drlvm/trunk/vm/interpreter/src/interpreter.cpp:3488)
105: Opcode_INVOKEVIRTUAL(StackFrame&) (/export/cruise/trunk/cc/projects/drlvm/trunk/vm/interpreter/src/interpreter.cpp:2060)
106: java/lang/ClassLoader.loadClass(Ljava/lang/String;)Ljava/lang/Class; (ClassLoader.java:319)
107: interpreter_execute_method(Method*, jvalue*, jvalue*) (/export/cruise/trunk/cc/projects/drlvm/trunk/vm/interpreter/src/interpreter.cpp:3209)
108: JIT_execute_method (/export/cruise/trunk/cc/projects/drlvm/trunk/vm/interpreter/src/interp_exports.cpp:166)
109: DrlEMImpl::executeMethod(_jmethodID*, jvalue*, jvalue*) (/export/cruise/trunk/cc/projects/drlvm/trunk/vm/em/src/DrlEMImpl.cpp:509)
110: ExecuteMethod (/export/cruise/trunk/cc/projects/drlvm/trunk/vm/em/src/em_intf.cpp:43)
111: vm_execute_java_method_array(_jmethodID*, jvalue*, jvalue*) (/export/cruise/trunk/cc/projects/drlvm/trunk/vm/vmcore/src/jit/ini.cpp:60)
112: UserDefinedClassLoader::DoLoadClass(Global_Env*, String const*) (/export/cruise/trunk/cc/projects/drlvm/trunk/vm/vmcore/src/class_support/classloader.cpp:1534)
113: ClassLoader::LoadClass(Global_Env*, String const*) (/export/cruise/trunk/cc/projects/drlvm/trunk/vm/vmcore/src/class_support/classloader.cpp:1400)
114: ClassLoader::LoadVerifyAndPrepareClass(Global_Env*, String const*) (/export/cruise/trunk/cc/projects/drlvm/trunk/vm/vmcore/src/class_support/classloader.cpp:367)
115: class_load_verify_prepare_by_loader_jni(Global_Env*, String const*, ClassLoader*) (/export/cruise/trunk/cc/projects/drlvm/trunk/vm/vmcore/src/class_support/Class_File_Loader.cpp:3644)
116: FindClass(JNIEnv_External*, String*) (/export/cruise/trunk/cc/projects/drlvm/trunk/vm/vmcore/src/jni/jni_utils.cpp:688)
117: FindClass(JNIEnv_External*, char const*) (/export/cruise/trunk/cc/projects/drlvm/trunk/vm/vmcore/src/jni/jni.cpp:638)
118: main_runJavaMain (../shared/main.c:1230)
119: invocation (../shared/main.c:732)
120: gpProtectedMain (../shared/main.c:381)
121: main (../shared/cmain.c:146)
122: __libc_start_main (??:-1)
123: _start (../sysdeps/i386/elf/start.S:105)
<end of stack trace>
Running SingleStep1
java: /export/cruise/trunk/cc/projects/drlvm/trunk/vm/vmcore/src/class_support/classloader.cpp:365: Class* ClassLoader::LoadVerifyAndPrepareClass(Global_Env*, const String*): Assertion `hythread_is_suspend_enabled()' failed.
SIGABRT in VM code.
Stack trace:
  0: ?? (??:-1)
  1: abort (??:-1)
  2: __assert_fail (??:-1)
  3: ClassLoader::LoadVerifyAndPrepareClass(Global_Env*, String const*) (/export/cruise/trunk/cc/projects/drlvm/trunk/vm/vmcore/src/class_support/classloader.cpp:367)
  4: Global_Env::LoadCoreClass(String const*) (/export/cruise/trunk/cc/projects/drlvm/trunk/vm/vmcore/src/class_support/Environment.cpp:280)
  5: Global_Env::LoadCoreClass(char const*) (/export/cruise/trunk/cc/projects/drlvm/trunk/vm/vmcore/src/class_support/Environment.cpp:292)
  6: getClassRegistryMethod (/export/cruise/trunk/cc/projects/drlvm/trunk/vm/vmcore/src/class_support/classloader.cpp:1601)
  7: ClassLoader::InsertClass(Class*) (/export/cruise/trunk/cc/projects/drlvm/trunk/vm/vmcore/src/class_support/classloader.cpp:1645)
  8: ClassLoader::DefineClass(Global_Env*, char const*, unsigned char*, unsigned int, unsigned int, String const**) (/export/cruise/trunk/cc/projects/drlvm/trunk/vm/vmcore/src/class_support/classloader.cpp:317)
  9: DefineClass(JNIEnv_External*, char const*, _jobject*, signed char const*, int) (/export/cruise/trunk/cc/projects/drlvm/trunk/vm/vmcore/src/jni/jni.cpp:603)
 10: Java_java_lang_ClassLoader_defineClass0 (/export/cruise/trunk/cc/projects/drlvm/trunk/vm/vmcore/src/kernel_classes/native/java_lang_VMClassRegistry.cpp:64)
 11: invokeJNI (/export/cruise/trunk/cc/projects/drlvm/trunk/vm/interpreter/src/invokeJNI_ia32.asm:37)
 12: interpreterInvokeVirtualNative(StackFrame&, StackFrame&, Method*, int) (/export/cruise/trunk/cc/projects/drlvm/trunk/vm/interpreter/src/interp_native_ia32.cpp:605)
 13: interpreterInvokeSpecial (/export/cruise/trunk/cc/projects/drlvm/trunk/vm/interpreter/src/interpreter.cpp:3578)
 14: Opcode_INVOKESPECIAL(StackFrame&) (/export/cruise/trunk/cc/projects/drlvm/trunk/vm/interpreter/src/interpreter.cpp:2125)
 15: java/lang/ClassLoader.defineClass(Ljava/lang/String;[BIILjava/security/ProtectionDomain;)Ljava/lang/Class; (ClassLoader.java:436)
 16: interpreterInvoke (/export/cruise/trunk/cc/projects/drlvm/trunk/vm/interpreter/src/interpreter.cpp:3406)
 17: interpreterInvokeVirtual (/export/cruise/trunk/cc/projects/drlvm/trunk/vm/interpreter/src/interpreter.cpp:3488)
 18: Opcode_INVOKEVIRTUAL(StackFrame&) (/export/cruise/trunk/cc/projects/drlvm/trunk/vm/interpreter/src/interpreter.cpp:2060)
 19: java/security/SecureClassLoader.defineClass(Ljava/lang/String;[BIILjava/security/CodeSource;)Ljava/lang/Class; (SecureClassLoader.java:70)
 20: interpreterInvoke (/export/cruise/trunk/cc/projects/drlvm/trunk/vm/interpreter/src/interpreter.cpp:3406)
 21: interpreterInvokeVirtual (/export/cruise/trunk/cc/projects/drlvm/trunk/vm/interpreter/src/interpreter.cpp:3488)
 22: Opcode_INVOKEVIRTUAL(StackFrame&) (/export/cruise/trunk/cc/projects/drlvm/trunk/vm/interpreter/src/interpreter.cpp:2060)
 23: java/net/URLClassLoader.findClassImpl([Ljava/net/URL;Ljava/lang/String;)Ljava/lang/Class; (URLClassLoader.java:1214)
 24: interpreterInvoke (/export/cruise/trunk/cc/projects/drlvm/trunk/vm/interpreter/src/interpreter.cpp:3406)
 25: interpreterInvokeVirtual (/export/cruise/trunk/cc/projects/drlvm/trunk/vm/interpreter/src/interpreter.cpp:3488)
 26: Opcode_INVOKEVIRTUAL(StackFrame&) (/export/cruise/trunk/cc/projects/drlvm/trunk/vm/interpreter/src/interpreter.cpp:2060)
 27: java/net/URLClassLoader$4.run()Ljava/lang/Class; (URLClassLoader.java:625)
 28: interpreterInvoke (/export/cruise/trunk/cc/projects/drlvm/trunk/vm/interpreter/src/interpreter.cpp:3406)
 29: interpreterInvokeVirtual (/export/cruise/trunk/cc/projects/drlvm/trunk/vm/interpreter/src/interpreter.cpp:3488)
 30: Opcode_INVOKEVIRTUAL(StackFrame&) (/export/cruise/trunk/cc/projects/drlvm/trunk/vm/interpreter/src/interpreter.cpp:2060)
 31: java/net/URLClassLoader$4.run()Ljava/lang/Object; (URLClassLoader.java:1)
 32: interpreterInvoke (/export/cruise/trunk/cc/projects/drlvm/trunk/vm/interpreter/src/interpreter.cpp:3406)
 33: interpreterInvokeInterface (/export/cruise/trunk/cc/projects/drlvm/trunk/vm/interpreter/src/interpreter.cpp:3543)
 34: Opcode_INVOKEINTERFACE(StackFrame&) (/export/cruise/trunk/cc/projects/drlvm/trunk/vm/interpreter/src/interpreter.cpp:2080)
 35: java/security/AccessController.doPrivilegedImpl(Ljava/security/PrivilegedAction;Ljava/security/AccessControlContext;)Ljava/lang/Object; (AccessController.java:173)
 36: interpreterInvokeStatic (/export/cruise/trunk/cc/projects/drlvm/trunk/vm/interpreter/src/interpreter.cpp:3316)
 37: Opcode_INVOKESTATIC(StackFrame&) (/export/cruise/trunk/cc/projects/drlvm/trunk/vm/interpreter/src/interpreter.cpp:2104)
 38: java/security/AccessController.doPrivileged(Ljava/security/PrivilegedAction;Ljava/security/AccessControlContext;)Ljava/lang/Object; (AccessController.java:64)
 39: interpreterInvokeStatic (/export/cruise/trunk/cc/projects/drlvm/trunk/vm/interpreter/src/interpreter.cpp:3316)
 40: Opcode_INVOKESTATIC(StackFrame&) (/export/cruise/trunk/cc/projects/drlvm/trunk/vm/interpreter/src/interpreter.cpp:2104)
 41: java/net/URLClassLoader.findClass(Ljava/lang/String;)Ljava/lang/Class; (URLClassLoader.java:622)
 42: interpreterInvoke (/export/cruise/trunk/cc/projects/drlvm/trunk/vm/interpreter/src/interpreter.cpp:3406)
 43: interpreterInvokeVirtual (/export/cruise/trunk/cc/projects/drlvm/trunk/vm/interpreter/src/interpreter.cpp:3488)
 44: Opcode_INVOKEVIRTUAL(StackFrame&) (/export/cruise/trunk/cc/projects/drlvm/trunk/vm/interpreter/src/interpreter.cpp:2060)
 45: java/lang/ClassLoader.loadClass(Ljava/lang/String;Z)Ljava/lang/Class; (ClassLoader.java:574)
 46: interpreterInvokeSpecial (/export/cruise/trunk/cc/projects/drlvm/trunk/vm/interpreter/src/interpreter.cpp:3602)
 47: Opcode_INVOKESPECIAL(StackFrame&) (/export/cruise/trunk/cc/projects/drlvm/trunk/vm/interpreter/src/interpreter.cpp:2125)
 48: java/lang/ClassLoader$SystemClassLoader.loadClass(Ljava/lang/String;Z)Ljava/lang/Class; (ClassLoader.java:962)
 49: interpreterInvoke (/export/cruise/trunk/cc/projects/drlvm/trunk/vm/interpreter/src/interpreter.cpp:3406)
 50: interpreterInvokeVirtual (/export/cruise/trunk/cc/projects/drlvm/trunk/vm/interpreter/src/interpreter.cpp:3488)
 51: Opcode_INVOKEVIRTUAL(StackFrame&) (/export/cruise/trunk/cc/projects/drlvm/trunk/vm/interpreter/src/interpreter.cpp:2060)
 52: java/lang/ClassLoader.loadClass(Ljava/lang/String;)Ljava/lang/Class; (ClassLoader.java:319)
 53: interpreter_execute_method(Method*, jvalue*, jvalue*) (/export/cruise/trunk/cc/projects/drlvm/trunk/vm/interpreter/src/interpreter.cpp:3209)
 54: JIT_execute_method (/export/cruise/trunk/cc/projects/drlvm/trunk/vm/interpreter/src/interp_exports.cpp:166)
 55: DrlEMImpl::executeMethod(_jmethodID*, jvalue*, jvalue*) (/export/cruise/trunk/cc/projects/drlvm/trunk/vm/em/src/DrlEMImpl.cpp:509)
 56: ExecuteMethod (/export/cruise/trunk/cc/projects/drlvm/trunk/vm/em/src/em_intf.cpp:43)
 57: vm_execute_java_method_array(_jmethodID*, jvalue*, jvalue*) (/export/cruise/trunk/cc/projects/drlvm/trunk/vm/vmcore/src/jit/ini.cpp:60)
 58: UserDefinedClassLoader::DoLoadClass(Global_Env*, String const*) (/export/cruise/trunk/cc/projects/drlvm/trunk/vm/vmcore/src/class_support/classloader.cpp:1534)
 59: ClassLoader::LoadClass(Global_Env*, String const*) (/export/cruise/trunk/cc/projects/drlvm/trunk/vm/vmcore/src/class_support/classloader.cpp:1400)
 60: ClassLoader::LoadVerifyAndPrepareClass(Global_Env*, String const*) (/export/cruise/trunk/cc/projects/drlvm/trunk/vm/vmcore/src/class_support/classloader.cpp:367)
 61: Class::load_ancestors(Global_Env*) (/export/cruise/trunk/cc/projects/drlvm/trunk/vm/vmcore/src/class_support/Class.cpp:326)
 62: ClassLoader::DefineClass(Global_Env*, char const*, unsigned char*, unsigned int, unsigned int, String const**) (/export/cruise/trunk/cc/projects/drlvm/trunk/vm/vmcore/src/class_support/classloader.cpp:312)
 63: DefineClass(JNIEnv_External*, char const*, _jobject*, signed char const*, int) (/export/cruise/trunk/cc/projects/drlvm/trunk/vm/vmcore/src/jni/jni.cpp:603)
 64: Java_java_lang_ClassLoader_defineClass0 (/export/cruise/trunk/cc/projects/drlvm/trunk/vm/vmcore/src/kernel_classes/native/java_lang_VMClassRegistry.cpp:64)
 65: invokeJNI (/export/cruise/trunk/cc/projects/drlvm/trunk/vm/interpreter/src/invokeJNI_ia32.asm:37)
 66: interpreterInvokeVirtualNative(StackFrame&, StackFrame&, Method*, int) (/export/cruise/trunk/cc/projects/drlvm/trunk/vm/interpreter/src/interp_native_ia32.cpp:605)
 67: interpreterInvokeSpecial (/export/cruise/trunk/cc/projects/drlvm/trunk/vm/interpreter/src/interpreter.cpp:3578)
 68: Opcode_INVOKESPECIAL(StackFrame&) (/export/cruise/trunk/cc/projects/drlvm/trunk/vm/interpreter/src/interpreter.cpp:2125)
 69: java/lang/ClassLoader.defineClass(Ljava/lang/String;[BIILjava/security/ProtectionDomain;)Ljava/lang/Class; (ClassLoader.java:436)
 70: interpreterInvoke (/export/cruise/trunk/cc/projects/drlvm/trunk/vm/interpreter/src/interpreter.cpp:3406)
 71: interpreterInvokeVirtual (/export/cruise/trunk/cc/projects/drlvm/trunk/vm/interpreter/src/interpreter.cpp:3488)
 72: Opcode_INVOKEVIRTUAL(StackFrame&) (/export/cruise/trunk/cc/projects/drlvm/trunk/vm/interpreter/src/interpreter.cpp:2060)
 73: java/security/SecureClassLoader.defineClass(Ljava/lang/String;[BIILjava/security/CodeSource;)Ljava/lang/Class; (SecureClassLoader.java:70)
 74: interpreterInvoke (/export/cruise/trunk/cc/projects/drlvm/trunk/vm/interpreter/src/interpreter.cpp:3406)
 75: interpreterInvokeVirtual (/export/cruise/trunk/cc/projects/drlvm/trunk/vm/interpreter/src/interpreter.cpp:3488)
 76: Opcode_INVOKEVIRTUAL(StackFrame&) (/export/cruise/trunk/cc/projects/drlvm/trunk/vm/interpreter/src/interpreter.cpp:2060)
 77: java/net/URLClassLoader.findClassImpl([Ljava/net/URL;Ljava/lang/String;)Ljava/lang/Class; (URLClassLoader.java:1214)
 78: interpreterInvoke (/export/cruise/trunk/cc/projects/drlvm/trunk/vm/interpreter/src/interpreter.cpp:3406)
 79: interpreterInvokeVirtual (/export/cruise/trunk/cc/projects/drlvm/trunk/vm/interpreter/src/interpreter.cpp:3488)
 80: Opcode_INVOKEVIRTUAL(StackFrame&) (/export/cruise/trunk/cc/projects/drlvm/trunk/vm/interpreter/src/interpreter.cpp:2060)
 81: java/net/URLClassLoader$4.run()Ljava/lang/Class; (URLClassLoader.java:625)
 82: interpreterInvoke (/export/cruise/trunk/cc/projects/drlvm/trunk/vm/interpreter/src/interpreter.cpp:3406)
 83: interpreterInvokeVirtual (/export/cruise/trunk/cc/projects/drlvm/trunk/vm/interpreter/src/interpreter.cpp:3488)
 84: Opcode_INVOKEVIRTUAL(StackFrame&) (/export/cruise/trunk/cc/projects/drlvm/trunk/vm/interpreter/src/interpreter.cpp:2060)
 85: java/net/URLClassLoader$4.run()Ljava/lang/Object; (URLClassLoader.java:1)
 86: interpreterInvoke (/export/cruise/trunk/cc/projects/drlvm/trunk/vm/interpreter/src/interpreter.cpp:3406)
 87: interpreterInvokeInterface (/export/cruise/trunk/cc/projects/drlvm/trunk/vm/interpreter/src/interpreter.cpp:3543)
 88: Opcode_INVOKEINTERFACE(StackFrame&) (/export/cruise/trunk/cc/projects/drlvm/trunk/vm/interpreter/src/interpreter.cpp:2080)
 89: java/security/AccessController.doPrivilegedImpl(Ljava/security/PrivilegedAction;Ljava/security/AccessControlContext;)Ljava/lang/Object; (AccessController.java:173)
 90: interpreterInvokeStatic (/export/cruise/trunk/cc/projects/drlvm/trunk/vm/interpreter/src/interpreter.cpp:3316)
 91: Opcode_INVOKESTATIC(StackFrame&) (/export/cruise/trunk/cc/projects/drlvm/trunk/vm/interpreter/src/interpreter.cpp:2104)
 92: java/security/AccessController.doPrivileged(Ljava/security/PrivilegedAction;Ljava/security/AccessControlContext;)Ljava/lang/Object; (AccessController.java:64)
 93: interpreterInvokeStatic (/export/cruise/trunk/cc/projects/drlvm/trunk/vm/interpreter/src/interpreter.cpp:3316)
 94: Opcode_INVOKESTATIC(StackFrame&) (/export/cruise/trunk/cc/projects/drlvm/trunk/vm/interpreter/src/interpreter.cpp:2104)
 95: java/net/URLClassLoader.findClass(Ljava/lang/String;)Ljava/lang/Class; (URLClassLoader.java:622)
 96: interpreterInvoke (/export/cruise/trunk/cc/projects/drlvm/trunk/vm/interpreter/src/interpreter.cpp:3406)
 97: interpreterInvokeVirtual (/export/cruise/trunk/cc/projects/drlvm/trunk/vm/interpreter/src/interpreter.cpp:3488)
 98: Opcode_INVOKEVIRTUAL(StackFrame&) (/export/cruise/trunk/cc/projects/drlvm/trunk/vm/interpreter/src/interpreter.cpp:2060)
 99: java/lang/ClassLoader.loadClass(Ljava/lang/String;Z)Ljava/lang/Class; (ClassLoader.java:574)
100: interpreterInvokeSpecial (/export/cruise/trunk/cc/projects/drlvm/trunk/vm/interpreter/src/interpreter.cpp:3602)
101: Opcode_INVOKESPECIAL(StackFrame&) (/export/cruise/trunk/cc/projects/drlvm/trunk/vm/interpreter/src/interpreter.cpp:2125)
102: java/lang/ClassLoader$SystemClassLoader.loadClass(Ljava/lang/String;Z)Ljava/lang/Class; (ClassLoader.java:962)
103: interpreterInvoke (/export/cruise/trunk/cc/projects/drlvm/trunk/vm/interpreter/src/interpreter.cpp:3406)
104: interpreterInvokeVirtual (/export/cruise/trunk/cc/projects/drlvm/trunk/vm/interpreter/src/interpreter.cpp:3488)
105: Opcode_INVOKEVIRTUAL(StackFrame&) (/export/cruise/trunk/cc/projects/drlvm/trunk/vm/interpreter/src/interpreter.cpp:2060)
106: java/lang/ClassLoader.loadClass(Ljava/lang/String;)Ljava/lang/Class; (ClassLoader.java:319)
107: interpreter_execute_method(Method*, jvalue*, jvalue*) (/export/cruise/trunk/cc/projects/drlvm/trunk/vm/interpreter/src/interpreter.cpp:3209)
108: JIT_execute_method (/export/cruise/trunk/cc/projects/drlvm/trunk/vm/interpreter/src/interp_exports.cpp:166)
109: DrlEMImpl::executeMethod(_jmethodID*, jvalue*, jvalue*) (/export/cruise/trunk/cc/projects/drlvm/trunk/vm/em/src/DrlEMImpl.cpp:509)
110: ExecuteMethod (/export/cruise/trunk/cc/projects/drlvm/trunk/vm/em/src/em_intf.cpp:43)
111: vm_execute_java_method_array(_jmethodID*, jvalue*, jvalue*) (/export/cruise/trunk/cc/projects/drlvm/trunk/vm/vmcore/src/jit/ini.cpp:60)
112: UserDefinedClassLoader::DoLoadClass(Global_Env*, String const*) (/export/cruise/trunk/cc/projects/drlvm/trunk/vm/vmcore/src/class_support/classloader.cpp:1534)
113: ClassLoader::LoadClass(Global_Env*, String const*) (/export/cruise/trunk/cc/projects/drlvm/trunk/vm/vmcore/src/class_support/classloader.cpp:1400)
114: ClassLoader::LoadVerifyAndPrepareClass(Global_Env*, String const*) (/export/cruise/trunk/cc/projects/drlvm/trunk/vm/vmcore/src/class_support/classloader.cpp:367)
115: class_load_verify_prepare_by_loader_jni(Global_Env*, String const*, ClassLoader*) (/export/cruise/trunk/cc/projects/drlvm/trunk/vm/vmcore/src/class_support/Class_File_Loader.cpp:3644)
116: FindClass(JNIEnv_External*, String*) (/export/cruise/trunk/cc/projects/drlvm/trunk/vm/vmcore/src/jni/jni_utils.cpp:688)
117: FindClass(JNIEnv_External*, char const*) (/export/cruise/trunk/cc/projects/drlvm/trunk/vm/vmcore/src/jni/jni.cpp:638)
118: main_runJavaMain (../shared/main.c:1230)
119: invocation (../shared/main.c:732)
120: gpProtectedMain (../shared/main.c:381)
121: main (../shared/cmain.c:146)
122: __libc_start_main (??:-1)
123: _start (../sysdeps/i386/elf/start.S:105)
<end of stack trace>
Running VMInit1
java: /export/cruise/trunk/cc/projects/drlvm/trunk/vm/vmcore/src/class_support/classloader.cpp:365: Class* ClassLoader::LoadVerifyAndPrepareClass(Global_Env*, const String*): Assertion `hythread_is_suspend_enabled()' failed.
SIGABRT in VM code.
Stack trace:
  0: ?? (??:-1)
  1: abort (??:-1)
  2: __assert_fail (??:-1)
  3: ClassLoader::LoadVerifyAndPrepareClass(Global_Env*, String const*) (/export/cruise/trunk/cc/projects/drlvm/trunk/vm/vmcore/src/class_support/classloader.cpp:367)
  4: Global_Env::LoadCoreClass(String const*) (/export/cruise/trunk/cc/projects/drlvm/trunk/vm/vmcore/src/class_support/Environment.cpp:280)
  5: Global_Env::LoadCoreClass(char const*) (/export/cruise/trunk/cc/projects/drlvm/trunk/vm/vmcore/src/class_support/Environment.cpp:292)
  6: getClassRegistryMethod (/export/cruise/trunk/cc/projects/drlvm/trunk/vm/vmcore/src/class_support/classloader.cpp:1601)
  7: ClassLoader::InsertClass(Class*) (/export/cruise/trunk/cc/projects/drlvm/trunk/vm/vmcore/src/class_support/classloader.cpp:1645)
  8: ClassLoader::DefineClass(Global_Env*, char const*, unsigned char*, unsigned int, unsigned int, String const**) (/export/cruise/trunk/cc/projects/drlvm/trunk/vm/vmcore/src/class_support/classloader.cpp:317)
  9: DefineClass(JNIEnv_External*, char const*, _jobject*, signed char const*, int) (/export/cruise/trunk/cc/projects/drlvm/trunk/vm/vmcore/src/jni/jni.cpp:603)
 10: Java_java_lang_ClassLoader_defineClass0 (/export/cruise/trunk/cc/projects/drlvm/trunk/vm/vmcore/src/kernel_classes/native/java_lang_VMClassRegistry.cpp:64)
 11: invokeJNI (/export/cruise/trunk/cc/projects/drlvm/trunk/vm/interpreter/src/invokeJNI_ia32.asm:37)
 12: interpreterInvokeVirtualNative(StackFrame&, StackFrame&, Method*, int) (/export/cruise/trunk/cc/projects/drlvm/trunk/vm/interpreter/src/interp_native_ia32.cpp:605)
 13: interpreterInvokeSpecial (/export/cruise/trunk/cc/projects/drlvm/trunk/vm/interpreter/src/interpreter.cpp:3578)
 14: Opcode_INVOKESPECIAL(StackFrame&) (/export/cruise/trunk/cc/projects/drlvm/trunk/vm/interpreter/src/interpreter.cpp:2125)
 15: java/lang/ClassLoader.defineClass(Ljava/lang/String;[BIILjava/security/ProtectionDomain;)Ljava/lang/Class; (ClassLoader.java:436)
 16: interpreterInvoke (/export/cruise/trunk/cc/projects/drlvm/trunk/vm/interpreter/src/interpreter.cpp:3406)
 17: interpreterInvokeVirtual (/export/cruise/trunk/cc/projects/drlvm/trunk/vm/interpreter/src/interpreter.cpp:3488)
 18: Opcode_INVOKEVIRTUAL(StackFrame&) (/export/cruise/trunk/cc/projects/drlvm/trunk/vm/interpreter/src/interpreter.cpp:2060)
 19: java/security/SecureClassLoader.defineClass(Ljava/lang/String;[BIILjava/security/CodeSource;)Ljava/lang/Class; (SecureClassLoader.java:70)
 20: interpreterInvoke (/export/cruise/trunk/cc/projects/drlvm/trunk/vm/interpreter/src/interpreter.cpp:3406)
 21: interpreterInvokeVirtual (/export/cruise/trunk/cc/projects/drlvm/trunk/vm/interpreter/src/interpreter.cpp:3488)
 22: Opcode_INVOKEVIRTUAL(StackFrame&) (/export/cruise/trunk/cc/projects/drlvm/trunk/vm/interpreter/src/interpreter.cpp:2060)
 23: java/net/URLClassLoader.findClassImpl([Ljava/net/URL;Ljava/lang/String;)Ljava/lang/Class; (URLClassLoader.java:1214)
 24: interpreterInvoke (/export/cruise/trunk/cc/projects/drlvm/trunk/vm/interpreter/src/interpreter.cpp:3406)
 25: interpreterInvokeVirtual (/export/cruise/trunk/cc/projects/drlvm/trunk/vm/interpreter/src/interpreter.cpp:3488)
 26: Opcode_INVOKEVIRTUAL(StackFrame&) (/export/cruise/trunk/cc/projects/drlvm/trunk/vm/interpreter/src/interpreter.cpp:2060)
 27: java/net/URLClassLoader$4.run()Ljava/lang/Class; (URLClassLoader.java:625)
 28: interpreterInvoke (/export/cruise/trunk/cc/projects/drlvm/trunk/vm/interpreter/src/interpreter.cpp:3406)
 29: interpreterInvokeVirtual (/export/cruise/trunk/cc/projects/drlvm/trunk/vm/interpreter/src/interpreter.cpp:3488)
 30: Opcode_INVOKEVIRTUAL(StackFrame&) (/export/cruise/trunk/cc/projects/drlvm/trunk/vm/interpreter/src/interpreter.cpp:2060)
 31: java/net/URLClassLoader$4.run()Ljava/lang/Object; (URLClassLoader.java:1)
 32: interpreterInvoke (/export/cruise/trunk/cc/projects/drlvm/trunk/vm/interpreter/src/interpreter.cpp:3406)
 33: interpreterInvokeInterface (/export/cruise/trunk/cc/projects/drlvm/trunk/vm/interpreter/src/interpreter.cpp:3543)
 34: Opcode_INVOKEINTERFACE(StackFrame&) (/export/cruise/trunk/cc/projects/drlvm/trunk/vm/interpreter/src/interpreter.cpp:2080)
 35: java/security/AccessController.doPrivilegedImpl(Ljava/security/PrivilegedAction;Ljava/security/AccessControlContext;)Ljava/lang/Object; (AccessController.java:173)
 36: interpreterInvokeStatic (/export/cruise/trunk/cc/projects/drlvm/trunk/vm/interpreter/src/interpreter.cpp:3316)
 37: Opcode_INVOKESTATIC(StackFrame&) (/export/cruise/trunk/cc/projects/drlvm/trunk/vm/interpreter/src/interpreter.cpp:2104)
 38: java/security/AccessController.doPrivileged(Ljava/security/PrivilegedAction;Ljava/security/AccessControlContext;)Ljava/lang/Object; (AccessController.java:64)
 39: interpreterInvokeStatic (/export/cruise/trunk/cc/projects/drlvm/trunk/vm/interpreter/src/interpreter.cpp:3316)
 40: Opcode_INVOKESTATIC(StackFrame&) (/export/cruise/trunk/cc/projects/drlvm/trunk/vm/interpreter/src/interpreter.cpp:2104)
 41: java/net/URLClassLoader.findClass(Ljava/lang/String;)Ljava/lang/Class; (URLClassLoader.java:622)
 42: interpreterInvoke (/export/cruise/trunk/cc/projects/drlvm/trunk/vm/interpreter/src/interpreter.cpp:3406)
 43: interpreterInvokeVirtual (/export/cruise/trunk/cc/projects/drlvm/trunk/vm/interpreter/src/interpreter.cpp:3488)
 44: Opcode_INVOKEVIRTUAL(StackFrame&) (/export/cruise/trunk/cc/projects/drlvm/trunk/vm/interpreter/src/interpreter.cpp:2060)
 45: java/lang/ClassLoader.loadClass(Ljava/lang/String;Z)Ljava/lang/Class; (ClassLoader.java:574)
 46: interpreterInvokeSpecial (/export/cruise/trunk/cc/projects/drlvm/trunk/vm/interpreter/src/interpreter.cpp:3602)
 47: Opcode_INVOKESPECIAL(StackFrame&) (/export/cruise/trunk/cc/projects/drlvm/trunk/vm/interpreter/src/interpreter.cpp:2125)
 48: java/lang/ClassLoader$SystemClassLoader.loadClass(Ljava/lang/String;Z)Ljava/lang/Class; (ClassLoader.java:962)
 49: interpreterInvoke (/export/cruise/trunk/cc/projects/drlvm/trunk/vm/interpreter/src/interpreter.cpp:3406)
 50: interpreterInvokeVirtual (/export/cruise/trunk/cc/projects/drlvm/trunk/vm/interpreter/src/interpreter.cpp:3488)
 51: Opcode_INVOKEVIRTUAL(StackFrame&) (/export/cruise/trunk/cc/projects/drlvm/trunk/vm/interpreter/src/interpreter.cpp:2060)
 52: java/lang/ClassLoader.loadClass(Ljava/lang/String;)Ljava/lang/Class; (ClassLoader.java:319)
 53: interpreter_execute_method(Method*, jvalue*, jvalue*) (/export/cruise/trunk/cc/projects/drlvm/trunk/vm/interpreter/src/interpreter.cpp:3209)
 54: JIT_execute_method (/export/cruise/trunk/cc/projects/drlvm/trunk/vm/interpreter/src/interp_exports.cpp:166)
 55: DrlEMImpl::executeMethod(_jmethodID*, jvalue*, jvalue*) (/export/cruise/trunk/cc/projects/drlvm/trunk/vm/em/src/DrlEMImpl.cpp:509)
 56: ExecuteMethod (/export/cruise/trunk/cc/projects/drlvm/trunk/vm/em/src/em_intf.cpp:43)
 57: vm_execute_java_method_array(_jmethodID*, jvalue*, jvalue*) (/export/cruise/trunk/cc/projects/drlvm/trunk/vm/vmcore/src/jit/ini.cpp:60)
 58: UserDefinedClassLoader::DoLoadClass(Global_Env*, String const*) (/export/cruise/trunk/cc/projects/drlvm/trunk/vm/vmcore/src/class_support/classloader.cpp:1534)
 59: ClassLoader::LoadClass(Global_Env*, String const*) (/export/cruise/trunk/cc/projects/drlvm/trunk/vm/vmcore/src/class_support/classloader.cpp:1400)
 60: ClassLoader::LoadVerifyAndPrepareClass(Global_Env*, String const*) (/export/cruise/trunk/cc/projects/drlvm/trunk/vm/vmcore/src/class_support/classloader.cpp:367)
 61: class_load_verify_prepare_by_loader_jni(Global_Env*, String const*, ClassLoader*) (/export/cruise/trunk/cc/projects/drlvm/trunk/vm/vmcore/src/class_support/Class_File_Loader.cpp:3644)
 62: FindClass(JNIEnv_External*, String*) (/export/cruise/trunk/cc/projects/drlvm/trunk/vm/vmcore/src/jni/jni_utils.cpp:688)
 63: FindClass(JNIEnv_External*, char const*) (/export/cruise/trunk/cc/projects/drlvm/trunk/vm/vmcore/src/jni/jni.cpp:638)
 64: JNIEnv_External::FindClass(char const*) (/export/cruise/trunk/cc/projects/drlvm/trunk/vm/include/jni.h:627)
 65: vm_init_callback (/export/cruise/trunk/cc/projects/drlvm/trunk/vm/tests/jvmti/VMInit1/VMInit1.cpp:6)
 66: jvmti_send_vm_init_event (/export/cruise/trunk/cc/projects/drlvm/trunk/vm/vmcore/src/jvmti/jvmti_event.cpp:472)
 67: JNI_CreateJavaVM (/export/cruise/trunk/cc/projects/drlvm/trunk/vm/vmcore/src/jni/jni.cpp:538)
 68: invocation (../shared/main.c:660)
 69: gpProtectedMain (../shared/main.c:381)
 70: main (../shared/cmain.c:146)
 71: __libc_start_main (??:-1)
 72: _start (../sysdeps/i386/elf/start.S:105)
<end of stack trace>

        ==================================
        Run JVMTI tests using Client mode JIT (default)
        ==================================
        
Running Breakpoint1
java: /export/cruise/trunk/cc/projects/drlvm/trunk/vm/vmcore/src/class_support/classloader.cpp:365: Class* ClassLoader::LoadVerifyAndPrepareClass(Global_Env*, const String*): Assertion `hythread_is_suspend_enabled()' failed.
SIGABRT in VM code.
Stack trace:
  0: ?? (??:-1)
  1: abort (??:-1)
  2: __assert_fail (??:-1)
  3: ClassLoader::LoadVerifyAndPrepareClass(Global_Env*, String const*) (/export/cruise/trunk/cc/projects/drlvm/trunk/vm/vmcore/src/class_support/classloader.cpp:367)
  4: Global_Env::LoadCoreClass(String const*) (/export/cruise/trunk/cc/projects/drlvm/trunk/vm/vmcore/src/class_support/Environment.cpp:280)
  5: Global_Env::LoadCoreClass(char const*) (/export/cruise/trunk/cc/projects/drlvm/trunk/vm/vmcore/src/class_support/Environment.cpp:292)
  6: getClassRegistryMethod (/export/cruise/trunk/cc/projects/drlvm/trunk/vm/vmcore/src/class_support/classloader.cpp:1601)
  7: ClassLoader::InsertClass(Class*) (/export/cruise/trunk/cc/projects/drlvm/trunk/vm/vmcore/src/class_support/classloader.cpp:1645)
  8: ClassLoader::DefineClass(Global_Env*, char const*, unsigned char*, unsigned int, unsigned int, String const**) (/export/cruise/trunk/cc/projects/drlvm/trunk/vm/vmcore/src/class_support/classloader.cpp:317)
  9: DefineClass(JNIEnv_External*, char const*, _jobject*, signed char const*, int) (/export/cruise/trunk/cc/projects/drlvm/trunk/vm/vmcore/src/jni/jni.cpp:603)
 10: Java_java_lang_ClassLoader_defineClass0 (/export/cruise/trunk/cc/projects/drlvm/trunk/vm/vmcore/src/kernel_classes/native/java_lang_VMClassRegistry.cpp:64)
 11: 0x5293F683  <Generated stub>
 12: java/lang/ClassLoader.defineClass(Ljava/lang/String;[BIILjava/security/ProtectionDomain;)Ljava/lang/Class; (ClassLoader.java:436)
 13: java/security/SecureClassLoader.defineClass(Ljava/lang/String;[BIILjava/security/CodeSource;)Ljava/lang/Class; (SecureClassLoader.java:70)
 14: java/net/URLClassLoader.findClassImpl([Ljava/net/URL;Ljava/lang/String;)Ljava/lang/Class; (URLClassLoader.java:1214)
 15: java/net/URLClassLoader$4.run()Ljava/lang/Class; (URLClassLoader.java:625)
 16: java/net/URLClassLoader$4.run()Ljava/lang/Object; (URLClassLoader.java:1)
 17: java/security/AccessController.doPrivilegedImpl(Ljava/security/PrivilegedAction;Ljava/security/AccessControlContext;)Ljava/lang/Object; (AccessController.java:173)
 18: java/security/AccessController.doPrivileged(Ljava/security/PrivilegedAction;Ljava/security/AccessControlContext;)Ljava/lang/Object; (AccessController.java:64)
 19: java/net/URLClassLoader.findClass(Ljava/lang/String;)Ljava/lang/Class; (URLClassLoader.java:622)
 20: java/lang/ClassLoader.loadClass(Ljava/lang/String;Z)Ljava/lang/Class; (ClassLoader.java:574)
 21: java/lang/ClassLoader$SystemClassLoader.loadClass(Ljava/lang/String;Z)Ljava/lang/Class; (ClassLoader.java:962)
 22: java/lang/ClassLoader.loadClass(Ljava/lang/String;)Ljava/lang/Class; (ClassLoader.java:319)
 23: vm_invoke_native_array_stub (/export/cruise/trunk/cc/projects/drlvm/trunk/vm/vmcore/src/util/ia32/base/invoke_native_stub_ia32.asm:41)
 24: JIT_execute_method_default(void*, _jmethodID*, jvalue*, jvalue*) (/export/cruise/trunk/cc/projects/drlvm/trunk/vm/vmcore/src/util/ia32/base/ini_iA32.cpp:206)
 25: DrlEMImpl::executeMethod(_jmethodID*, jvalue*, jvalue*) (/export/cruise/trunk/cc/projects/drlvm/trunk/vm/em/src/DrlEMImpl.cpp:509)
 26: ExecuteMethod (/export/cruise/trunk/cc/projects/drlvm/trunk/vm/em/src/em_intf.cpp:43)
 27: vm_execute_java_method_array(_jmethodID*, jvalue*, jvalue*) (/export/cruise/trunk/cc/projects/drlvm/trunk/vm/vmcore/src/jit/ini.cpp:60)
 28: UserDefinedClassLoader::DoLoadClass(Global_Env*, String const*) (/export/cruise/trunk/cc/projects/drlvm/trunk/vm/vmcore/src/class_support/classloader.cpp:1534)
 29: ClassLoader::LoadClass(Global_Env*, String const*) (/export/cruise/trunk/cc/projects/drlvm/trunk/vm/vmcore/src/class_support/classloader.cpp:1400)
 30: ClassLoader::LoadVerifyAndPrepareClass(Global_Env*, String const*) (/export/cruise/trunk/cc/projects/drlvm/trunk/vm/vmcore/src/class_support/classloader.cpp:367)
 31: Class::load_ancestors(Global_Env*) (/export/cruise/trunk/cc/projects/drlvm/trunk/vm/vmcore/src/class_support/Class.cpp:326)
 32: ClassLoader::DefineClass(Global_Env*, char const*, unsigned char*, unsigned int, unsigned int, String const**) (/export/cruise/trunk/cc/projects/drlvm/trunk/vm/vmcore/src/class_support/classloader.cpp:312)
 33: DefineClass(JNIEnv_External*, char const*, _jobject*, signed char const*, int) (/export/cruise/trunk/cc/projects/drlvm/trunk/vm/vmcore/src/jni/jni.cpp:603)
 34: Java_java_lang_ClassLoader_defineClass0 (/export/cruise/trunk/cc/projects/drlvm/trunk/vm/vmcore/src/kernel_classes/native/java_lang_VMClassRegistry.cpp:64)
 35: 0x5293F683  <Generated stub>
 36: java/lang/ClassLoader.defineClass(Ljava/lang/String;[BIILjava/security/ProtectionDomain;)Ljava/lang/Class; (ClassLoader.java:436)
 37: java/security/SecureClassLoader.defineClass(Ljava/lang/String;[BIILjava/security/CodeSource;)Ljava/lang/Class; (SecureClassLoader.java:70)
 38: java/net/URLClassLoader.findClassImpl([Ljava/net/URL;Ljava/lang/String;)Ljava/lang/Class; (URLClassLoader.java:1214)
 39: java/net/URLClassLoader$4.run()Ljava/lang/Class; (URLClassLoader.java:625)
 40: java/net/URLClassLoader$4.run()Ljava/lang/Object; (URLClassLoader.java:1)
 41: java/security/AccessController.doPrivilegedImpl(Ljava/security/PrivilegedAction;Ljava/security/AccessControlContext;)Ljava/lang/Object; (AccessController.java:173)
 42: java/security/AccessController.doPrivileged(Ljava/security/PrivilegedAction;Ljava/security/AccessControlContext;)Ljava/lang/Object; (AccessController.java:64)
 43: java/net/URLClassLoader.findClass(Ljava/lang/String;)Ljava/lang/Class; (URLClassLoader.java:622)
 44: java/lang/ClassLoader.loadClass(Ljava/lang/String;Z)Ljava/lang/Class; (ClassLoader.java:574)
 45: java/lang/ClassLoader$SystemClassLoader.loadClass(Ljava/lang/String;Z)Ljava/lang/Class; (ClassLoader.java:962)
 46: java/lang/ClassLoader.loadClass(Ljava/lang/String;)Ljava/lang/Class; (ClassLoader.java:319)
 47: vm_invoke_native_array_stub (/export/cruise/trunk/cc/projects/drlvm/trunk/vm/vmcore/src/util/ia32/base/invoke_native_stub_ia32.asm:41)
 48: JIT_execute_method_default(void*, _jmethodID*, jvalue*, jvalue*) (/export/cruise/trunk/cc/projects/drlvm/trunk/vm/vmcore/src/util/ia32/base/ini_iA32.cpp:206)
 49: DrlEMImpl::executeMethod(_jmethodID*, jvalue*, jvalue*) (/export/cruise/trunk/cc/projects/drlvm/trunk/vm/em/src/DrlEMImpl.cpp:509)
 50: ExecuteMethod (/export/cruise/trunk/cc/projects/drlvm/trunk/vm/em/src/em_intf.cpp:43)
 51: vm_execute_java_method_array(_jmethodID*, jvalue*, jvalue*) (/export/cruise/trunk/cc/projects/drlvm/trunk/vm/vmcore/src/jit/ini.cpp:60)
 52: UserDefinedClassLoader::DoLoadClass(Global_Env*, String const*) (/export/cruise/trunk/cc/projects/drlvm/trunk/vm/vmcore/src/class_support/classloader.cpp:1534)
 53: ClassLoader::LoadClass(Global_Env*, String const*) (/export/cruise/trunk/cc/projects/drlvm/trunk/vm/vmcore/src/class_support/classloader.cpp:1400)
 54: ClassLoader::LoadVerifyAndPrepareClass(Global_Env*, String const*) (/export/cruise/trunk/cc/projects/drlvm/trunk/vm/vmcore/src/class_support/classloader.cpp:367)
 55: class_load_verify_prepare_by_loader_jni(Global_Env*, String const*, ClassLoader*) (/export/cruise/trunk/cc/projects/drlvm/trunk/vm/vmcore/src/class_support/Class_File_Loader.cpp:3644)
 56: FindClass(JNIEnv_External*, String*) (/export/cruise/trunk/cc/projects/drlvm/trunk/vm/vmcore/src/jni/jni_utils.cpp:688)
 57: FindClass(JNIEnv_External*, char const*) (/export/cruise/trunk/cc/projects/drlvm/trunk/vm/vmcore/src/jni/jni.cpp:638)
 58: main_runJavaMain (../shared/main.c:1230)
 59: invocation (../shared/main.c:732)
 60: gpProtectedMain (../shared/main.c:381)
 61: main (../shared/cmain.c:146)
 62: __libc_start_main (??:-1)
 63: _start (../sysdeps/i386/elf/start.S:105)
<end of stack trace>
Running PopFrame1
java: /export/cruise/trunk/cc/projects/drlvm/trunk/vm/vmcore/src/class_support/classloader.cpp:365: Class* ClassLoader::LoadVerifyAndPrepareClass(Global_Env*, const String*): Assertion `hythread_is_suspend_enabled()' failed.
SIGABRT in VM code.
Stack trace:
  0: ?? (??:-1)
  1: abort (??:-1)
  2: __assert_fail (??:-1)
  3: ClassLoader::LoadVerifyAndPrepareClass(Global_Env*, String const*) (/export/cruise/trunk/cc/projects/drlvm/trunk/vm/vmcore/src/class_support/classloader.cpp:367)
  4: Global_Env::LoadCoreClass(String const*) (/export/cruise/trunk/cc/projects/drlvm/trunk/vm/vmcore/src/class_support/Environment.cpp:280)
  5: Global_Env::LoadCoreClass(char const*) (/export/cruise/trunk/cc/projects/drlvm/trunk/vm/vmcore/src/class_support/Environment.cpp:292)
  6: getClassRegistryMethod (/export/cruise/trunk/cc/projects/drlvm/trunk/vm/vmcore/src/class_support/classloader.cpp:1601)
  7: ClassLoader::InsertClass(Class*) (/export/cruise/trunk/cc/projects/drlvm/trunk/vm/vmcore/src/class_support/classloader.cpp:1645)
  8: ClassLoader::DefineClass(Global_Env*, char const*, unsigned char*, unsigned int, unsigned int, String const**) (/export/cruise/trunk/cc/projects/drlvm/trunk/vm/vmcore/src/class_support/classloader.cpp:317)
  9: DefineClass(JNIEnv_External*, char const*, _jobject*, signed char const*, int) (/export/cruise/trunk/cc/projects/drlvm/trunk/vm/vmcore/src/jni/jni.cpp:603)
 10: Java_java_lang_ClassLoader_defineClass0 (/export/cruise/trunk/cc/projects/drlvm/trunk/vm/vmcore/src/kernel_classes/native/java_lang_VMClassRegistry.cpp:64)
 11: 0x5294E061  <Generated stub>
 12: java/lang/ClassLoader.defineClass(Ljava/lang/String;[BIILjava/security/ProtectionDomain;)Ljava/lang/Class; (ClassLoader.java:436)
 13: java/security/SecureClassLoader.defineClass(Ljava/lang/String;[BIILjava/security/CodeSource;)Ljava/lang/Class; (SecureClassLoader.java:70)
 14: java/net/URLClassLoader.findClassImpl([Ljava/net/URL;Ljava/lang/String;)Ljava/lang/Class; (URLClassLoader.java:1214)
 15: java/net/URLClassLoader$4.run()Ljava/lang/Class; (URLClassLoader.java:625)
 16: java/net/URLClassLoader$4.run()Ljava/lang/Object; (URLClassLoader.java:1)
 17: java/security/AccessController.doPrivilegedImpl(Ljava/security/PrivilegedAction;Ljava/security/AccessControlContext;)Ljava/lang/Object; (AccessController.java:173)
 18: java/security/AccessController.doPrivileged(Ljava/security/PrivilegedAction;Ljava/security/AccessControlContext;)Ljava/lang/Object; (AccessController.java:64)
 19: java/net/URLClassLoader.findClass(Ljava/lang/String;)Ljava/lang/Class; (URLClassLoader.java:622)
 20: java/lang/ClassLoader.loadClass(Ljava/lang/String;Z)Ljava/lang/Class; (ClassLoader.java:574)
 21: java/lang/ClassLoader$SystemClassLoader.loadClass(Ljava/lang/String;Z)Ljava/lang/Class; (ClassLoader.java:962)
 22: java/lang/ClassLoader.loadClass(Ljava/lang/String;)Ljava/lang/Class; (ClassLoader.java:319)
 23: vm_invoke_native_array_stub (/export/cruise/trunk/cc/projects/drlvm/trunk/vm/vmcore/src/util/ia32/base/invoke_native_stub_ia32.asm:41)
 24: JIT_execute_method_default(void*, _jmethodID*, jvalue*, jvalue*) (/export/cruise/trunk/cc/projects/drlvm/trunk/vm/vmcore/src/util/ia32/base/ini_iA32.cpp:206)
 25: DrlEMImpl::executeMethod(_jmethodID*, jvalue*, jvalue*) (/export/cruise/trunk/cc/projects/drlvm/trunk/vm/em/src/DrlEMImpl.cpp:509)
 26: ExecuteMethod (/export/cruise/trunk/cc/projects/drlvm/trunk/vm/em/src/em_intf.cpp:43)
 27: vm_execute_java_method_array(_jmethodID*, jvalue*, jvalue*) (/export/cruise/trunk/cc/projects/drlvm/trunk/vm/vmcore/src/jit/ini.cpp:60)
 28: UserDefinedClassLoader::DoLoadClass(Global_Env*, String const*) (/export/cruise/trunk/cc/projects/drlvm/trunk/vm/vmcore/src/class_support/classloader.cpp:1534)
 29: ClassLoader::LoadClass(Global_Env*, String const*) (/export/cruise/trunk/cc/projects/drlvm/trunk/vm/vmcore/src/class_support/classloader.cpp:1400)
 30: ClassLoader::LoadVerifyAndPrepareClass(Global_Env*, String const*) (/export/cruise/trunk/cc/projects/drlvm/trunk/vm/vmcore/src/class_support/classloader.cpp:367)
 31: Class::load_ancestors(Global_Env*) (/export/cruise/trunk/cc/projects/drlvm/trunk/vm/vmcore/src/class_support/Class.cpp:326)
 32: ClassLoader::DefineClass(Global_Env*, char const*, unsigned char*, unsigned int, unsigned int, String const**) (/export/cruise/trunk/cc/projects/drlvm/trunk/vm/vmcore/src/class_support/classloader.cpp:312)
 33: DefineClass(JNIEnv_External*, char const*, _jobject*, signed char const*, int) (/export/cruise/trunk/cc/projects/drlvm/trunk/vm/vmcore/src/jni/jni.cpp:603)
 34: Java_java_lang_ClassLoader_defineClass0 (/export/cruise/trunk/cc/projects/drlvm/trunk/vm/vmcore/src/kernel_classes/native/java_lang_VMClassRegistry.cpp:64)
 35: 0x5294E061  <Generated stub>
 36: java/lang/ClassLoader.defineClass(Ljava/lang/String;[BIILjava/security/ProtectionDomain;)Ljava/lang/Class; (ClassLoader.java:436)
 37: java/security/SecureClassLoader.defineClass(Ljava/lang/String;[BIILjava/security/CodeSource;)Ljava/lang/Class; (SecureClassLoader.java:70)
 38: java/net/URLClassLoader.findClassImpl([Ljava/net/URL;Ljava/lang/String;)Ljava/lang/Class; (URLClassLoader.java:1214)
 39: java/net/URLClassLoader$4.run()Ljava/lang/Class; (URLClassLoader.java:625)
 40: java/net/URLClassLoader$4.run()Ljava/lang/Object; (URLClassLoader.java:1)
 41: java/security/AccessController.doPrivilegedImpl(Ljava/security/PrivilegedAction;Ljava/security/AccessControlContext;)Ljava/lang/Object; (AccessController.java:173)
 42: java/security/AccessController.doPrivileged(Ljava/security/PrivilegedAction;Ljava/security/AccessControlContext;)Ljava/lang/Object; (AccessController.java:64)
 43: java/net/URLClassLoader.findClass(Ljava/lang/String;)Ljava/lang/Class; (URLClassLoader.java:622)
 44: java/lang/ClassLoader.loadClass(Ljava/lang/String;Z)Ljava/lang/Class; (ClassLoader.java:574)
 45: java/lang/ClassLoader$SystemClassLoader.loadClass(Ljava/lang/String;Z)Ljava/lang/Class; (ClassLoader.java:962)
 46: java/lang/ClassLoader.loadClass(Ljava/lang/String;)Ljava/lang/Class; (ClassLoader.java:319)
 47: vm_invoke_native_array_stub (/export/cruise/trunk/cc/projects/drlvm/trunk/vm/vmcore/src/util/ia32/base/invoke_native_stub_ia32.asm:41)
 48: JIT_execute_method_default(void*, _jmethodID*, jvalue*, jvalue*) (/export/cruise/trunk/cc/projects/drlvm/trunk/vm/vmcore/src/util/ia32/base/ini_iA32.cpp:206)
 49: DrlEMImpl::executeMethod(_jmethodID*, jvalue*, jvalue*) (/export/cruise/trunk/cc/projects/drlvm/trunk/vm/em/src/DrlEMImpl.cpp:509)
 50: ExecuteMethod (/export/cruise/trunk/cc/projects/drlvm/trunk/vm/em/src/em_intf.cpp:43)
 51: vm_execute_java_method_array(_jmethodID*, jvalue*, jvalue*) (/export/cruise/trunk/cc/projects/drlvm/trunk/vm/vmcore/src/jit/ini.cpp:60)
 52: UserDefinedClassLoader::DoLoadClass(Global_Env*, String const*) (/export/cruise/trunk/cc/projects/drlvm/trunk/vm/vmcore/src/class_support/classloader.cpp:1534)
 53: ClassLoader::LoadClass(Global_Env*, String const*) (/export/cruise/trunk/cc/projects/drlvm/trunk/vm/vmcore/src/class_support/classloader.cpp:1400)
 54: ClassLoader::LoadVerifyAndPrepareClass(Global_Env*, String const*) (/export/cruise/trunk/cc/projects/drlvm/trunk/vm/vmcore/src/class_support/classloader.cpp:367)
 55: class_load_verify_prepare_by_loader_jni(Global_Env*, String const*, ClassLoader*) (/export/cruise/trunk/cc/projects/drlvm/trunk/vm/vmcore/src/class_support/Class_File_Loader.cpp:3644)
 56: FindClass(JNIEnv_External*, String*) (/export/cruise/trunk/cc/projects/drlvm/trunk/vm/vmcore/src/jni/jni_utils.cpp:688)
 57: FindClass(JNIEnv_External*, char const*) (/export/cruise/trunk/cc/projects/drlvm/trunk/vm/vmcore/src/jni/jni.cpp:638)
 58: main_runJavaMain (../shared/main.c:1230)
 59: invocation (../shared/main.c:732)
 60: gpProtectedMain (../shared/main.c:381)
 61: main (../shared/cmain.c:146)
 62: __libc_start_main (??:-1)
 63: _start (../sysdeps/i386/elf/start.S:105)
<end of stack trace>
Running SingleStep1
java: /export/cruise/trunk/cc/projects/drlvm/trunk/vm/vmcore/src/class_support/classloader.cpp:365: Class* ClassLoader::LoadVerifyAndPrepareClass(Global_Env*, const String*): Assertion `hythread_is_suspend_enabled()' failed.
SIGABRT in VM code.
Stack trace:
  0: ?? (??:-1)
  1: abort (??:-1)
  2: __assert_fail (??:-1)
  3: ClassLoader::LoadVerifyAndPrepareClass(Global_Env*, String const*) (/export/cruise/trunk/cc/projects/drlvm/trunk/vm/vmcore/src/class_support/classloader.cpp:367)
  4: Global_Env::LoadCoreClass(String const*) (/export/cruise/trunk/cc/projects/drlvm/trunk/vm/vmcore/src/class_support/Environment.cpp:280)
  5: Global_Env::LoadCoreClass(char const*) (/export/cruise/trunk/cc/projects/drlvm/trunk/vm/vmcore/src/class_support/Environment.cpp:292)
  6: getClassRegistryMethod (/export/cruise/trunk/cc/projects/drlvm/trunk/vm/vmcore/src/class_support/classloader.cpp:1601)
  7: ClassLoader::InsertClass(Class*) (/export/cruise/trunk/cc/projects/drlvm/trunk/vm/vmcore/src/class_support/classloader.cpp:1645)
  8: ClassLoader::DefineClass(Global_Env*, char const*, unsigned char*, unsigned int, unsigned int, String const**) (/export/cruise/trunk/cc/projects/drlvm/trunk/vm/vmcore/src/class_support/classloader.cpp:317)
  9: DefineClass(JNIEnv_External*, char const*, _jobject*, signed char const*, int) (/export/cruise/trunk/cc/projects/drlvm/trunk/vm/vmcore/src/jni/jni.cpp:603)
 10: Java_java_lang_ClassLoader_defineClass0 (/export/cruise/trunk/cc/projects/drlvm/trunk/vm/vmcore/src/kernel_classes/native/java_lang_VMClassRegistry.cpp:64)
 11: 0x5293F683  <Generated stub>
 12: java/lang/ClassLoader.defineClass(Ljava/lang/String;[BIILjava/security/ProtectionDomain;)Ljava/lang/Class; (ClassLoader.java:436)
 13: java/security/SecureClassLoader.defineClass(Ljava/lang/String;[BIILjava/security/CodeSource;)Ljava/lang/Class; (SecureClassLoader.java:70)
 14: java/net/URLClassLoader.findClassImpl([Ljava/net/URL;Ljava/lang/String;)Ljava/lang/Class; (URLClassLoader.java:1214)
 15: java/net/URLClassLoader$4.run()Ljava/lang/Class; (URLClassLoader.java:625)
 16: java/net/URLClassLoader$4.run()Ljava/lang/Object; (URLClassLoader.java:1)
 17: java/security/AccessController.doPrivilegedImpl(Ljava/security/PrivilegedAction;Ljava/security/AccessControlContext;)Ljava/lang/Object; (AccessController.java:173)
 18: java/security/AccessController.doPrivileged(Ljava/security/PrivilegedAction;Ljava/security/AccessControlContext;)Ljava/lang/Object; (AccessController.java:64)
 19: java/net/URLClassLoader.findClass(Ljava/lang/String;)Ljava/lang/Class; (URLClassLoader.java:622)
 20: java/lang/ClassLoader.loadClass(Ljava/lang/String;Z)Ljava/lang/Class; (ClassLoader.java:574)
 21: java/lang/ClassLoader$SystemClassLoader.loadClass(Ljava/lang/String;Z)Ljava/lang/Class; (ClassLoader.java:962)
 22: java/lang/ClassLoader.loadClass(Ljava/lang/String;)Ljava/lang/Class; (ClassLoader.java:319)
 23: vm_invoke_native_array_stub (/export/cruise/trunk/cc/projects/drlvm/trunk/vm/vmcore/src/util/ia32/base/invoke_native_stub_ia32.asm:41)
 24: JIT_execute_method_default(void*, _jmethodID*, jvalue*, jvalue*) (/export/cruise/trunk/cc/projects/drlvm/trunk/vm/vmcore/src/util/ia32/base/ini_iA32.cpp:206)
 25: DrlEMImpl::executeMethod(_jmethodID*, jvalue*, jvalue*) (/export/cruise/trunk/cc/projects/drlvm/trunk/vm/em/src/DrlEMImpl.cpp:509)
 26: ExecuteMethod (/export/cruise/trunk/cc/projects/drlvm/trunk/vm/em/src/em_intf.cpp:43)
 27: vm_execute_java_method_array(_jmethodID*, jvalue*, jvalue*) (/export/cruise/trunk/cc/projects/drlvm/trunk/vm/vmcore/src/jit/ini.cpp:60)
 28: UserDefinedClassLoader::DoLoadClass(Global_Env*, String const*) (/export/cruise/trunk/cc/projects/drlvm/trunk/vm/vmcore/src/class_support/classloader.cpp:1534)
 29: ClassLoader::LoadClass(Global_Env*, String const*) (/export/cruise/trunk/cc/projects/drlvm/trunk/vm/vmcore/src/class_support/classloader.cpp:1400)
 30: ClassLoader::LoadVerifyAndPrepareClass(Global_Env*, String const*) (/export/cruise/trunk/cc/projects/drlvm/trunk/vm/vmcore/src/class_support/classloader.cpp:367)
 31: Class::load_ancestors(Global_Env*) (/export/cruise/trunk/cc/projects/drlvm/trunk/vm/vmcore/src/class_support/Class.cpp:326)
 32: ClassLoader::DefineClass(Global_Env*, char const*, unsigned char*, unsigned int, unsigned int, String const**) (/export/cruise/trunk/cc/projects/drlvm/trunk/vm/vmcore/src/class_support/classloader.cpp:312)
 33: DefineClass(JNIEnv_External*, char const*, _jobject*, signed char const*, int) (/export/cruise/trunk/cc/projects/drlvm/trunk/vm/vmcore/src/jni/jni.cpp:603)
 34: Java_java_lang_ClassLoader_defineClass0 (/export/cruise/trunk/cc/projects/drlvm/trunk/vm/vmcore/src/kernel_classes/native/java_lang_VMClassRegistry.cpp:64)
 35: 0x5293F683  <Generated stub>
 36: java/lang/ClassLoader.defineClass(Ljava/lang/String;[BIILjava/security/ProtectionDomain;)Ljava/lang/Class; (ClassLoader.java:436)
 37: java/security/SecureClassLoader.defineClass(Ljava/lang/String;[BIILjava/security/CodeSource;)Ljava/lang/Class; (SecureClassLoader.java:70)
 38: java/net/URLClassLoader.findClassImpl([Ljava/net/URL;Ljava/lang/String;)Ljava/lang/Class; (URLClassLoader.java:1214)
 39: java/net/URLClassLoader$4.run()Ljava/lang/Class; (URLClassLoader.java:625)
 40: java/net/URLClassLoader$4.run()Ljava/lang/Object; (URLClassLoader.java:1)
 41: java/security/AccessController.doPrivilegedImpl(Ljava/security/PrivilegedAction;Ljava/security/AccessControlContext;)Ljava/lang/Object; (AccessController.java:173)
 42: java/security/AccessController.doPrivileged(Ljava/security/PrivilegedAction;Ljava/security/AccessControlContext;)Ljava/lang/Object; (AccessController.java:64)
 43: java/net/URLClassLoader.findClass(Ljava/lang/String;)Ljava/lang/Class; (URLClassLoader.java:622)
 44: java/lang/ClassLoader.loadClass(Ljava/lang/String;Z)Ljava/lang/Class; (ClassLoader.java:574)
 45: java/lang/ClassLoader$SystemClassLoader.loadClass(Ljava/lang/String;Z)Ljava/lang/Class; (ClassLoader.java:962)
 46: java/lang/ClassLoader.loadClass(Ljava/lang/String;)Ljava/lang/Class; (ClassLoader.java:319)
 47: vm_invoke_native_array_stub (/export/cruise/trunk/cc/projects/drlvm/trunk/vm/vmcore/src/util/ia32/base/invoke_native_stub_ia32.asm:41)
 48: JIT_execute_method_default(void*, _jmethodID*, jvalue*, jvalue*) (/export/cruise/trunk/cc/projects/drlvm/trunk/vm/vmcore/src/util/ia32/base/ini_iA32.cpp:206)
 49: DrlEMImpl::executeMethod(_jmethodID*, jvalue*, jvalue*) (/export/cruise/trunk/cc/projects/drlvm/trunk/vm/em/src/DrlEMImpl.cpp:509)
 50: ExecuteMethod (/export/cruise/trunk/cc/projects/drlvm/trunk/vm/em/src/em_intf.cpp:43)
 51: vm_execute_java_method_array(_jmethodID*, jvalue*, jvalue*) (/export/cruise/trunk/cc/projects/drlvm/trunk/vm/vmcore/src/jit/ini.cpp:60)
 52: UserDefinedClassLoader::DoLoadClass(Global_Env*, String const*) (/export/cruise/trunk/cc/projects/drlvm/trunk/vm/vmcore/src/class_support/classloader.cpp:1534)
 53: ClassLoader::LoadClass(Global_Env*, String const*) (/export/cruise/trunk/cc/projects/drlvm/trunk/vm/vmcore/src/class_support/classloader.cpp:1400)
 54: ClassLoader::LoadVerifyAndPrepareClass(Global_Env*, String const*) (/export/cruise/trunk/cc/projects/drlvm/trunk/vm/vmcore/src/class_support/classloader.cpp:367)
 55: class_load_verify_prepare_by_loader_jni(Global_Env*, String const*, ClassLoader*) (/export/cruise/trunk/cc/projects/drlvm/trunk/vm/vmcore/src/class_support/Class_File_Loader.cpp:3644)
 56: FindClass(JNIEnv_External*, String*) (/export/cruise/trunk/cc/projects/drlvm/trunk/vm/vmcore/src/jni/jni_utils.cpp:688)
 57: FindClass(JNIEnv_External*, char const*) (/export/cruise/trunk/cc/projects/drlvm/trunk/vm/vmcore/src/jni/jni.cpp:638)
 58: main_runJavaMain (../shared/main.c:1230)
 59: invocation (../shared/main.c:732)
 60: gpProtectedMain (../shared/main.c:381)
 61: main (../shared/cmain.c:146)
 62: __libc_start_main (??:-1)
 63: _start (../sysdeps/i386/elf/start.S:105)
<end of stack trace>
Running VMInit1
java: /export/cruise/trunk/cc/projects/drlvm/trunk/vm/vmcore/src/class_support/classloader.cpp:365: Class* ClassLoader::LoadVerifyAndPrepareClass(Global_Env*, const String*): Assertion `hythread_is_suspend_enabled()' failed.
SIGABRT in VM code.
Stack trace:
  0: ?? (??:-1)
  1: abort (??:-1)
  2: __assert_fail (??:-1)
  3: ClassLoader::LoadVerifyAndPrepareClass(Global_Env*, String const*) (/export/cruise/trunk/cc/projects/drlvm/trunk/vm/vmcore/src/class_support/classloader.cpp:367)
  4: Global_Env::LoadCoreClass(String const*) (/export/cruise/trunk/cc/projects/drlvm/trunk/vm/vmcore/src/class_support/Environment.cpp:280)
  5: Global_Env::LoadCoreClass(char const*) (/export/cruise/trunk/cc/projects/drlvm/trunk/vm/vmcore/src/class_support/Environment.cpp:292)
  6: getClassRegistryMethod (/export/cruise/trunk/cc/projects/drlvm/trunk/vm/vmcore/src/class_support/classloader.cpp:1601)
  7: ClassLoader::InsertClass(Class*) (/export/cruise/trunk/cc/projects/drlvm/trunk/vm/vmcore/src/class_support/classloader.cpp:1645)
  8: ClassLoader::DefineClass(Global_Env*, char const*, unsigned char*, unsigned int, unsigned int, String const**) (/export/cruise/trunk/cc/projects/drlvm/trunk/vm/vmcore/src/class_support/classloader.cpp:317)
  9: DefineClass(JNIEnv_External*, char const*, _jobject*, signed char const*, int) (/export/cruise/trunk/cc/projects/drlvm/trunk/vm/vmcore/src/jni/jni.cpp:603)
 10: Java_java_lang_ClassLoader_defineClass0 (/export/cruise/trunk/cc/projects/drlvm/trunk/vm/vmcore/src/kernel_classes/native/java_lang_VMClassRegistry.cpp:64)
 11: 0x52D11A63  <Generated stub>
 12: java/lang/ClassLoader.defineClass(Ljava/lang/String;[BIILjava/security/ProtectionDomain;)Ljava/lang/Class; (ClassLoader.java:436)
 13: java/security/SecureClassLoader.defineClass(Ljava/lang/String;[BIILjava/security/CodeSource;)Ljava/lang/Class; (SecureClassLoader.java:70)
 14: java/net/URLClassLoader.findClassImpl([Ljava/net/URL;Ljava/lang/String;)Ljava/lang/Class; (URLClassLoader.java:1214)
 15: java/net/URLClassLoader$4.run()Ljava/lang/Class; (URLClassLoader.java:625)
 16: java/net/URLClassLoader$4.run()Ljava/lang/Object; (URLClassLoader.java:1)
 17: java/security/AccessController.doPrivilegedImpl(Ljava/security/PrivilegedAction;Ljava/security/AccessControlContext;)Ljava/lang/Object; (AccessController.java:173)
 18: java/security/AccessController.doPrivileged(Ljava/security/PrivilegedAction;Ljava/security/AccessControlContext;)Ljava/lang/Object; (AccessController.java:64)
 19: java/net/URLClassLoader.findClass(Ljava/lang/String;)Ljava/lang/Class; (URLClassLoader.java:622)
 20: java/lang/ClassLoader.loadClass(Ljava/lang/String;Z)Ljava/lang/Class; (ClassLoader.java:574)
 21: java/lang/ClassLoader$SystemClassLoader.loadClass(Ljava/lang/String;Z)Ljava/lang/Class; (ClassLoader.java:962)
 22: java/lang/ClassLoader.loadClass(Ljava/lang/String;)Ljava/lang/Class; (ClassLoader.java:319)
 23: vm_invoke_native_array_stub (/export/cruise/trunk/cc/projects/drlvm/trunk/vm/vmcore/src/util/ia32/base/invoke_native_stub_ia32.asm:41)
 24: JIT_execute_method_default(void*, _jmethodID*, jvalue*, jvalue*) (/export/cruise/trunk/cc/projects/drlvm/trunk/vm/vmcore/src/util/ia32/base/ini_iA32.cpp:206)
 25: DrlEMImpl::executeMethod(_jmethodID*, jvalue*, jvalue*) (/export/cruise/trunk/cc/projects/drlvm/trunk/vm/em/src/DrlEMImpl.cpp:509)
 26: ExecuteMethod (/export/cruise/trunk/cc/projects/drlvm/trunk/vm/em/src/em_intf.cpp:43)
 27: vm_execute_java_method_array(_jmethodID*, jvalue*, jvalue*) (/export/cruise/trunk/cc/projects/drlvm/trunk/vm/vmcore/src/jit/ini.cpp:60)
 28: UserDefinedClassLoader::DoLoadClass(Global_Env*, String const*) (/export/cruise/trunk/cc/projects/drlvm/trunk/vm/vmcore/src/class_support/classloader.cpp:1534)
 29: ClassLoader::LoadClass(Global_Env*, String const*) (/export/cruise/trunk/cc/projects/drlvm/trunk/vm/vmcore/src/class_support/classloader.cpp:1400)
 30: ClassLoader::LoadVerifyAndPrepareClass(Global_Env*, String const*) (/export/cruise/trunk/cc/projects/drlvm/trunk/vm/vmcore/src/class_support/classloader.cpp:367)
 31: class_load_verify_prepare_by_loader_jni(Global_Env*, String const*, ClassLoader*) (/export/cruise/trunk/cc/projects/drlvm/trunk/vm/vmcore/src/class_support/Class_File_Loader.cpp:3644)
 32: FindClass(JNIEnv_External*, String*) (/export/cruise/trunk/cc/projects/drlvm/trunk/vm/vmcore/src/jni/jni_utils.cpp:688)
 33: FindClass(JNIEnv_External*, char const*) (/export/cruise/trunk/cc/projects/drlvm/trunk/vm/vmcore/src/jni/jni.cpp:638)
 34: JNIEnv_External::FindClass(char const*) (/export/cruise/trunk/cc/projects/drlvm/trunk/vm/include/jni.h:627)
 35: vm_init_callback (/export/cruise/trunk/cc/projects/drlvm/trunk/vm/tests/jvmti/VMInit1/VMInit1.cpp:6)
 36: jvmti_send_vm_init_event (/export/cruise/trunk/cc/projects/drlvm/trunk/vm/vmcore/src/jvmti/jvmti_event.cpp:472)
 37: JNI_CreateJavaVM (/export/cruise/trunk/cc/projects/drlvm/trunk/vm/vmcore/src/jni/jni.cpp:538)
 38: invocation (../shared/main.c:660)
 39: gpProtectedMain (../shared/main.c:381)
 40: main (../shared/cmain.c:146)
 41: __libc_start_main (??:-1)
 42: _start (../sysdeps/i386/elf/start.S:105)
<end of stack trace>

        ==================================
        Run JVMTI tests using jitrino.JET
        ==================================
        
Running Breakpoint1
java: /export/cruise/trunk/cc/projects/drlvm/trunk/vm/vmcore/src/class_support/classloader.cpp:365: Class* ClassLoader::LoadVerifyAndPrepareClass(Global_Env*, const String*): Assertion `hythread_is_suspend_enabled()' failed.
SIGABRT in VM code.
Stack trace:
  0: ?? (??:-1)
  1: abort (??:-1)
  2: __assert_fail (??:-1)
  3: ClassLoader::LoadVerifyAndPrepareClass(Global_Env*, String const*) (/export/cruise/trunk/cc/projects/drlvm/trunk/vm/vmcore/src/class_support/classloader.cpp:367)
  4: Global_Env::LoadCoreClass(String const*) (/export/cruise/trunk/cc/projects/drlvm/trunk/vm/vmcore/src/class_support/Environment.cpp:280)
  5: Global_Env::LoadCoreClass(char const*) (/export/cruise/trunk/cc/projects/drlvm/trunk/vm/vmcore/src/class_support/Environment.cpp:292)
  6: getClassRegistryMethod (/export/cruise/trunk/cc/projects/drlvm/trunk/vm/vmcore/src/class_support/classloader.cpp:1601)
  7: ClassLoader::InsertClass(Class*) (/export/cruise/trunk/cc/projects/drlvm/trunk/vm/vmcore/src/class_support/classloader.cpp:1645)
  8: ClassLoader::DefineClass(Global_Env*, char const*, unsigned char*, unsigned int, unsigned int, String const**) (/export/cruise/trunk/cc/projects/drlvm/trunk/vm/vmcore/src/class_support/classloader.cpp:317)
  9: DefineClass(JNIEnv_External*, char const*, _jobject*, signed char const*, int) (/export/cruise/trunk/cc/projects/drlvm/trunk/vm/vmcore/src/jni/jni.cpp:603)
 10: Java_java_lang_ClassLoader_defineClass0 (/export/cruise/trunk/cc/projects/drlvm/trunk/vm/vmcore/src/kernel_classes/native/java_lang_VMClassRegistry.cpp:64)
 11: 0x5293F683  <Generated stub>
 12: java/lang/ClassLoader.defineClass(Ljava/lang/String;[BIILjava/security/ProtectionDomain;)Ljava/lang/Class; (ClassLoader.java:436)
 13: java/security/SecureClassLoader.defineClass(Ljava/lang/String;[BIILjava/security/CodeSource;)Ljava/lang/Class; (SecureClassLoader.java:70)
 14: java/net/URLClassLoader.findClassImpl([Ljava/net/URL;Ljava/lang/String;)Ljava/lang/Class; (URLClassLoader.java:1214)
 15: java/net/URLClassLoader$4.run()Ljava/lang/Class; (URLClassLoader.java:625)
 16: java/net/URLClassLoader$4.run()Ljava/lang/Object; (URLClassLoader.java:1)
 17: java/security/AccessController.doPrivilegedImpl(Ljava/security/PrivilegedAction;Ljava/security/AccessControlContext;)Ljava/lang/Object; (AccessController.java:173)
 18: java/security/AccessController.doPrivileged(Ljava/security/PrivilegedAction;Ljava/security/AccessControlContext;)Ljava/lang/Object; (AccessController.java:64)
 19: java/net/URLClassLoader.findClass(Ljava/lang/String;)Ljava/lang/Class; (URLClassLoader.java:622)
 20: java/lang/ClassLoader.loadClass(Ljava/lang/String;Z)Ljava/lang/Class; (ClassLoader.java:574)
 21: java/lang/ClassLoader$SystemClassLoader.loadClass(Ljava/lang/String;Z)Ljava/lang/Class; (ClassLoader.java:962)
 22: java/lang/ClassLoader.loadClass(Ljava/lang/String;)Ljava/lang/Class; (ClassLoader.java:319)
 23: vm_invoke_native_array_stub (/export/cruise/trunk/cc/projects/drlvm/trunk/vm/vmcore/src/util/ia32/base/invoke_native_stub_ia32.asm:41)
 24: JIT_execute_method_default(void*, _jmethodID*, jvalue*, jvalue*) (/export/cruise/trunk/cc/projects/drlvm/trunk/vm/vmcore/src/util/ia32/base/ini_iA32.cpp:206)
 25: DrlEMImpl::executeMethod(_jmethodID*, jvalue*, jvalue*) (/export/cruise/trunk/cc/projects/drlvm/trunk/vm/em/src/DrlEMImpl.cpp:509)
 26: ExecuteMethod (/export/cruise/trunk/cc/projects/drlvm/trunk/vm/em/src/em_intf.cpp:43)
 27: vm_execute_java_method_array(_jmethodID*, jvalue*, jvalue*) (/export/cruise/trunk/cc/projects/drlvm/trunk/vm/vmcore/src/jit/ini.cpp:60)
 28: UserDefinedClassLoader::DoLoadClass(Global_Env*, String const*) (/export/cruise/trunk/cc/projects/drlvm/trunk/vm/vmcore/src/class_support/classloader.cpp:1534)
 29: ClassLoader::LoadClass(Global_Env*, String const*) (/export/cruise/trunk/cc/projects/drlvm/trunk/vm/vmcore/src/class_support/classloader.cpp:1400)
 30: ClassLoader::LoadVerifyAndPrepareClass(Global_Env*, String const*) (/export/cruise/trunk/cc/projects/drlvm/trunk/vm/vmcore/src/class_support/classloader.cpp:367)
 31: Class::load_ancestors(Global_Env*) (/export/cruise/trunk/cc/projects/drlvm/trunk/vm/vmcore/src/class_support/Class.cpp:326)
 32: ClassLoader::DefineClass(Global_Env*, char const*, unsigned char*, unsigned int, unsigned int, String const**) (/export/cruise/trunk/cc/projects/drlvm/trunk/vm/vmcore/src/class_support/classloader.cpp:312)
 33: DefineClass(JNIEnv_External*, char const*, _jobject*, signed char const*, int) (/export/cruise/trunk/cc/projects/drlvm/trunk/vm/vmcore/src/jni/jni.cpp:603)
 34: Java_java_lang_ClassLoader_defineClass0 (/export/cruise/trunk/cc/projects/drlvm/trunk/vm/vmcore/src/kernel_classes/native/java_lang_VMClassRegistry.cpp:64)
 35: 0x5293F683  <Generated stub>
 36: java/lang/ClassLoader.defineClass(Ljava/lang/String;[BIILjava/security/ProtectionDomain;)Ljava/lang/Class; (ClassLoader.java:436)
 37: java/security/SecureClassLoader.defineClass(Ljava/lang/String;[BIILjava/security/CodeSource;)Ljava/lang/Class; (SecureClassLoader.java:70)
 38: java/net/URLClassLoader.findClassImpl([Ljava/net/URL;Ljava/lang/String;)Ljava/lang/Class; (URLClassLoader.java:1214)
 39: java/net/URLClassLoader$4.run()Ljava/lang/Class; (URLClassLoader.java:625)
 40: java/net/URLClassLoader$4.run()Ljava/lang/Object; (URLClassLoader.java:1)
 41: java/security/AccessController.doPrivilegedImpl(Ljava/security/PrivilegedAction;Ljava/security/AccessControlContext;)Ljava/lang/Object; (AccessController.java:173)
 42: java/security/AccessController.doPrivileged(Ljava/security/PrivilegedAction;Ljava/security/AccessControlContext;)Ljava/lang/Object; (AccessController.java:64)
 43: java/net/URLClassLoader.findClass(Ljava/lang/String;)Ljava/lang/Class; (URLClassLoader.java:622)
 44: java/lang/ClassLoader.loadClass(Ljava/lang/String;Z)Ljava/lang/Class; (ClassLoader.java:574)
 45: java/lang/ClassLoader$SystemClassLoader.loadClass(Ljava/lang/String;Z)Ljava/lang/Class; (ClassLoader.java:962)
 46: java/lang/ClassLoader.loadClass(Ljava/lang/String;)Ljava/lang/Class; (ClassLoader.java:319)
 47: vm_invoke_native_array_stub (/export/cruise/trunk/cc/projects/drlvm/trunk/vm/vmcore/src/util/ia32/base/invoke_native_stub_ia32.asm:41)
 48: JIT_execute_method_default(void*, _jmethodID*, jvalue*, jvalue*) (/export/cruise/trunk/cc/projects/drlvm/trunk/vm/vmcore/src/util/ia32/base/ini_iA32.cpp:206)
 49: DrlEMImpl::executeMethod(_jmethodID*, jvalue*, jvalue*) (/export/cruise/trunk/cc/projects/drlvm/trunk/vm/em/src/DrlEMImpl.cpp:509)
 50: ExecuteMethod (/export/cruise/trunk/cc/projects/drlvm/trunk/vm/em/src/em_intf.cpp:43)
 51: vm_execute_java_method_array(_jmethodID*, jvalue*, jvalue*) (/export/cruise/trunk/cc/projects/drlvm/trunk/vm/vmcore/src/jit/ini.cpp:60)
 52: UserDefinedClassLoader::DoLoadClass(Global_Env*, String const*) (/export/cruise/trunk/cc/projects/drlvm/trunk/vm/vmcore/src/class_support/classloader.cpp:1534)
 53: ClassLoader::LoadClass(Global_Env*, String const*) (/export/cruise/trunk/cc/projects/drlvm/trunk/vm/vmcore/src/class_support/classloader.cpp:1400)
 54: ClassLoader::LoadVerifyAndPrepareClass(Global_Env*, String const*) (/export/cruise/trunk/cc/projects/drlvm/trunk/vm/vmcore/src/class_support/classloader.cpp:367)
 55: class_load_verify_prepare_by_loader_jni(Global_Env*, String const*, ClassLoader*) (/export/cruise/trunk/cc/projects/drlvm/trunk/vm/vmcore/src/class_support/Class_File_Loader.cpp:3644)
 56: FindClass(JNIEnv_External*, String*) (/export/cruise/trunk/cc/projects/drlvm/trunk/vm/vmcore/src/jni/jni_utils.cpp:688)
 57: FindClass(JNIEnv_External*, char const*) (/export/cruise/trunk/cc/projects/drlvm/trunk/vm/vmcore/src/jni/jni.cpp:638)
 58: main_runJavaMain (../shared/main.c:1230)
 59: invocation (../shared/main.c:732)
 60: gpProtectedMain (../shared/main.c:381)
 61: main (../shared/cmain.c:146)
 62: __libc_start_main (??:-1)
 63: _start (../sysdeps/i386/elf/start.S:105)
<end of stack trace>
Running PopFrame1
java: /export/cruise/trunk/cc/projects/drlvm/trunk/vm/vmcore/src/class_support/classloader.cpp:365: Class* ClassLoader::LoadVerifyAndPrepareClass(Global_Env*, const String*): Assertion `hythread_is_suspend_enabled()' failed.
SIGABRT in VM code.
Stack trace:
  0: ?? (??:-1)
  1: abort (??:-1)
  2: __assert_fail (??:-1)
  3: ClassLoader::LoadVerifyAndPrepareClass(Global_Env*, String const*) (/export/cruise/trunk/cc/projects/drlvm/trunk/vm/vmcore/src/class_support/classloader.cpp:367)
  4: Global_Env::LoadCoreClass(String const*) (/export/cruise/trunk/cc/projects/drlvm/trunk/vm/vmcore/src/class_support/Environment.cpp:280)
  5: Global_Env::LoadCoreClass(char const*) (/export/cruise/trunk/cc/projects/drlvm/trunk/vm/vmcore/src/class_support/Environment.cpp:292)
  6: getClassRegistryMethod (/export/cruise/trunk/cc/projects/drlvm/trunk/vm/vmcore/src/class_support/classloader.cpp:1601)
  7: ClassLoader::InsertClass(Class*) (/export/cruise/trunk/cc/projects/drlvm/trunk/vm/vmcore/src/class_support/classloader.cpp:1645)
  8: ClassLoader::DefineClass(Global_Env*, char const*, unsigned char*, unsigned int, unsigned int, String const**) (/export/cruise/trunk/cc/projects/drlvm/trunk/vm/vmcore/src/class_support/classloader.cpp:317)
  9: DefineClass(JNIEnv_External*, char const*, _jobject*, signed char const*, int) (/export/cruise/trunk/cc/projects/drlvm/trunk/vm/vmcore/src/jni/jni.cpp:603)
 10: Java_java_lang_ClassLoader_defineClass0 (/export/cruise/trunk/cc/projects/drlvm/trunk/vm/vmcore/src/kernel_classes/native/java_lang_VMClassRegistry.cpp:64)
 11: 0x5294E061  <Generated stub>
 12: java/lang/ClassLoader.defineClass(Ljava/lang/String;[BIILjava/security/ProtectionDomain;)Ljava/lang/Class; (ClassLoader.java:436)
 13: java/security/SecureClassLoader.defineClass(Ljava/lang/String;[BIILjava/security/CodeSource;)Ljava/lang/Class; (SecureClassLoader.java:70)
 14: java/net/URLClassLoader.findClassImpl([Ljava/net/URL;Ljava/lang/String;)Ljava/lang/Class; (URLClassLoader.java:1214)
 15: java/net/URLClassLoader$4.run()Ljava/lang/Class; (URLClassLoader.java:625)
 16: java/net/URLClassLoader$4.run()Ljava/lang/Object; (URLClassLoader.java:1)
 17: java/security/AccessController.doPrivilegedImpl(Ljava/security/PrivilegedAction;Ljava/security/AccessControlContext;)Ljava/lang/Object; (AccessController.java:173)
 18: java/security/AccessController.doPrivileged(Ljava/security/PrivilegedAction;Ljava/security/AccessControlContext;)Ljava/lang/Object; (AccessController.java:64)
 19: java/net/URLClassLoader.findClass(Ljava/lang/String;)Ljava/lang/Class; (URLClassLoader.java:622)
 20: java/lang/ClassLoader.loadClass(Ljava/lang/String;Z)Ljava/lang/Class; (ClassLoader.java:574)
 21: java/lang/ClassLoader$SystemClassLoader.loadClass(Ljava/lang/String;Z)Ljava/lang/Class; (ClassLoader.java:962)
 22: java/lang/ClassLoader.loadClass(Ljava/lang/String;)Ljava/lang/Class; (ClassLoader.java:319)
 23: vm_invoke_native_array_stub (/export/cruise/trunk/cc/projects/drlvm/trunk/vm/vmcore/src/util/ia32/base/invoke_native_stub_ia32.asm:41)
 24: JIT_execute_method_default(void*, _jmethodID*, jvalue*, jvalue*) (/export/cruise/trunk/cc/projects/drlvm/trunk/vm/vmcore/src/util/ia32/base/ini_iA32.cpp:206)
 25: DrlEMImpl::executeMethod(_jmethodID*, jvalue*, jvalue*) (/export/cruise/trunk/cc/projects/drlvm/trunk/vm/em/src/DrlEMImpl.cpp:509)
 26: ExecuteMethod (/export/cruise/trunk/cc/projects/drlvm/trunk/vm/em/src/em_intf.cpp:43)
 27: vm_execute_java_method_array(_jmethodID*, jvalue*, jvalue*) (/export/cruise/trunk/cc/projects/drlvm/trunk/vm/vmcore/src/jit/ini.cpp:60)
 28: UserDefinedClassLoader::DoLoadClass(Global_Env*, String const*) (/export/cruise/trunk/cc/projects/drlvm/trunk/vm/vmcore/src/class_support/classloader.cpp:1534)
 29: ClassLoader::LoadClass(Global_Env*, String const*) (/export/cruise/trunk/cc/projects/drlvm/trunk/vm/vmcore/src/class_support/classloader.cpp:1400)
 30: ClassLoader::LoadVerifyAndPrepareClass(Global_Env*, String const*) (/export/cruise/trunk/cc/projects/drlvm/trunk/vm/vmcore/src/class_support/classloader.cpp:367)
 31: Class::load_ancestors(Global_Env*) (/export/cruise/trunk/cc/projects/drlvm/trunk/vm/vmcore/src/class_support/Class.cpp:326)
 32: ClassLoader::DefineClass(Global_Env*, char const*, unsigned char*, unsigned int, unsigned int, String const**) (/export/cruise/trunk/cc/projects/drlvm/trunk/vm/vmcore/src/class_support/classloader.cpp:312)
 33: DefineClass(JNIEnv_External*, char const*, _jobject*, signed char const*, int) (/export/cruise/trunk/cc/projects/drlvm/trunk/vm/vmcore/src/jni/jni.cpp:603)
 34: Java_java_lang_ClassLoader_defineClass0 (/export/cruise/trunk/cc/projects/drlvm/trunk/vm/vmcore/src/kernel_classes/native/java_lang_VMClassRegistry.cpp:64)
 35: 0x5294E061  <Generated stub>
 36: java/lang/ClassLoader.defineClass(Ljava/lang/String;[BIILjava/security/ProtectionDomain;)Ljava/lang/Class; (ClassLoader.java:436)
 37: java/security/SecureClassLoader.defineClass(Ljava/lang/String;[BIILjava/security/CodeSource;)Ljava/lang/Class; (SecureClassLoader.java:70)
 38: java/net/URLClassLoader.findClassImpl([Ljava/net/URL;Ljava/lang/String;)Ljava/lang/Class; (URLClassLoader.java:1214)
 39: java/net/URLClassLoader$4.run()Ljava/lang/Class; (URLClassLoader.java:625)
 40: java/net/URLClassLoader$4.run()Ljava/lang/Object; (URLClassLoader.java:1)
 41: java/security/AccessController.doPrivilegedImpl(Ljava/security/PrivilegedAction;Ljava/security/AccessControlContext;)Ljava/lang/Object; (AccessController.java:173)
 42: java/security/AccessController.doPrivileged(Ljava/security/PrivilegedAction;Ljava/security/AccessControlContext;)Ljava/lang/Object; (AccessController.java:64)
 43: java/net/URLClassLoader.findClass(Ljava/lang/String;)Ljava/lang/Class; (URLClassLoader.java:622)
 44: java/lang/ClassLoader.loadClass(Ljava/lang/String;Z)Ljava/lang/Class; (ClassLoader.java:574)
 45: java/lang/ClassLoader$SystemClassLoader.loadClass(Ljava/lang/String;Z)Ljava/lang/Class; (ClassLoader.java:962)
 46: java/lang/ClassLoader.loadClass(Ljava/lang/String;)Ljava/lang/Class; (ClassLoader.java:319)
 47: vm_invoke_native_array_stub (/export/cruise/trunk/cc/projects/drlvm/trunk/vm/vmcore/src/util/ia32/base/invoke_native_stub_ia32.asm:41)
 48: JIT_execute_method_default(void*, _jmethodID*, jvalue*, jvalue*) (/export/cruise/trunk/cc/projects/drlvm/trunk/vm/vmcore/src/util/ia32/base/ini_iA32.cpp:206)
 49: DrlEMImpl::executeMethod(_jmethodID*, jvalue*, jvalue*) (/export/cruise/trunk/cc/projects/drlvm/trunk/vm/em/src/DrlEMImpl.cpp:509)
 50: ExecuteMethod (/export/cruise/trunk/cc/projects/drlvm/trunk/vm/em/src/em_intf.cpp:43)
 51: vm_execute_java_method_array(_jmethodID*, jvalue*, jvalue*) (/export/cruise/trunk/cc/projects/drlvm/trunk/vm/vmcore/src/jit/ini.cpp:60)
 52: UserDefinedClassLoader::DoLoadClass(Global_Env*, String const*) (/export/cruise/trunk/cc/projects/drlvm/trunk/vm/vmcore/src/class_support/classloader.cpp:1534)
 53: ClassLoader::LoadClass(Global_Env*, String const*) (/export/cruise/trunk/cc/projects/drlvm/trunk/vm/vmcore/src/class_support/classloader.cpp:1400)
 54: ClassLoader::LoadVerifyAndPrepareClass(Global_Env*, String const*) (/export/cruise/trunk/cc/projects/drlvm/trunk/vm/vmcore/src/class_support/classloader.cpp:367)
 55: class_load_verify_prepare_by_loader_jni(Global_Env*, String const*, ClassLoader*) (/export/cruise/trunk/cc/projects/drlvm/trunk/vm/vmcore/src/class_support/Class_File_Loader.cpp:3644)
 56: FindClass(JNIEnv_External*, String*) (/export/cruise/trunk/cc/projects/drlvm/trunk/vm/vmcore/src/jni/jni_utils.cpp:688)
 57: FindClass(JNIEnv_External*, char const*) (/export/cruise/trunk/cc/projects/drlvm/trunk/vm/vmcore/src/jni/jni.cpp:638)
 58: main_runJavaMain (../shared/main.c:1230)
 59: invocation (../shared/main.c:732)
 60: gpProtectedMain (../shared/main.c:381)
 61: main (../shared/cmain.c:146)
 62: __libc_start_main (??:-1)
 63: _start (../sysdeps/i386/elf/start.S:105)
<end of stack trace>
Running SingleStep1
java: /export/cruise/trunk/cc/projects/drlvm/trunk/vm/vmcore/src/class_support/classloader.cpp:365: Class* ClassLoader::LoadVerifyAndPrepareClass(Global_Env*, const String*): Assertion `hythread_is_suspend_enabled()' failed.
SIGABRT in VM code.
Stack trace:
  0: ?? (??:-1)
  1: abort (??:-1)
  2: __assert_fail (??:-1)
  3: ClassLoader::LoadVerifyAndPrepareClass(Global_Env*, String const*) (/export/cruise/trunk/cc/projects/drlvm/trunk/vm/vmcore/src/class_support/classloader.cpp:367)
  4: Global_Env::LoadCoreClass(String const*) (/export/cruise/trunk/cc/projects/drlvm/trunk/vm/vmcore/src/class_support/Environment.cpp:280)
  5: Global_Env::LoadCoreClass(char const*) (/export/cruise/trunk/cc/projects/drlvm/trunk/vm/vmcore/src/class_support/Environment.cpp:292)
  6: getClassRegistryMethod (/export/cruise/trunk/cc/projects/drlvm/trunk/vm/vmcore/src/class_support/classloader.cpp:1601)
  7: ClassLoader::InsertClass(Class*) (/export/cruise/trunk/cc/projects/drlvm/trunk/vm/vmcore/src/class_support/classloader.cpp:1645)
  8: ClassLoader::DefineClass(Global_Env*, char const*, unsigned char*, unsigned int, unsigned int, String const**) (/export/cruise/trunk/cc/projects/drlvm/trunk/vm/vmcore/src/class_support/classloader.cpp:317)
  9: DefineClass(JNIEnv_External*, char const*, _jobject*, signed char const*, int) (/export/cruise/trunk/cc/projects/drlvm/trunk/vm/vmcore/src/jni/jni.cpp:603)
 10: Java_java_lang_ClassLoader_defineClass0 (/export/cruise/trunk/cc/projects/drlvm/trunk/vm/vmcore/src/kernel_classes/native/java_lang_VMClassRegistry.cpp:64)
 11: 0x5293F683  <Generated stub>
 12: java/lang/ClassLoader.defineClass(Ljava/lang/String;[BIILjava/security/ProtectionDomain;)Ljava/lang/Class; (ClassLoader.java:436)
 13: java/security/SecureClassLoader.defineClass(Ljava/lang/String;[BIILjava/security/CodeSource;)Ljava/lang/Class; (SecureClassLoader.java:70)
 14: java/net/URLClassLoader.findClassImpl([Ljava/net/URL;Ljava/lang/String;)Ljava/lang/Class; (URLClassLoader.java:1214)
 15: java/net/URLClassLoader$4.run()Ljava/lang/Class; (URLClassLoader.java:625)
 16: java/net/URLClassLoader$4.run()Ljava/lang/Object; (URLClassLoader.java:1)
 17: java/security/AccessController.doPrivilegedImpl(Ljava/security/PrivilegedAction;Ljava/security/AccessControlContext;)Ljava/lang/Object; (AccessController.java:173)
 18: java/security/AccessController.doPrivileged(Ljava/security/PrivilegedAction;Ljava/security/AccessControlContext;)Ljava/lang/Object; (AccessController.java:64)
 19: java/net/URLClassLoader.findClass(Ljava/lang/String;)Ljava/lang/Class; (URLClassLoader.java:622)
 20: java/lang/ClassLoader.loadClass(Ljava/lang/String;Z)Ljava/lang/Class; (ClassLoader.java:574)
 21: java/lang/ClassLoader$SystemClassLoader.loadClass(Ljava/lang/String;Z)Ljava/lang/Class; (ClassLoader.java:962)
 22: java/lang/ClassLoader.loadClass(Ljava/lang/String;)Ljava/lang/Class; (ClassLoader.java:319)
 23: vm_invoke_native_array_stub (/export/cruise/trunk/cc/projects/drlvm/trunk/vm/vmcore/src/util/ia32/base/invoke_native_stub_ia32.asm:41)
 24: JIT_execute_method_default(void*, _jmethodID*, jvalue*, jvalue*) (/export/cruise/trunk/cc/projects/drlvm/trunk/vm/vmcore/src/util/ia32/base/ini_iA32.cpp:206)
 25: DrlEMImpl::executeMethod(_jmethodID*, jvalue*, jvalue*) (/export/cruise/trunk/cc/projects/drlvm/trunk/vm/em/src/DrlEMImpl.cpp:509)
 26: ExecuteMethod (/export/cruise/trunk/cc/projects/drlvm/trunk/vm/em/src/em_intf.cpp:43)
 27: vm_execute_java_method_array(_jmethodID*, jvalue*, jvalue*) (/export/cruise/trunk/cc/projects/drlvm/trunk/vm/vmcore/src/jit/ini.cpp:60)
 28: UserDefinedClassLoader::DoLoadClass(Global_Env*, String const*) (/export/cruise/trunk/cc/projects/drlvm/trunk/vm/vmcore/src/class_support/classloader.cpp:1534)
 29: ClassLoader::LoadClass(Global_Env*, String const*) (/export/cruise/trunk/cc/projects/drlvm/trunk/vm/vmcore/src/class_support/classloader.cpp:1400)
 30: ClassLoader::LoadVerifyAndPrepareClass(Global_Env*, String const*) (/export/cruise/trunk/cc/projects/drlvm/trunk/vm/vmcore/src/class_support/classloader.cpp:367)
 31: Class::load_ancestors(Global_Env*) (/export/cruise/trunk/cc/projects/drlvm/trunk/vm/vmcore/src/class_support/Class.cpp:326)
 32: ClassLoader::DefineClass(Global_Env*, char const*, unsigned char*, unsigned int, unsigned int, String const**) (/export/cruise/trunk/cc/projects/drlvm/trunk/vm/vmcore/src/class_support/classloader.cpp:312)
 33: DefineClass(JNIEnv_External*, char const*, _jobject*, signed char const*, int) (/export/cruise/trunk/cc/projects/drlvm/trunk/vm/vmcore/src/jni/jni.cpp:603)
 34: Java_java_lang_ClassLoader_defineClass0 (/export/cruise/trunk/cc/projects/drlvm/trunk/vm/vmcore/src/kernel_classes/native/java_lang_VMClassRegistry.cpp:64)
 35: 0x5293F683  <Generated stub>
 36: java/lang/ClassLoader.defineClass(Ljava/lang/String;[BIILjava/security/ProtectionDomain;)Ljava/lang/Class; (ClassLoader.java:436)
 37: java/security/SecureClassLoader.defineClass(Ljava/lang/String;[BIILjava/security/CodeSource;)Ljava/lang/Class; (SecureClassLoader.java:70)
 38: java/net/URLClassLoader.findClassImpl([Ljava/net/URL;Ljava/lang/String;)Ljava/lang/Class; (URLClassLoader.java:1214)
 39: java/net/URLClassLoader$4.run()Ljava/lang/Class; (URLClassLoader.java:625)
 40: java/net/URLClassLoader$4.run()Ljava/lang/Object; (URLClassLoader.java:1)
 41: java/security/AccessController.doPrivilegedImpl(Ljava/security/PrivilegedAction;Ljava/security/AccessControlContext;)Ljava/lang/Object; (AccessController.java:173)
 42: java/security/AccessController.doPrivileged(Ljava/security/PrivilegedAction;Ljava/security/AccessControlContext;)Ljava/lang/Object; (AccessController.java:64)
 43: java/net/URLClassLoader.findClass(Ljava/lang/String;)Ljava/lang/Class; (URLClassLoader.java:622)
 44: java/lang/ClassLoader.loadClass(Ljava/lang/String;Z)Ljava/lang/Class; (ClassLoader.java:574)
 45: java/lang/ClassLoader$SystemClassLoader.loadClass(Ljava/lang/String;Z)Ljava/lang/Class; (ClassLoader.java:962)
 46: java/lang/ClassLoader.loadClass(Ljava/lang/String;)Ljava/lang/Class; (ClassLoader.java:319)
 47: vm_invoke_native_array_stub (/export/cruise/trunk/cc/projects/drlvm/trunk/vm/vmcore/src/util/ia32/base/invoke_native_stub_ia32.asm:41)
 48: JIT_execute_method_default(void*, _jmethodID*, jvalue*, jvalue*) (/export/cruise/trunk/cc/projects/drlvm/trunk/vm/vmcore/src/util/ia32/base/ini_iA32.cpp:206)
 49: DrlEMImpl::executeMethod(_jmethodID*, jvalue*, jvalue*) (/export/cruise/trunk/cc/projects/drlvm/trunk/vm/em/src/DrlEMImpl.cpp:509)
 50: ExecuteMethod (/export/cruise/trunk/cc/projects/drlvm/trunk/vm/em/src/em_intf.cpp:43)
 51: vm_execute_java_method_array(_jmethodID*, jvalue*, jvalue*) (/export/cruise/trunk/cc/projects/drlvm/trunk/vm/vmcore/src/jit/ini.cpp:60)
 52: UserDefinedClassLoader::DoLoadClass(Global_Env*, String const*) (/export/cruise/trunk/cc/projects/drlvm/trunk/vm/vmcore/src/class_support/classloader.cpp:1534)
 53: ClassLoader::LoadClass(Global_Env*, String const*) (/export/cruise/trunk/cc/projects/drlvm/trunk/vm/vmcore/src/class_support/classloader.cpp:1400)
 54: ClassLoader::LoadVerifyAndPrepareClass(Global_Env*, String const*) (/export/cruise/trunk/cc/projects/drlvm/trunk/vm/vmcore/src/class_support/classloader.cpp:367)
 55: class_load_verify_prepare_by_loader_jni(Global_Env*, String const*, ClassLoader*) (/export/cruise/trunk/cc/projects/drlvm/trunk/vm/vmcore/src/class_support/Class_File_Loader.cpp:3644)
 56: FindClass(JNIEnv_External*, String*) (/export/cruise/trunk/cc/projects/drlvm/trunk/vm/vmcore/src/jni/jni_utils.cpp:688)
 57: FindClass(JNIEnv_External*, char const*) (/export/cruise/trunk/cc/projects/drlvm/trunk/vm/vmcore/src/jni/jni.cpp:638)
 58: main_runJavaMain (../shared/main.c:1230)
 59: invocation (../shared/main.c:732)
 60: gpProtectedMain (../shared/main.c:381)
 61: main (../shared/cmain.c:146)
 62: __libc_start_main (??:-1)
 63: _start (../sysdeps/i386/elf/start.S:105)
<end of stack trace>
Running VMInit1
java: /export/cruise/trunk/cc/projects/drlvm/trunk/vm/vmcore/src/class_support/classloader.cpp:365: Class* ClassLoader::LoadVerifyAndPrepareClass(Global_Env*, const String*): Assertion `hythread_is_suspend_enabled()' failed.
SIGABRT in VM code.
Stack trace:
  0: ?? (??:-1)
  1: abort (??:-1)
  2: __assert_fail (??:-1)
  3: ClassLoader::LoadVerifyAndPrepareClass(Global_Env*, String const*) (/export/cruise/trunk/cc/projects/drlvm/trunk/vm/vmcore/src/class_support/classloader.cpp:367)
  4: Global_Env::LoadCoreClass(String const*) (/export/cruise/trunk/cc/projects/drlvm/trunk/vm/vmcore/src/class_support/Environment.cpp:280)
  5: Global_Env::LoadCoreClass(char const*) (/export/cruise/trunk/cc/projects/drlvm/trunk/vm/vmcore/src/class_support/Environment.cpp:292)
  6: getClassRegistryMethod (/export/cruise/trunk/cc/projects/drlvm/trunk/vm/vmcore/src/class_support/classloader.cpp:1601)
  7: ClassLoader::InsertClass(Class*) (/export/cruise/trunk/cc/projects/drlvm/trunk/vm/vmcore/src/class_support/classloader.cpp:1645)
  8: ClassLoader::DefineClass(Global_Env*, char const*, unsigned char*, unsigned int, unsigned int, String const**) (/export/cruise/trunk/cc/projects/drlvm/trunk/vm/vmcore/src/class_support/classloader.cpp:317)
  9: DefineClass(JNIEnv_External*, char const*, _jobject*, signed char const*, int) (/export/cruise/trunk/cc/projects/drlvm/trunk/vm/vmcore/src/jni/jni.cpp:603)
 10: Java_java_lang_ClassLoader_defineClass0 (/export/cruise/trunk/cc/projects/drlvm/trunk/vm/vmcore/src/kernel_classes/native/java_lang_VMClassRegistry.cpp:64)
 11: 0x52D11A63  <Generated stub>
 12: java/lang/ClassLoader.defineClass(Ljava/lang/String;[BIILjava/security/ProtectionDomain;)Ljava/lang/Class; (ClassLoader.java:436)
 13: java/security/SecureClassLoader.defineClass(Ljava/lang/String;[BIILjava/security/CodeSource;)Ljava/lang/Class; (SecureClassLoader.java:70)
 14: java/net/URLClassLoader.findClassImpl([Ljava/net/URL;Ljava/lang/String;)Ljava/lang/Class; (URLClassLoader.java:1214)
 15: java/net/URLClassLoader$4.run()Ljava/lang/Class; (URLClassLoader.java:625)
 16: java/net/URLClassLoader$4.run()Ljava/lang/Object; (URLClassLoader.java:1)
 17: java/security/AccessController.doPrivilegedImpl(Ljava/security/PrivilegedAction;Ljava/security/AccessControlContext;)Ljava/lang/Object; (AccessController.java:173)
 18: java/security/AccessController.doPrivileged(Ljava/security/PrivilegedAction;Ljava/security/AccessControlContext;)Ljava/lang/Object; (AccessController.java:64)
 19: java/net/URLClassLoader.findClass(Ljava/lang/String;)Ljava/lang/Class; (URLClassLoader.java:622)
 20: java/lang/ClassLoader.loadClass(Ljava/lang/String;Z)Ljava/lang/Class; (ClassLoader.java:574)
 21: java/lang/ClassLoader$SystemClassLoader.loadClass(Ljava/lang/String;Z)Ljava/lang/Class; (ClassLoader.java:962)
 22: java/lang/ClassLoader.loadClass(Ljava/lang/String;)Ljava/lang/Class; (ClassLoader.java:319)
 23: vm_invoke_native_array_stub (/export/cruise/trunk/cc/projects/drlvm/trunk/vm/vmcore/src/util/ia32/base/invoke_native_stub_ia32.asm:41)
 24: JIT_execute_method_default(void*, _jmethodID*, jvalue*, jvalue*) (/export/cruise/trunk/cc/projects/drlvm/trunk/vm/vmcore/src/util/ia32/base/ini_iA32.cpp:206)
 25: DrlEMImpl::executeMethod(_jmethodID*, jvalue*, jvalue*) (/export/cruise/trunk/cc/projects/drlvm/trunk/vm/em/src/DrlEMImpl.cpp:509)
 26: ExecuteMethod (/export/cruise/trunk/cc/projects/drlvm/trunk/vm/em/src/em_intf.cpp:43)
 27: vm_execute_java_method_array(_jmethodID*, jvalue*, jvalue*) (/export/cruise/trunk/cc/projects/drlvm/trunk/vm/vmcore/src/jit/ini.cpp:60)
 28: UserDefinedClassLoader::DoLoadClass(Global_Env*, String const*) (/export/cruise/trunk/cc/projects/drlvm/trunk/vm/vmcore/src/class_support/classloader.cpp:1534)
 29: ClassLoader::LoadClass(Global_Env*, String const*) (/export/cruise/trunk/cc/projects/drlvm/trunk/vm/vmcore/src/class_support/classloader.cpp:1400)
 30: ClassLoader::LoadVerifyAndPrepareClass(Global_Env*, String const*) (/export/cruise/trunk/cc/projects/drlvm/trunk/vm/vmcore/src/class_support/classloader.cpp:367)
 31: class_load_verify_prepare_by_loader_jni(Global_Env*, String const*, ClassLoader*) (/export/cruise/trunk/cc/projects/drlvm/trunk/vm/vmcore/src/class_support/Class_File_Loader.cpp:3644)
 32: FindClass(JNIEnv_External*, String*) (/export/cruise/trunk/cc/projects/drlvm/trunk/vm/vmcore/src/jni/jni_utils.cpp:688)
 33: FindClass(JNIEnv_External*, char const*) (/export/cruise/trunk/cc/projects/drlvm/trunk/vm/vmcore/src/jni/jni.cpp:638)
 34: JNIEnv_External::FindClass(char const*) (/export/cruise/trunk/cc/projects/drlvm/trunk/vm/include/jni.h:627)
 35: vm_init_callback (/export/cruise/trunk/cc/projects/drlvm/trunk/vm/tests/jvmti/VMInit1/VMInit1.cpp:6)
 36: jvmti_send_vm_init_event (/export/cruise/trunk/cc/projects/drlvm/trunk/vm/vmcore/src/jvmti/jvmti_event.cpp:472)
 37: JNI_CreateJavaVM (/export/cruise/trunk/cc/projects/drlvm/trunk/vm/vmcore/src/jni/jni.cpp:538)
 38: invocation (../shared/main.c:660)
 39: gpProtectedMain (../shared/main.c:381)
 40: main (../shared/cmain.c:146)
 41: __libc_start_main (??:-1)
 42: _start (../sysdeps/i386/elf/start.S:105)
<end of stack trace>

        ==================================
        Run JVMTI tests using jitrino.OPT
        ==================================
        

Using exclude file = /export/cruise/trunk/cc/projects/drlvm/trunk/build/make/excludes/exclude.drlvm_jvmti.linux.x86.opt   
        
Breakpoint1/Breakpoint1.java
SingleStep1/SingleStep1.java
VMInit1/VMInit1.java
PopFrame1/PopFrame1.java

                  
Running Breakpoint1
Running PopFrame1
Running SingleStep1
Running VMInit1

        ==================================
        Run JVMTI tests using Server mode JIT
        ==================================
        

Using exclude file = /export/cruise/trunk/cc/projects/drlvm/trunk/build/make/excludes/exclude.drlvm_jvmti.linux.x86.srv   
        
Breakpoint1/Breakpoint1.java
SingleStep1/SingleStep1.java
VMInit1/VMInit1.java
PopFrame1/PopFrame1.java

                  
Running Breakpoint1
Running PopFrame1
Running SingleStep1
Running VMInit1
## Compiling framework...
## Compiling C unit tests
## Linking C unit test: test_java_attrs
## Linking C unit test: test_java_basic
## Linking C unit test: test_java_identify
## Linking C unit test: test_java_interrupt
## Linking C unit test: test_java_monitors
## Linking C unit test: test_java_park
## Linking C unit test: test_java_ptr_conv
## Linking C unit test: test_java_suspend
## Linking C unit test: test_native_basic
## Linking C unit test: test_native_fat_monitor
## Linking C unit test: test_native_suspend
## Linking C unit test: test_native_thin_monitor
## Linking C unit test: test_ti_instrum
## Linking C unit test: test_ti_local_storage
## Linking C unit test: test_ti_monitor_info
## Linking C unit test: test_ti_peak_count
## Linking C unit test: test_ti_raw_monitors
## Linking C unit test: test_ti_state
## Linking C unit test: test_ti_timing
## Executing C unit test: test_java_attrs
INFO: TEST test_jthread_get_priority start
INFO: TEST test_jthread_get_priority: PASSED
INFO: TEST test_jthread_set_priority start
INFO: TEST test_jthread_set_priority: PASSED
## TEST PASSED
## Executing C unit test: test_java_basic
INFO: TEST test_jthread_attach start
INFO: TEST test_jthread_attach: PASSED
INFO: TEST test_jthread_detach start
INFO: TEST test_jthread_detach: PASSED
INFO: TEST test_hythread_create start
INFO: TEST test_hythread_create: PASSED
INFO: TEST test_hythread_create_with_function start
INFO: TEST test_hythread_create_with_function: PASSED
INFO: TEST test_jthread_get_JNI_env start
INFO: TEST test_jthread_get_JNI_env: PASSED
INFO: TEST test_jthread_join start
INFO: TEST test_jthread_join: PASSED
INFO: TEST test_jthread_timed_join start
-------- status = 00011177 (70007) 100
-------- status = 00000000 (0) 100
-------- status = 00000000 (0) 100
-------- status = 00000000 (0) 100
-------- status = 00000000 (0) 50000
-------- status = 00000000 (0) 50000
-------- status = 00000000 (0) 50000
-------- status = 00000000 (0) 50000
INFO: TEST test_jthread_timed_join: PASSED
INFO: TEST test_jthread_exception_stop start
INFO: TEST test_jthread_exception_stop: PASSED
INFO: TEST test_jthread_sleep start
INFO: TEST test_jthread_sleep: PASSED
INFO: TEST test_hythread_yield start
INFO: TEST test_hythread_yield: PASSED
## TEST PASSED
## Executing C unit test: test_java_identify
INFO: TEST test_jthread_self start
INFO: TEST test_jthread_self: PASSED
INFO: TEST test_jthread_get_id start
INFO: TEST test_jthread_get_id: PASSED
INFO: TEST test_jthread_get_thread start
INFO: TEST test_jthread_get_thread: PASSED
## TEST PASSED
## Executing C unit test: test_java_interrupt
INFO: TEST test_jthread_interrupt start
INFO: TEST test_jthread_interrupt: PASSED
INFO: TEST test_jthread_is_interrupted start
INFO: TEST test_jthread_is_interrupted: PASSED
INFO: TEST test_jthread_clear_interrupted start
INFO: TEST test_jthread_clear_interrupted: PASSED
## TEST PASSED
## Executing C unit test: test_java_monitors
INFO: TEST test_jthread_monitor_init start
INFO: TEST test_jthread_monitor_init: PASSED
INFO: TEST test_jthread_monitor_enter start
INFO: TEST test_jthread_monitor_enter: PASSED
INFO: TEST test_jthread_monitor_try_enter start
INFO: TEST test_jthread_monitor_try_enter: PASSED
INFO: TEST test_jthread_monitor_exit start
INFO: TEST test_jthread_monitor_exit: PASSED
INFO: TEST test_jthread_monitor_notify_all start
INFO: TEST test_jthread_monitor_notify_all: PASSED
INFO: TEST test_jthread_monitor_wait start
INFO: TEST test_jthread_monitor_wait: PASSED
INFO: TEST test_jthread_monitor_timed_wait start
INFO: TEST test_jthread_monitor_timed_wait: PASSED
INFO: TEST test_jthread_monitor_timed_wait_timeout start
INFO: TEST test_jthread_monitor_timed_wait_timeout: PASSED
## TEST PASSED
## Executing C unit test: test_java_park
INFO: TEST test_jthread_park_unpark start
INFO: TEST test_jthread_park_unpark: PASSED
INFO: TEST test_jthread_park_interrupt start
INFO: TEST test_jthread_park_interrupt: PASSED
INFO: TEST test_jthread_timed_park start
INFO: TEST test_jthread_timed_park: PASSED
## TEST PASSED
## Executing C unit test: test_java_ptr_conv
INFO: TEST test_jthread_get_java_thread start
INFO: TEST test_jthread_get_java_thread: PASSED
INFO: TEST test_jthread_get_native_thread start
INFO: TEST test_jthread_get_native_thread: PASSED
## TEST PASSED
## Executing C unit test: test_java_suspend
INFO: TEST test_jthread_suspend_resume start
INFO: TEST test_jthread_suspend_resume: PASSED
INFO: TEST test_jthread_suspend_all_resume_all start
INFO: TEST test_jthread_suspend_all_resume_all: PASSED
## TEST PASSED
## Executing C unit test: test_native_basic
INFO: TEST test_hythread_self_base start
INFO: TEST test_hythread_self_base: PASSED
INFO: TEST test_hythread_create start
INFO: TEST test_hythread_create: PASSED
INFO: TEST test_hythread_create_many start
INFO: TEST test_hythread_create_many: PASSED
INFO: TEST test_hythread_iterator start
iterator size: 100
INFO: TEST test_hythread_iterator: PASSED
INFO: TEST test_hythread_iterator_default start
default group iterator: 105
INFO: TEST test_hythread_iterator_default: PASSED
## TEST PASSED
## Executing C unit test: test_native_fat_monitor
INFO: TEST test_wait_signal start
INFO: TEST test_wait_signal: PASSED
## TEST PASSED
## Executing C unit test: test_native_suspend
INFO: TEST test_hythread_thread_suspend start
INFO: TEST test_hythread_thread_suspend: PASSED
INFO: TEST test_hythread_thread_suspend_all start
INFO: TEST test_hythread_thread_suspend_all: PASSED
## TEST PASSED
## Executing C unit test: test_native_thin_monitor
INFO: TEST test_hythread_thin_monitor_enter start
INFO: TEST test_hythread_thin_monitor_enter: PASSED
INFO: TEST test_hythread_thin_monitor_try_enter start
INFO: TEST test_hythread_thin_monitor_try_enter: PASSED
INFO: TEST test_hythread_thin_monitor_wait_timed_illegal start
INFO: TEST test_hythread_thin_monitor_wait_timed_illegal: PASSED
INFO: TEST test_hythread_thin_monitor_wait_timed start
INFO: TEST test_hythread_thin_monitor_wait_timed: PASSED
INFO: TEST test_hythread_thin_monitor_fat_unlock start
status: 70007
INFO: TEST test_hythread_thin_monitor_fat_unlock: PASSED
INFO: TEST test_hythread_thin_monitor_enter_contended start
INFO: TEST test_hythread_thin_monitor_enter_contended: PASSED
## TEST PASSED
## Executing C unit test: test_ti_instrum
INFO: TEST test_jthread_get_all_threads start
INFO: TEST test_jthread_get_all_threads: PASSED
INFO: TEST test_jthread_get_thread_count start
INFO: TEST test_jthread_get_thread_count: PASSED
INFO: TEST test_jthread_get_blocked_count start
INFO: TEST test_jthread_get_blocked_count: PASSED
## TEST PASSED
## Executing C unit test: test_ti_local_storage
## TEST PASSED
## Executing C unit test: test_ti_monitor_info
INFO: TEST test_jthread_get_contended_monitor start
INFO: TEST test_jthread_get_contended_monitor: PASSED
INFO: TEST test_jthread_holds_lock start
INFO: TEST test_jthread_holds_lock: PASSED
INFO: TEST test_jthread_get_lock_owner start
INFO: TEST test_jthread_get_lock_owner: PASSED
INFO: TEST test_jthread_get_owned_monitors start
INFO: TEST test_jthread_get_owned_monitors: PASSED
## TEST PASSED
## Executing C unit test: test_ti_peak_count
## TEST PASSED
## Executing C unit test: test_ti_raw_monitors
INFO: TEST test_jthread_raw_monitor_create start
INFO: TEST test_jthread_raw_monitor_create: PASSED
INFO: TEST test_jthread_raw_monitor_destroy start
INFO: TEST test_jthread_raw_monitor_destroy: PASSED
INFO: TEST test_jthread_raw_monitor_enter start
INFO: TEST test_jthread_raw_monitor_enter: PASSED
INFO: TEST test_jthread_raw_monitor_try_enter start
INFO: TEST test_jthread_raw_monitor_try_enter: PASSED
INFO: TEST test_jthread_raw_monitor_exit start
INFO: TEST test_jthread_raw_monitor_exit: PASSED
## TEST PASSED
## Executing C unit test: test_ti_state
INFO: TEST test_jthread_get_state_6 start
state = 00000002 (00000002)
state = 00000002 (00000002)
state = 00000002 (00000002)
state = 00000002 (00000002)
state = 00000002 (00000002)
INFO: TEST test_jthread_get_state_6: PASSED
## TEST PASSED
## Executing C unit test: test_ti_timing
## TEST PASSED
## Please find tests and results at /export/cruise/trunk/cc/projects/drlvm/trunk/build/lnx_ia32_gcc_debug/semis/vm/_cunit.tests/
Note: /export/cruise/trunk/cc/projects/drlvm/trunk/vm/tests/smoke/gc/RunFinalizersOnExitTest.java uses or overrides a deprecated API.
Note: Recompile with -Xlint:deprecation for details.
Note: Some input files use unchecked or unsafe operations.
Note: Recompile with -Xlint:unchecked for details.
Compiling /export/cruise/trunk/cc/projects/drlvm/trunk/build/lnx_ia32_gcc_debug/semis/vm/_smoke.tests/natives/shutdown/TestDaemonOnWait
Compiling /export/cruise/trunk/cc/projects/drlvm/trunk/build/lnx_ia32_gcc_debug/semis/vm/_smoke.tests/natives/shutdown/TestFatalError
Compiling /export/cruise/trunk/cc/projects/drlvm/trunk/build/lnx_ia32_gcc_debug/semis/vm/_smoke.tests/natives/shutdown/TestInterrupt

        ==================================
        Smoke tests on interpreter
        ==================================
        

Using exclude file = /export/cruise/trunk/cc/projects/drlvm/trunk/build/make/excludes/exclude.drlvm_smoke.linux.x86.int   
        
Check.java
PerfCheck.java

# slow
gc/Mark.java
gc/SynchronizedFinalizersTest.java 

# HARMONY-2977
io/Integers.java

# fails on ubuntu 6

stress/Threads.java

                  
Running test : Hi
*** FAILED **** : Hi (134 res code)
Running test : StackTest
*** FAILED **** : StackTest (134 res code)
Running test : classloader.ClassTestGetDeclaringClass
*** FAILED **** : classloader.ClassTestGetDeclaringClass (134 res code)
Running test : classloader.ExceptionInInitializerTest
*** FAILED **** : classloader.ExceptionInInitializerTest (134 res code)
Running test : classloader.LogLoader
*** FAILED **** : classloader.LogLoader (134 res code)
Running test : classloader.NotFound
*** FAILED **** : classloader.NotFound (134 res code)
Running test : classloader.StressLoader
*** FAILED **** : classloader.StressLoader (134 res code)
Running test : exception.ExceptionStackTest
*** FAILED **** : exception.ExceptionStackTest (134 res code)
Running test : exception.FinalizeStackTest
*** FAILED **** : exception.FinalizeStackTest (134 res code)
Running test : exception.NPE
*** FAILED **** : exception.NPE (134 res code)
Running test : gc.FinAlloc
*** FAILED **** : gc.FinAlloc (134 res code)
Running test : gc.Finalizer
*** FAILED **** : gc.Finalizer (134 res code)
Running test : gc.Force
*** FAILED **** : gc.Force (134 res code)
Running test : gc.Fragment
*** FAILED **** : gc.Fragment (134 res code)
Running test : gc.Free
*** FAILED **** : gc.Free (134 res code)
Running test : gc.LOS
*** FAILED **** : gc.LOS (134 res code)
Running test : gc.List
*** FAILED **** : gc.List (134 res code)
Running test : gc.MultiThreads
*** FAILED **** : gc.MultiThreads (134 res code)
Running test : gc.NPE
*** FAILED **** : gc.NPE (134 res code)
Running test : gc.PhantomReferenceQueueTest
*** FAILED **** : gc.PhantomReferenceQueueTest (134 res code)
Running test : gc.PhantomReferenceTest
*** FAILED **** : gc.PhantomReferenceTest (134 res code)
Running test : gc.RefRemove
*** FAILED **** : gc.RefRemove (134 res code)
Running test : gc.RunFinalizersOnExitTest
*** FAILED **** : gc.RunFinalizersOnExitTest (134 res code)
Running test : gc.StressRef
*** FAILED **** : gc.StressRef (134 res code)
Running test : gc.SynchronizedFinalizersTest
*** FAILED **** : gc.SynchronizedFinalizersTest (134 res code)
Running test : gc.ThreadSuspension
*** FAILED **** : gc.ThreadSuspension (134 res code)
Running test : gc.WeakReferenceTest
*** FAILED **** : gc.WeakReferenceTest (134 res code)
Running test : init.ErrorInInitializer
*** FAILED **** : init.ErrorInInitializer (134 res code)
Running test : init.Other
*** FAILED **** : init.Other (134 res code)
Running test : io.ArrayList
*** FAILED **** : io.ArrayList (134 res code)
Running test : jni.LoadLibrary
*** FAILED **** : jni.LoadLibrary (134 res code)
Running test : outofmemory.Double
*** FAILED **** : outofmemory.Double (134 res code)
Running test : outofmemory.Int
*** FAILED **** : outofmemory.Int (134 res code)
Running test : outofmemory.Plain
*** FAILED **** : outofmemory.Plain (134 res code)
Running test : outofmemory.Ref
*** FAILED **** : outofmemory.Ref (134 res code)
Running test : outofmemory.Throw
*** FAILED **** : outofmemory.Throw (134 res code)
Running test : outofmemory.Vector
*** FAILED **** : outofmemory.Vector (134 res code)
Running test : outofmemory.VectorDouble
*** FAILED **** : outofmemory.VectorDouble (134 res code)
Running test : outofmemory.VectorInt
*** FAILED **** : outofmemory.VectorInt (134 res code)
Running test : outofmemory.VectorRef
*** FAILED **** : outofmemory.VectorRef (134 res code)
Running test : perf.CreateManyExceptions
*** FAILED **** : perf.CreateManyExceptions (134 res code)
Running test : perf.CreateManyExceptions_depth
*** FAILED **** : perf.CreateManyExceptions_depth (134 res code)
Running test : perf.MultiThreadsSimple
*** FAILED **** : perf.MultiThreadsSimple (134 res code)
Running test : perf.SeveralThreads
*** FAILED **** : perf.SeveralThreads (134 res code)
Running test : perf.StressCornerSize
*** FAILED **** : perf.StressCornerSize (134 res code)
Running test : perf.StressCornerSize_a
*** FAILED **** : perf.StressCornerSize_a (134 res code)
Running test : perf.ThrowMany
*** FAILED **** : perf.ThrowMany (134 res code)
Running test : perf.ThrowManyExceptions
*** FAILED **** : perf.ThrowManyExceptions (134 res code)
Running test : perf.ThrowManyExceptions_depth
*** FAILED **** : perf.ThrowManyExceptions_depth (134 res code)
Running test : perf.ThrowMany_depth
*** FAILED **** : perf.ThrowMany_depth (134 res code)
Running test : reflect.GetMethod
*** FAILED **** : reflect.GetMethod (134 res code)
Running test : shutdown.TestDaemonOnWait
*** FAILED **** : shutdown.TestDaemonOnWait (134 res code)
Running test : shutdown.TestFatalError
*** FAILED **** : shutdown.TestFatalError (134 res code)
Running test : shutdown.TestInterrupt
*** FAILED **** : shutdown.TestInterrupt (134 res code)
Running test : shutdown.TestLock
*** FAILED **** : shutdown.TestLock (134 res code)
Running test : stress.BigStringBuffer
*** FAILED **** : stress.BigStringBuffer (134 res code)
Running test : stress.Finalizer
*** FAILED **** : stress.Finalizer (134 res code)
Running test : stress.Mix
*** FAILED **** : stress.Mix (134 res code)
Running test : stress.Stack
*** FAILED **** : stress.Stack (134 res code)
Running test : stress.Sync
*** FAILED **** : stress.Sync (134 res code)
Running test : stress.Vector
*** FAILED **** : stress.Vector (134 res code)
Running test : stress.WeakHashmapTest
*** FAILED **** : stress.WeakHashmapTest (134 res code)
Running test : thread.ExitShutdownHook
*** FAILED **** : thread.ExitShutdownHook (134 res code)
Running test : thread.InfiniteFinalizer
*** FAILED **** : thread.InfiniteFinalizer (134 res code)
Running test : thread.Sleep
*** FAILED **** : thread.Sleep (134 res code)
Running test : thread.ThreadInterrupt
*** FAILED **** : thread.ThreadInterrupt (134 res code)
Running test : thread.ThreadOOM
*** FAILED **** : thread.ThreadOOM (134 res code)
Running test : util.Date
*** FAILED **** : util.Date (134 res code)
Running test : util.DoPriveleged
*** FAILED **** : util.DoPriveleged (134 res code)
Running test : util.Prop
*** FAILED **** : util.Prop (134 res code)
Running test : util.StringIntern
*** FAILED **** : util.StringIntern (134 res code)
Please find test classes and results at /export/cruise/trunk/cc/projects/drlvm/trunk/build/lnx_ia32_gcc_debug/semis/vm/_smoke.tests/

        ==================================
        Smoke tests on Client mode JIT (default)
        ==================================
        

Using exclude file = /export/cruise/trunk/cc/projects/drlvm/trunk/build/make/excludes/exclude.drlvm_smoke.linux.x86.jit   
        
Check.java
PerfCheck.java

# breaks on ubuntu 6 w/ OOME
stress/Threads.java

# HARMONY-3495 hangs intermittently
gc/NPE.java
gc/SynchronizedFinalizersTest.java

                  
Running test : Hi
*** FAILED **** : Hi (134 res code)
Running test : StackTest
*** FAILED **** : StackTest (134 res code)
Running test : classloader.ClassTestGetDeclaringClass
*** FAILED **** : classloader.ClassTestGetDeclaringClass (134 res code)
Running test : classloader.ExceptionInInitializerTest
*** FAILED **** : classloader.ExceptionInInitializerTest (134 res code)
Running test : classloader.LogLoader
*** FAILED **** : classloader.LogLoader (134 res code)
Running test : classloader.NotFound
*** FAILED **** : classloader.NotFound (134 res code)
Running test : classloader.StressLoader
*** FAILED **** : classloader.StressLoader (134 res code)
Running test : exception.ExceptionStackTest
*** FAILED **** : exception.ExceptionStackTest (134 res code)
Running test : exception.FinalizeStackTest
*** FAILED **** : exception.FinalizeStackTest (134 res code)
Running test : exception.NPE
*** FAILED **** : exception.NPE (134 res code)
Running test : gc.FinAlloc
*** FAILED **** : gc.FinAlloc (134 res code)
Running test : gc.Finalizer
*** FAILED **** : gc.Finalizer (134 res code)
Running test : gc.Force
*** FAILED **** : gc.Force (134 res code)
Running test : gc.Fragment
*** FAILED **** : gc.Fragment (134 res code)
Running test : gc.Free
*** FAILED **** : gc.Free (134 res code)
Running test : gc.LOS
*** FAILED **** : gc.LOS (134 res code)
Running test : gc.List
*** FAILED **** : gc.List (134 res code)
Running test : gc.Mark
*** FAILED **** : gc.Mark (134 res code)
Running test : gc.MultiThreads
*** FAILED **** : gc.MultiThreads (134 res code)
Running test : gc.PhantomReferenceQueueTest
*** FAILED **** : gc.PhantomReferenceQueueTest (134 res code)
Running test : gc.PhantomReferenceTest
*** FAILED **** : gc.PhantomReferenceTest (134 res code)
Running test : gc.RefRemove
*** FAILED **** : gc.RefRemove (134 res code)
Running test : gc.RunFinalizersOnExitTest
*** FAILED **** : gc.RunFinalizersOnExitTest (134 res code)
Running test : gc.StressRef
*** FAILED **** : gc.StressRef (134 res code)
Running test : gc.ThreadSuspension
*** FAILED **** : gc.ThreadSuspension (134 res code)
Running test : gc.WeakReferenceTest
*** FAILED **** : gc.WeakReferenceTest (134 res code)
Running test : init.ErrorInInitializer
*** FAILED **** : init.ErrorInInitializer (134 res code)
Running test : init.Other
*** FAILED **** : init.Other (134 res code)
Running test : io.ArrayList
*** FAILED **** : io.ArrayList (134 res code)
Running test : io.Integers
*** FAILED **** : io.Integers (134 res code)
Running test : jni.LoadLibrary
*** FAILED **** : jni.LoadLibrary (134 res code)
Running test : outofmemory.Double
*** FAILED **** : outofmemory.Double (134 res code)
Running test : outofmemory.Int
*** FAILED **** : outofmemory.Int (134 res code)
Running test : outofmemory.Plain
*** FAILED **** : outofmemory.Plain (134 res code)
Running test : outofmemory.Ref
*** FAILED **** : outofmemory.Ref (134 res code)
Running test : outofmemory.Throw
*** FAILED **** : outofmemory.Throw (134 res code)
Running test : outofmemory.Vector
*** FAILED **** : outofmemory.Vector (134 res code)
Running test : outofmemory.VectorDouble
*** FAILED **** : outofmemory.VectorDouble (134 res code)
Running test : outofmemory.VectorInt
*** FAILED **** : outofmemory.VectorInt (134 res code)
Running test : outofmemory.VectorRef
*** FAILED **** : outofmemory.VectorRef (134 res code)
Running test : perf.CreateManyExceptions
*** FAILED **** : perf.CreateManyExceptions (134 res code)
Running test : perf.CreateManyExceptions_depth
*** FAILED **** : perf.CreateManyExceptions_depth (134 res code)
Running test : perf.MultiThreadsSimple
*** FAILED **** : perf.MultiThreadsSimple (134 res code)
Running test : perf.SeveralThreads
*** FAILED **** : perf.SeveralThreads (134 res code)
Running test : perf.StressCornerSize
*** FAILED **** : perf.StressCornerSize (134 res code)
Running test : perf.StressCornerSize_a
*** FAILED **** : perf.StressCornerSize_a (134 res code)
Running test : perf.ThrowMany
*** FAILED **** : perf.ThrowMany (134 res code)
Running test : perf.ThrowManyExceptions
*** FAILED **** : perf.ThrowManyExceptions (134 res code)
Running test : perf.ThrowManyExceptions_depth
*** FAILED **** : perf.ThrowManyExceptions_depth (134 res code)
Running test : perf.ThrowMany_depth
*** FAILED **** : perf.ThrowMany_depth (134 res code)
Running test : reflect.GetMethod
*** FAILED **** : reflect.GetMethod (134 res code)
Running test : shutdown.TestDaemonOnWait
*** FAILED **** : shutdown.TestDaemonOnWait (134 res code)
Running test : shutdown.TestFatalError
*** FAILED **** : shutdown.TestFatalError (134 res code)
Running test : shutdown.TestInterrupt
*** FAILED **** : shutdown.TestInterrupt (134 res code)
Running test : shutdown.TestLock
*** FAILED **** : shutdown.TestLock (134 res code)
Running test : stress.BigStringBuffer
*** FAILED **** : stress.BigStringBuffer (134 res code)
Running test : stress.Finalizer
*** FAILED **** : stress.Finalizer (134 res code)
Running test : stress.Mix
*** FAILED **** : stress.Mix (134 res code)
Running test : stress.Stack
*** FAILED **** : stress.Stack (134 res code)
Running test : stress.Sync
*** FAILED **** : stress.Sync (134 res code)
Running test : stress.Vector
*** FAILED **** : stress.Vector (134 res code)
Running test : stress.WeakHashmapTest
*** FAILED **** : stress.WeakHashmapTest (134 res code)
Running test : thread.ExitShutdownHook
*** FAILED **** : thread.ExitShutdownHook (134 res code)
Running test : thread.InfiniteFinalizer
*** FAILED **** : thread.InfiniteFinalizer (134 res code)
Running test : thread.Sleep
*** FAILED **** : thread.Sleep (134 res code)
Running test : thread.ThreadInterrupt
*** FAILED **** : thread.ThreadInterrupt (134 res code)
Running test : thread.ThreadOOM
*** FAILED **** : thread.ThreadOOM (134 res code)
Running test : util.Date
*** FAILED **** : util.Date (134 res code)
Running test : util.DoPriveleged
*** FAILED **** : util.DoPriveleged (134 res code)
Running test : util.Prop
*** FAILED **** : util.Prop (134 res code)
Running test : util.StringIntern
*** FAILED **** : util.StringIntern (134 res code)
Please find test classes and results at /export/cruise/trunk/cc/projects/drlvm/trunk/build/lnx_ia32_gcc_debug/semis/vm/_smoke.tests/

        ==================================
        Smoke tests on jitrino.JET
        ==================================
        

Using exclude file = /export/cruise/trunk/cc/projects/drlvm/trunk/build/make/excludes/exclude.drlvm_smoke.linux.x86.jet   
        
Check.java
PerfCheck.java

# breaks on ubuntu 6 w/ OOME
stress/Threads.java

# HARMONY-3495 hangs intermittently
gc/NPE.java
gc/SynchronizedFinalizersTest.java
                  
Running test : Hi
*** FAILED **** : Hi (134 res code)
Running test : StackTest
*** FAILED **** : StackTest (134 res code)
Running test : classloader.ClassTestGetDeclaringClass
*** FAILED **** : classloader.ClassTestGetDeclaringClass (134 res code)
Running test : classloader.ExceptionInInitializerTest
*** FAILED **** : classloader.ExceptionInInitializerTest (134 res code)
Running test : classloader.LogLoader
*** FAILED **** : classloader.LogLoader (134 res code)
Running test : classloader.NotFound
*** FAILED **** : classloader.NotFound (134 res code)
Running test : classloader.StressLoader
*** FAILED **** : classloader.StressLoader (134 res code)
Running test : exception.ExceptionStackTest
*** FAILED **** : exception.ExceptionStackTest (134 res code)
Running test : exception.FinalizeStackTest
*** FAILED **** : exception.FinalizeStackTest (134 res code)
Running test : exception.NPE
*** FAILED **** : exception.NPE (134 res code)
Running test : gc.FinAlloc
*** FAILED **** : gc.FinAlloc (134 res code)
Running test : gc.Finalizer
*** FAILED **** : gc.Finalizer (134 res code)
Running test : gc.Force
*** FAILED **** : gc.Force (134 res code)
Running test : gc.Fragment
*** FAILED **** : gc.Fragment (134 res code)
Running test : gc.Free
*** FAILED **** : gc.Free (134 res code)
Running test : gc.LOS
*** FAILED **** : gc.LOS (134 res code)
Running test : gc.List
*** FAILED **** : gc.List (134 res code)
Running test : gc.Mark
*** FAILED **** : gc.Mark (134 res code)
Running test : gc.MultiThreads
*** FAILED **** : gc.MultiThreads (134 res code)
Running test : gc.PhantomReferenceQueueTest
*** FAILED **** : gc.PhantomReferenceQueueTest (134 res code)
Running test : gc.PhantomReferenceTest
*** FAILED **** : gc.PhantomReferenceTest (134 res code)
Running test : gc.RefRemove
*** FAILED **** : gc.RefRemove (134 res code)
Running test : gc.RunFinalizersOnExitTest
*** FAILED **** : gc.RunFinalizersOnExitTest (134 res code)
Running test : gc.StressRef
*** FAILED **** : gc.StressRef (134 res code)
Running test : gc.ThreadSuspension
*** FAILED **** : gc.ThreadSuspension (134 res code)
Running test : gc.WeakReferenceTest
*** FAILED **** : gc.WeakReferenceTest (134 res code)
Running test : init.ErrorInInitializer
*** FAILED **** : init.ErrorInInitializer (134 res code)
Running test : init.Other
*** FAILED **** : init.Other (134 res code)
Running test : io.ArrayList
*** FAILED **** : io.ArrayList (134 res code)
Running test : io.Integers
*** FAILED **** : io.Integers (134 res code)
Running test : jni.LoadLibrary
*** FAILED **** : jni.LoadLibrary (134 res code)
Running test : outofmemory.Double
*** FAILED **** : outofmemory.Double (134 res code)
Running test : outofmemory.Int
*** FAILED **** : outofmemory.Int (134 res code)
Running test : outofmemory.Plain
*** FAILED **** : outofmemory.Plain (134 res code)
Running test : outofmemory.Ref
*** FAILED **** : outofmemory.Ref (134 res code)
Running test : outofmemory.Throw
*** FAILED **** : outofmemory.Throw (134 res code)
Running test : outofmemory.Vector
*** FAILED **** : outofmemory.Vector (134 res code)
Running test : outofmemory.VectorDouble
*** FAILED **** : outofmemory.VectorDouble (134 res code)
Running test : outofmemory.VectorInt
*** FAILED **** : outofmemory.VectorInt (134 res code)
Running test : outofmemory.VectorRef
*** FAILED **** : outofmemory.VectorRef (134 res code)
Running test : perf.CreateManyExceptions
*** FAILED **** : perf.CreateManyExceptions (134 res code)
Running test : perf.CreateManyExceptions_depth
*** FAILED **** : perf.CreateManyExceptions_depth (134 res code)
Running test : perf.MultiThreadsSimple
*** FAILED **** : perf.MultiThreadsSimple (134 res code)
Running test : perf.SeveralThreads
*** FAILED **** : perf.SeveralThreads (134 res code)
Running test : perf.StressCornerSize
*** FAILED **** : perf.StressCornerSize (134 res code)
Running test : perf.StressCornerSize_a
*** FAILED **** : perf.StressCornerSize_a (134 res code)
Running test : perf.ThrowMany
*** FAILED **** : perf.ThrowMany (134 res code)
Running test : perf.ThrowManyExceptions
*** FAILED **** : perf.ThrowManyExceptions (134 res code)
Running test : perf.ThrowManyExceptions_depth
*** FAILED **** : perf.ThrowManyExceptions_depth (134 res code)
Running test : perf.ThrowMany_depth
*** FAILED **** : perf.ThrowMany_depth (134 res code)
Running test : reflect.GetMethod
*** FAILED **** : reflect.GetMethod (134 res code)
Running test : shutdown.TestDaemonOnWait
*** FAILED **** : shutdown.TestDaemonOnWait (134 res code)
Running test : shutdown.TestFatalError
*** FAILED **** : shutdown.TestFatalError (134 res code)
Running test : shutdown.TestInterrupt
*** FAILED **** : shutdown.TestInterrupt (134 res code)
Running test : shutdown.TestLock
*** FAILED **** : shutdown.TestLock (134 res code)
Running test : stress.BigStringBuffer
*** FAILED **** : stress.BigStringBuffer (134 res code)
Running test : stress.Finalizer
*** FAILED **** : stress.Finalizer (134 res code)
Running test : stress.Mix
*** FAILED **** : stress.Mix (134 res code)
Running test : stress.Stack
*** FAILED **** : stress.Stack (134 res code)
Running test : stress.Sync
*** FAILED **** : stress.Sync (134 res code)
Running test : stress.Vector
*** FAILED **** : stress.Vector (134 res code)
Running test : stress.WeakHashmapTest
*** FAILED **** : stress.WeakHashmapTest (134 res code)
Running test : thread.ExitShutdownHook
*** FAILED **** : thread.ExitShutdownHook (134 res code)
Running test : thread.InfiniteFinalizer
*** FAILED **** : thread.InfiniteFinalizer (134 res code)
Running test : thread.Sleep
*** FAILED **** : thread.Sleep (134 res code)
Running test : thread.ThreadInterrupt
*** FAILED **** : thread.ThreadInterrupt (134 res code)
Running test : thread.ThreadOOM
*** FAILED **** : thread.ThreadOOM (134 res code)
Running test : util.Date
*** FAILED **** : util.Date (134 res code)
Running test : util.DoPriveleged
*** FAILED **** : util.DoPriveleged (134 res code)
Running test : util.Prop
*** FAILED **** : util.Prop (134 res code)
Running test : util.StringIntern
*** FAILED **** : util.StringIntern (134 res code)
Please find test classes and results at /export/cruise/trunk/cc/projects/drlvm/trunk/build/lnx_ia32_gcc_debug/semis/vm/_smoke.tests/

        ==================================
        Smoke tests on jitrino.OPT
        ==================================
        

Using exclude file = /export/cruise/trunk/cc/projects/drlvm/trunk/build/make/excludes/exclude.drlvm_smoke.linux.x86.opt   
        
Check.java
PerfCheck.java

# HARMONY-3349
gc/Finalizer.java
gc/RunFinalizersOnExitTest.java

# breaks on ubuntu 6 w/ OOME
stress/Threads.java

# HARMONY-3495 hangs intermittently
gc/NPE.java
gc/SynchronizedFinalizersTest.java 

                  
Running test : Hi
*** FAILED **** : Hi (134 res code)
Running test : StackTest
*** FAILED **** : StackTest (134 res code)
Running test : classloader.ClassTestGetDeclaringClass
*** FAILED **** : classloader.ClassTestGetDeclaringClass (134 res code)
Running test : classloader.ExceptionInInitializerTest
*** FAILED **** : classloader.ExceptionInInitializerTest (134 res code)
Running test : classloader.LogLoader
*** FAILED **** : classloader.LogLoader (134 res code)
Running test : classloader.NotFound
*** FAILED **** : classloader.NotFound (134 res code)
Running test : classloader.StressLoader
*** FAILED **** : classloader.StressLoader (134 res code)
Running test : exception.ExceptionStackTest
*** FAILED **** : exception.ExceptionStackTest (134 res code)
Running test : exception.FinalizeStackTest
*** FAILED **** : exception.FinalizeStackTest (134 res code)
Running test : exception.NPE
*** FAILED **** : exception.NPE (134 res code)
Running test : gc.FinAlloc
*** FAILED **** : gc.FinAlloc (134 res code)
Running test : gc.Force
*** FAILED **** : gc.Force (134 res code)
Running test : gc.Fragment
*** FAILED **** : gc.Fragment (134 res code)
Running test : gc.Free
*** FAILED **** : gc.Free (134 res code)
Running test : gc.LOS
*** FAILED **** : gc.LOS (134 res code)
Running test : gc.List
*** FAILED **** : gc.List (134 res code)
Running test : gc.Mark
*** FAILED **** : gc.Mark (134 res code)
Running test : gc.MultiThreads
*** FAILED **** : gc.MultiThreads (134 res code)
Running test : gc.PhantomReferenceQueueTest
*** FAILED **** : gc.PhantomReferenceQueueTest (134 res code)
Running test : gc.PhantomReferenceTest
*** FAILED **** : gc.PhantomReferenceTest (134 res code)
Running test : gc.RefRemove
*** FAILED **** : gc.RefRemove (134 res code)
Running test : gc.StressRef
*** FAILED **** : gc.StressRef (134 res code)
Running test : gc.SynchronizedFinalizersTest
*** FAILED **** : gc.SynchronizedFinalizersTest (134 res code)
Running test : gc.ThreadSuspension
*** FAILED **** : gc.ThreadSuspension (134 res code)
Running test : gc.WeakReferenceTest
*** FAILED **** : gc.WeakReferenceTest (134 res code)
Running test : init.ErrorInInitializer
*** FAILED **** : init.ErrorInInitializer (134 res code)
Running test : init.Other
*** FAILED **** : init.Other (134 res code)
Running test : io.ArrayList
*** FAILED **** : io.ArrayList (134 res code)
Running test : io.Integers
*** FAILED **** : io.Integers (134 res code)
Running test : jni.LoadLibrary
*** FAILED **** : jni.LoadLibrary (134 res code)
Running test : outofmemory.Double
*** FAILED **** : outofmemory.Double (134 res code)
Running test : outofmemory.Int
*** FAILED **** : outofmemory.Int (134 res code)
Running test : outofmemory.Plain
*** FAILED **** : outofmemory.Plain (134 res code)
Running test : outofmemory.Ref
*** FAILED **** : outofmemory.Ref (134 res code)
Running test : outofmemory.Throw
*** FAILED **** : outofmemory.Throw (134 res code)
Running test : outofmemory.Vector
*** FAILED **** : outofmemory.Vector (134 res code)
Running test : outofmemory.VectorDouble
*** FAILED **** : outofmemory.VectorDouble (134 res code)
Running test : outofmemory.VectorInt
*** FAILED **** : outofmemory.VectorInt (134 res code)
Running test : outofmemory.VectorRef
*** FAILED **** : outofmemory.VectorRef (134 res code)
Running test : perf.CreateManyExceptions
*** FAILED **** : perf.CreateManyExceptions (134 res code)
Running test : perf.CreateManyExceptions_depth
*** FAILED **** : perf.CreateManyExceptions_depth (134 res code)
Running test : perf.MultiThreadsSimple
*** FAILED **** : perf.MultiThreadsSimple (134 res code)
Running test : perf.SeveralThreads
*** FAILED **** : perf.SeveralThreads (134 res code)
Running test : perf.StressCornerSize
*** FAILED **** : perf.StressCornerSize (134 res code)
Running test : perf.StressCornerSize_a
*** FAILED **** : perf.StressCornerSize_a (134 res code)
Running test : perf.ThrowMany
*** FAILED **** : perf.ThrowMany (134 res code)
Running test : perf.ThrowManyExceptions
*** FAILED **** : perf.ThrowManyExceptions (134 res code)
Running test : perf.ThrowManyExceptions_depth
*** FAILED **** : perf.ThrowManyExceptions_depth (134 res code)
Running test : perf.ThrowMany_depth
*** FAILED **** : perf.ThrowMany_depth (134 res code)
Running test : reflect.GetMethod
*** FAILED **** : reflect.GetMethod (134 res code)
Running test : shutdown.TestDaemonOnWait
*** FAILED **** : shutdown.TestDaemonOnWait (134 res code)
Running test : shutdown.TestFatalError
*** FAILED **** : shutdown.TestFatalError (134 res code)
Running test : shutdown.TestInterrupt
*** FAILED **** : shutdown.TestInterrupt (134 res code)
Running test : shutdown.TestLock
*** FAILED **** : shutdown.TestLock (134 res code)
Running test : stress.BigStringBuffer
*** FAILED **** : stress.BigStringBuffer (134 res code)
Running test : stress.Finalizer
*** FAILED **** : stress.Finalizer (134 res code)
Running test : stress.Mix
*** FAILED **** : stress.Mix (134 res code)
Running test : stress.Stack
*** FAILED **** : stress.Stack (134 res code)
Running test : stress.Sync
*** FAILED **** : stress.Sync (134 res code)
Running test : stress.Vector
*** FAILED **** : stress.Vector (134 res code)
Running test : stress.WeakHashmapTest
*** FAILED **** : stress.WeakHashmapTest (134 res code)
Running test : thread.ExitShutdownHook
*** FAILED **** : thread.ExitShutdownHook (134 res code)
Running test : thread.InfiniteFinalizer
*** FAILED **** : thread.InfiniteFinalizer (134 res code)
Running test : thread.Sleep
*** FAILED **** : thread.Sleep (134 res code)
Running test : thread.ThreadInterrupt
*** FAILED **** : thread.ThreadInterrupt (134 res code)
Running test : thread.ThreadOOM
*** FAILED **** : thread.ThreadOOM (134 res code)
Running test : util.Date
*** FAILED **** : util.Date (134 res code)
Running test : util.DoPriveleged
*** FAILED **** : util.DoPriveleged (134 res code)
Running test : util.Prop
*** FAILED **** : util.Prop (134 res code)
Running test : util.StringIntern
*** FAILED **** : util.StringIntern (134 res code)
Please find test classes and results at /export/cruise/trunk/cc/projects/drlvm/trunk/build/lnx_ia32_gcc_debug/semis/vm/_smoke.tests/

        ==================================
        Smoke tests on Server mode JIT
        ==================================
        

Using exclude file = /export/cruise/trunk/cc/projects/drlvm/trunk/build/make/excludes/exclude.drlvm_smoke.linux.x86.srv   
        
Check.java
PerfCheck.java

# breaks on ubuntu 6 w/ OOME
stress/Threads.java

# HARMONY-3495 hangs intermittently
gc/NPE.java

# HARMONY-3731
StackTest.java

                  
Running test : Hi
*** FAILED **** : Hi (134 res code)
Running test : classloader.ClassTestGetDeclaringClass
*** FAILED **** : classloader.ClassTestGetDeclaringClass (134 res code)
Running test : classloader.ExceptionInInitializerTest
*** FAILED **** : classloader.ExceptionInInitializerTest (134 res code)
Running test : classloader.LogLoader
*** FAILED **** : classloader.LogLoader (134 res code)
Running test : classloader.NotFound
*** FAILED **** : classloader.NotFound (134 res code)
Running test : classloader.StressLoader
*** FAILED **** : classloader.StressLoader (134 res code)
Running test : exception.ExceptionStackTest
*** FAILED **** : exception.ExceptionStackTest (134 res code)
Running test : exception.FinalizeStackTest
*** FAILED **** : exception.FinalizeStackTest (134 res code)
Running test : exception.NPE
*** FAILED **** : exception.NPE (134 res code)
Running test : gc.FinAlloc
*** FAILED **** : gc.FinAlloc (134 res code)
Running test : gc.Finalizer
*** FAILED **** : gc.Finalizer (134 res code)
Running test : gc.Force
*** FAILED **** : gc.Force (134 res code)
Running test : gc.Fragment
*** FAILED **** : gc.Fragment (134 res code)
Running test : gc.Free
*** FAILED **** : gc.Free (134 res code)
Running test : gc.LOS
*** FAILED **** : gc.LOS (134 res code)
Running test : gc.List
*** FAILED **** : gc.List (134 res code)
Running test : gc.Mark
*** FAILED **** : gc.Mark (134 res code)
Running test : gc.MultiThreads
*** FAILED **** : gc.MultiThreads (134 res code)
Running test : gc.PhantomReferenceQueueTest
*** FAILED **** : gc.PhantomReferenceQueueTest (134 res code)
Running test : gc.PhantomReferenceTest
*** FAILED **** : gc.PhantomReferenceTest (134 res code)
Running test : gc.RefRemove
*** FAILED **** : gc.RefRemove (134 res code)
Running test : gc.RunFinalizersOnExitTest
*** FAILED **** : gc.RunFinalizersOnExitTest (134 res code)
Running test : gc.StressRef
*** FAILED **** : gc.StressRef (134 res code)
Running test : gc.SynchronizedFinalizersTest
*** FAILED **** : gc.SynchronizedFinalizersTest (134 res code)
Running test : gc.ThreadSuspension
*** FAILED **** : gc.ThreadSuspension (134 res code)
Running test : gc.WeakReferenceTest
*** FAILED **** : gc.WeakReferenceTest (134 res code)
Running test : init.ErrorInInitializer
*** FAILED **** : init.ErrorInInitializer (134 res code)
Running test : init.Other
*** FAILED **** : init.Other (134 res code)
Running test : io.ArrayList
*** FAILED **** : io.ArrayList (134 res code)
Running test : io.Integers
*** FAILED **** : io.Integers (134 res code)
Running test : jni.LoadLibrary
*** FAILED **** : jni.LoadLibrary (134 res code)
Running test : outofmemory.Double
*** FAILED **** : outofmemory.Double (134 res code)
Running test : outofmemory.Int
*** FAILED **** : outofmemory.Int (134 res code)
Running test : outofmemory.Plain
*** FAILED **** : outofmemory.Plain (134 res code)
Running test : outofmemory.Ref
*** FAILED **** : outofmemory.Ref (134 res code)
Running test : outofmemory.Throw
*** FAILED **** : outofmemory.Throw (134 res code)
Running test : outofmemory.Vector
*** FAILED **** : outofmemory.Vector (134 res code)
Running test : outofmemory.VectorDouble
*** FAILED **** : outofmemory.VectorDouble (134 res code)
Running test : outofmemory.VectorInt
*** FAILED **** : outofmemory.VectorInt (134 res code)
Running test : outofmemory.VectorRef
*** FAILED **** : outofmemory.VectorRef (134 res code)
Running test : perf.CreateManyExceptions
*** FAILED **** : perf.CreateManyExceptions (134 res code)
Running test : perf.CreateManyExceptions_depth
*** FAILED **** : perf.CreateManyExceptions_depth (134 res code)
Running test : perf.MultiThreadsSimple
*** FAILED **** : perf.MultiThreadsSimple (134 res code)
Running test : perf.SeveralThreads
*** FAILED **** : perf.SeveralThreads (134 res code)
Running test : perf.StressCornerSize
*** FAILED **** : perf.StressCornerSize (134 res code)
Running test : perf.StressCornerSize_a
*** FAILED **** : perf.StressCornerSize_a (134 res code)
Running test : perf.ThrowMany
*** FAILED **** : perf.ThrowMany (134 res code)
Running test : perf.ThrowManyExceptions
*** FAILED **** : perf.ThrowManyExceptions (134 res code)
Running test : perf.ThrowManyExceptions_depth
*** FAILED **** : perf.ThrowManyExceptions_depth (134 res code)
Running test : perf.ThrowMany_depth
*** FAILED **** : perf.ThrowMany_depth (134 res code)
Running test : reflect.GetMethod
*** FAILED **** : reflect.GetMethod (134 res code)
Running test : shutdown.TestDaemonOnWait
*** FAILED **** : shutdown.TestDaemonOnWait (134 res code)
Running test : shutdown.TestFatalError
*** FAILED **** : shutdown.TestFatalError (134 res code)
Running test : shutdown.TestInterrupt
*** FAILED **** : shutdown.TestInterrupt (134 res code)
Running test : shutdown.TestLock
*** FAILED **** : shutdown.TestLock (134 res code)
Running test : stress.BigStringBuffer
*** FAILED **** : stress.BigStringBuffer (134 res code)
Running test : stress.Finalizer
*** FAILED **** : stress.Finalizer (134 res code)
Running test : stress.Mix
*** FAILED **** : stress.Mix (134 res code)
Running test : stress.Stack
*** FAILED **** : stress.Stack (134 res code)
Running test : stress.Sync
*** FAILED **** : stress.Sync (134 res code)
Running test : stress.Vector
*** FAILED **** : stress.Vector (134 res code)
Running test : stress.WeakHashmapTest
*** FAILED **** : stress.WeakHashmapTest (134 res code)
Running test : thread.ExitShutdownHook
*** FAILED **** : thread.ExitShutdownHook (134 res code)
Running test : thread.InfiniteFinalizer
*** FAILED **** : thread.InfiniteFinalizer (134 res code)
Running test : thread.Sleep
*** FAILED **** : thread.Sleep (134 res code)
Running test : thread.ThreadInterrupt
*** FAILED **** : thread.ThreadInterrupt (134 res code)
Running test : thread.ThreadOOM
*** FAILED **** : thread.ThreadOOM (134 res code)
Running test : util.Date
*** FAILED **** : util.Date (134 res code)
Running test : util.DoPriveleged
*** FAILED **** : util.DoPriveleged (134 res code)
Running test : util.Prop
*** FAILED **** : util.Prop (134 res code)
Running test : util.StringIntern
*** FAILED **** : util.StringIntern (134 res code)
Please find test classes and results at /export/cruise/trunk/cc/projects/drlvm/trunk/build/lnx_ia32_gcc_debug/semis/vm/_smoke.tests/
The test report is in /export/cruise/trunk/cc/projects/drlvm/trunk/build/lnx_ia32_gcc_debug/semis/vm/_smoke.tests/reports/html/index.html
Note: Some input files use or override a deprecated API.
Note: Recompile with -Xlint:deprecation for details.
Note: /export/cruise/trunk/cc/projects/drlvm/trunk/vm/tests/kernel/java/lang/ClassAnnotationsTest.java uses unchecked or unsafe operations.
Note: Recompile with -Xlint:unchecked for details.

        ==================================
        Run kernel tests using interpreter
        ==================================
        

Using exclude file = /export/cruise/trunk/cc/projects/drlvm/trunk/build/make/excludes/exclude.drlvm_kernel.linux.x86.int   
        
## These tests are too slow
java/lang/RuntimeAdditionalTest*.java

## Tese tests are unstable and hang often
java/lang/RuntimeAdditionalTest11.java
java/lang/RuntimeAdditionalTest34.java
java/lang/RuntimeAdditionalTest39.java
java/lang/RuntimeAdditionalTest40.java
java/lang/RuntimeAdditionalTest41.java
java/lang/RuntimeAdditionalTest42.java

                  
java: /export/cruise/trunk/cc/projects/drlvm/trunk/vm/vmcore/src/class_support/classloader.cpp:365: Class* ClassLoader::LoadVerifyAndPrepareClass(Global_Env*, const String*): Assertion `hythread_is_suspend_enabled()' failed.
SIGABRT in VM code.
Stack trace:
  0: ?? (??:-1)
  1: abort (??:-1)
  2: __assert_fail (??:-1)
  3: ClassLoader::LoadVerifyAndPrepareClass(Global_Env*, String const*) (/export/cruise/trunk/cc/projects/drlvm/trunk/vm/vmcore/src/class_support/classloader.cpp:367)
  4: Global_Env::LoadCoreClass(String const*) (/export/cruise/trunk/cc/projects/drlvm/trunk/vm/vmcore/src/class_support/Environment.cpp:280)
  5: Global_Env::LoadCoreClass(char const*) (/export/cruise/trunk/cc/projects/drlvm/trunk/vm/vmcore/src/class_support/Environment.cpp:292)
  6: getClassRegistryMethod (/export/cruise/trunk/cc/projects/drlvm/trunk/vm/vmcore/src/class_support/classloader.cpp:1601)
  7: ClassLoader::InsertClass(Class*) (/export/cruise/trunk/cc/projects/drlvm/trunk/vm/vmcore/src/class_support/classloader.cpp:1645)
  8: ClassLoader::DefineClass(Global_Env*, char const*, unsigned char*, unsigned int, unsigned int, String const**) (/export/cruise/trunk/cc/projects/drlvm/trunk/vm/vmcore/src/class_support/classloader.cpp:317)
  9: DefineClass(JNIEnv_External*, char const*, _jobject*, signed char const*, int) (/export/cruise/trunk/cc/projects/drlvm/trunk/vm/vmcore/src/jni/jni.cpp:603)
 10: Java_java_lang_ClassLoader_defineClass0 (/export/cruise/trunk/cc/projects/drlvm/trunk/vm/vmcore/src/kernel_classes/native/java_lang_VMClassRegistry.cpp:64)
 11: invokeJNI (/export/cruise/trunk/cc/projects/drlvm/trunk/vm/interpreter/src/invokeJNI_ia32.asm:37)
 12: interpreterInvokeVirtualNative(StackFrame&, StackFrame&, Method*, int) (/export/cruise/trunk/cc/projects/drlvm/trunk/vm/interpreter/src/interp_native_ia32.cpp:605)
 13: interpreterInvokeSpecial (/export/cruise/trunk/cc/projects/drlvm/trunk/vm/interpreter/src/interpreter.cpp:3578)
 14: Opcode_INVOKESPECIAL(StackFrame&) (/export/cruise/trunk/cc/projects/drlvm/trunk/vm/interpreter/src/interpreter.cpp:2125)
 15: java/lang/ClassLoader.defineClass(Ljava/lang/String;[BIILjava/security/ProtectionDomain;)Ljava/lang/Class; (ClassLoader.java:436)
 16: interpreterInvoke (/export/cruise/trunk/cc/projects/drlvm/trunk/vm/interpreter/src/interpreter.cpp:3406)
 17: interpreterInvokeVirtual (/export/cruise/trunk/cc/projects/drlvm/trunk/vm/interpreter/src/interpreter.cpp:3488)
 18: Opcode_INVOKEVIRTUAL(StackFrame&) (/export/cruise/trunk/cc/projects/drlvm/trunk/vm/interpreter/src/interpreter.cpp:2060)
 19: java/security/SecureClassLoader.defineClass(Ljava/lang/String;[BIILjava/security/CodeSource;)Ljava/lang/Class; (SecureClassLoader.java:70)
 20: interpreterInvoke (/export/cruise/trunk/cc/projects/drlvm/trunk/vm/interpreter/src/interpreter.cpp:3406)
 21: interpreterInvokeVirtual (/export/cruise/trunk/cc/projects/drlvm/trunk/vm/interpreter/src/interpreter.cpp:3488)
 22: Opcode_INVOKEVIRTUAL(StackFrame&) (/export/cruise/trunk/cc/projects/drlvm/trunk/vm/interpreter/src/interpreter.cpp:2060)
 23: java/net/URLClassLoader.findClassImpl([Ljava/net/URL;Ljava/lang/String;)Ljava/lang/Class; (URLClassLoader.java:1214)
 24: interpreterInvoke (/export/cruise/trunk/cc/projects/drlvm/trunk/vm/interpreter/src/interpreter.cpp:3406)
 25: interpreterInvokeVirtual (/export/cruise/trunk/cc/projects/drlvm/trunk/vm/interpreter/src/interpreter.cpp:3488)
 26: Opcode_INVOKEVIRTUAL(StackFrame&) (/export/cruise/trunk/cc/projects/drlvm/trunk/vm/interpreter/src/interpreter.cpp:2060)
 27: java/net/URLClassLoader$4.run()Ljava/lang/Class; (URLClassLoader.java:625)
 28: interpreterInvoke (/export/cruise/trunk/cc/projects/drlvm/trunk/vm/interpreter/src/interpreter.cpp:3406)
 29: interpreterInvokeVirtual (/export/cruise/trunk/cc/projects/drlvm/trunk/vm/interpreter/src/interpreter.cpp:3488)
 30: Opcode_INVOKEVIRTUAL(StackFrame&) (/export/cruise/trunk/cc/projects/drlvm/trunk/vm/interpreter/src/interpreter.cpp:2060)
 31: java/net/URLClassLoader$4.run()Ljava/lang/Object; (URLClassLoader.java:1)
 32: interpreterInvoke (/export/cruise/trunk/cc/projects/drlvm/trunk/vm/interpreter/src/interpreter.cpp:3406)
 33: interpreterInvokeInterface (/export/cruise/trunk/cc/projects/drlvm/trunk/vm/interpreter/src/interpreter.cpp:3543)
 34: Opcode_INVOKEINTERFACE(StackFrame&) (/export/cruise/trunk/cc/projects/drlvm/trunk/vm/interpreter/src/interpreter.cpp:2080)
 35: java/security/AccessController.doPrivilegedImpl(Ljava/security/PrivilegedAction;Ljava/security/AccessControlContext;)Ljava/lang/Object; (AccessController.java:173)
 36: interpreterInvokeStatic (/export/cruise/trunk/cc/projects/drlvm/trunk/vm/interpreter/src/interpreter.cpp:3316)
 37: Opcode_INVOKESTATIC(StackFrame&) (/export/cruise/trunk/cc/projects/drlvm/trunk/vm/interpreter/src/interpreter.cpp:2104)
 38: java/security/AccessController.doPrivileged(Ljava/security/PrivilegedAction;Ljava/security/AccessControlContext;)Ljava/lang/Object; (AccessController.java:64)
 39: interpreterInvokeStatic (/export/cruise/trunk/cc/projects/drlvm/trunk/vm/interpreter/src/interpreter.cpp:3316)
 40: Opcode_INVOKESTATIC(StackFrame&) (/export/cruise/trunk/cc/projects/drlvm/trunk/vm/interpreter/src/interpreter.cpp:2104)
 41: java/net/URLClassLoader.findClass(Ljava/lang/String;)Ljava/lang/Class; (URLClassLoader.java:622)
 42: interpreterInvoke (/export/cruise/trunk/cc/projects/drlvm/trunk/vm/interpreter/src/interpreter.cpp:3406)
 43: interpreterInvokeVirtual (/export/cruise/trunk/cc/projects/drlvm/trunk/vm/interpreter/src/interpreter.cpp:3488)
 44: Opcode_INVOKEVIRTUAL(StackFrame&) (/export/cruise/trunk/cc/projects/drlvm/trunk/vm/interpreter/src/interpreter.cpp:2060)
 45: java/lang/ClassLoader.loadClass(Ljava/lang/String;Z)Ljava/lang/Class; (ClassLoader.java:574)
 46: interpreterInvokeSpecial (/export/cruise/trunk/cc/projects/drlvm/trunk/vm/interpreter/src/interpreter.cpp:3602)
 47: Opcode_INVOKESPECIAL(StackFrame&) (/export/cruise/trunk/cc/projects/drlvm/trunk/vm/interpreter/src/interpreter.cpp:2125)
 48: java/lang/ClassLoader$SystemClassLoader.loadClass(Ljava/lang/String;Z)Ljava/lang/Class; (ClassLoader.java:962)
 49: interpreterInvoke (/export/cruise/trunk/cc/projects/drlvm/trunk/vm/interpreter/src/interpreter.cpp:3406)
 50: interpreterInvokeVirtual (/export/cruise/trunk/cc/projects/drlvm/trunk/vm/interpreter/src/interpreter.cpp:3488)
 51: Opcode_INVOKEVIRTUAL(StackFrame&) (/export/cruise/trunk/cc/projects/drlvm/trunk/vm/interpreter/src/interpreter.cpp:2060)
 52: java/lang/ClassLoader.loadClass(Ljava/lang/String;)Ljava/lang/Class; (ClassLoader.java:319)
 53: interpreter_execute_method(Method*, jvalue*, jvalue*) (/export/cruise/trunk/cc/projects/drlvm/trunk/vm/interpreter/src/interpreter.cpp:3209)
 54: JIT_execute_method (/export/cruise/trunk/cc/projects/drlvm/trunk/vm/interpreter/src/interp_exports.cpp:166)
 55: DrlEMImpl::executeMethod(_jmethodID*, jvalue*, jvalue*) (/export/cruise/trunk/cc/projects/drlvm/trunk/vm/em/src/DrlEMImpl.cpp:509)
 56: ExecuteMethod (/export/cruise/trunk/cc/projects/drlvm/trunk/vm/em/src/em_intf.cpp:43)
 57: vm_execute_java_method_array(_jmethodID*, jvalue*, jvalue*) (/export/cruise/trunk/cc/projects/drlvm/trunk/vm/vmcore/src/jit/ini.cpp:60)
 58: UserDefinedClassLoader::DoLoadClass(Global_Env*, String const*) (/export/cruise/trunk/cc/projects/drlvm/trunk/vm/vmcore/src/class_support/classloader.cpp:1534)
 59: ClassLoader::LoadClass(Global_Env*, String const*) (/export/cruise/trunk/cc/projects/drlvm/trunk/vm/vmcore/src/class_support/classloader.cpp:1400)
 60: ClassLoader::LoadVerifyAndPrepareClass(Global_Env*, String const*) (/export/cruise/trunk/cc/projects/drlvm/trunk/vm/vmcore/src/class_support/classloader.cpp:367)
 61: class_load_verify_prepare_by_loader_jni(Global_Env*, String const*, ClassLoader*) (/export/cruise/trunk/cc/projects/drlvm/trunk/vm/vmcore/src/class_support/Class_File_Loader.cpp:3644)
 62: FindClass(JNIEnv_External*, String*) (/export/cruise/trunk/cc/projects/drlvm/trunk/vm/vmcore/src/jni/jni_utils.cpp:688)
 63: FindClass(JNIEnv_External*, char const*) (/export/cruise/trunk/cc/projects/drlvm/trunk/vm/vmcore/src/jni/jni.cpp:638)
 64: main_runJavaMain (../shared/main.c:1230)
 65: invocation (../shared/main.c:732)
 66: gpProtectedMain (../shared/main.c:381)
 67: main (../shared/cmain.c:146)
 68: __libc_start_main (??:-1)
 69: _start (../sysdeps/i386/elf/start.S:105)
<end of stack trace>

        ==================================
        Run kernel tests using Client mode JIT (default)
        ==================================
        

Using exclude file = /export/cruise/trunk/cc/projects/drlvm/trunk/build/make/excludes/exclude.drlvm_kernel.linux.x86.jit   
        
## These tests are too slow
java/lang/RuntimeAdditionalTest*.java

## Tese tests are unstable and hang often
java/lang/RuntimeAdditionalTest11.java
java/lang/RuntimeAdditionalTest34.java
java/lang/RuntimeAdditionalTest39.java
java/lang/RuntimeAdditionalTest40.java
java/lang/RuntimeAdditionalTest41.java
java/lang/RuntimeAdditionalTest42.java


                  
java: /export/cruise/trunk/cc/projects/drlvm/trunk/vm/vmcore/src/class_support/classloader.cpp:365: Class* ClassLoader::LoadVerifyAndPrepareClass(Global_Env*, const String*): Assertion `hythread_is_suspend_enabled()' failed.
SIGABRT in VM code.
Stack trace:
  0: ?? (??:-1)
  1: abort (??:-1)
  2: __assert_fail (??:-1)
  3: ClassLoader::LoadVerifyAndPrepareClass(Global_Env*, String const*) (/export/cruise/trunk/cc/projects/drlvm/trunk/vm/vmcore/src/class_support/classloader.cpp:367)
  4: Global_Env::LoadCoreClass(String const*) (/export/cruise/trunk/cc/projects/drlvm/trunk/vm/vmcore/src/class_support/Environment.cpp:280)
  5: Global_Env::LoadCoreClass(char const*) (/export/cruise/trunk/cc/projects/drlvm/trunk/vm/vmcore/src/class_support/Environment.cpp:292)
  6: getClassRegistryMethod (/export/cruise/trunk/cc/projects/drlvm/trunk/vm/vmcore/src/class_support/classloader.cpp:1601)
  7: ClassLoader::InsertClass(Class*) (/export/cruise/trunk/cc/projects/drlvm/trunk/vm/vmcore/src/class_support/classloader.cpp:1645)
  8: ClassLoader::DefineClass(Global_Env*, char const*, unsigned char*, unsigned int, unsigned int, String const**) (/export/cruise/trunk/cc/projects/drlvm/trunk/vm/vmcore/src/class_support/classloader.cpp:317)
  9: DefineClass(JNIEnv_External*, char const*, _jobject*, signed char const*, int) (/export/cruise/trunk/cc/projects/drlvm/trunk/vm/vmcore/src/jni/jni.cpp:603)
 10: Java_java_lang_ClassLoader_defineClass0 (/export/cruise/trunk/cc/projects/drlvm/trunk/vm/vmcore/src/kernel_classes/native/java_lang_VMClassRegistry.cpp:64)
 11: 0x52C834B1  <Generated stub>
 12: java/lang/ClassLoader.defineClass(Ljava/lang/String;[BIILjava/security/ProtectionDomain;)Ljava/lang/Class; (ClassLoader.java:436)
 13: java/security/SecureClassLoader.defineClass(Ljava/lang/String;[BIILjava/security/CodeSource;)Ljava/lang/Class; (SecureClassLoader.java:70)
 14: java/net/URLClassLoader.findClassImpl([Ljava/net/URL;Ljava/lang/String;)Ljava/lang/Class; (URLClassLoader.java:1214)
 15: java/net/URLClassLoader$4.run()Ljava/lang/Class; (URLClassLoader.java:625)
 16: java/net/URLClassLoader$4.run()Ljava/lang/Object; (URLClassLoader.java:1)
 17: java/security/AccessController.doPrivilegedImpl(Ljava/security/PrivilegedAction;Ljava/security/AccessControlContext;)Ljava/lang/Object; (AccessController.java:171)
 18: java/security/AccessController.doPrivileged(Ljava/security/PrivilegedAction;Ljava/security/AccessControlContext;)Ljava/lang/Object; (AccessController.java:64)
 19: java/net/URLClassLoader.findClass(Ljava/lang/String;)Ljava/lang/Class; (URLClassLoader.java:627)
 20: java/lang/ClassLoader.loadClass(Ljava/lang/String;Z)Ljava/lang/Class; (ClassLoader.java:574)
 21: java/lang/ClassLoader$SystemClassLoader.loadClass(Ljava/lang/String;Z)Ljava/lang/Class; (ClassLoader.java:962)
 22: java/lang/ClassLoader.loadClass(Ljava/lang/String;)Ljava/lang/Class; (ClassLoader.java:319)
 23: vm_invoke_native_array_stub (/export/cruise/trunk/cc/projects/drlvm/trunk/vm/vmcore/src/util/ia32/base/invoke_native_stub_ia32.asm:41)
 24: JIT_execute_method_default(void*, _jmethodID*, jvalue*, jvalue*) (/export/cruise/trunk/cc/projects/drlvm/trunk/vm/vmcore/src/util/ia32/base/ini_iA32.cpp:206)
 25: DrlEMImpl::executeMethod(_jmethodID*, jvalue*, jvalue*) (/export/cruise/trunk/cc/projects/drlvm/trunk/vm/em/src/DrlEMImpl.cpp:509)
 26: ExecuteMethod (/export/cruise/trunk/cc/projects/drlvm/trunk/vm/em/src/em_intf.cpp:43)
 27: vm_execute_java_method_array(_jmethodID*, jvalue*, jvalue*) (/export/cruise/trunk/cc/projects/drlvm/trunk/vm/vmcore/src/jit/ini.cpp:60)
 28: UserDefinedClassLoader::DoLoadClass(Global_Env*, String const*) (/export/cruise/trunk/cc/projects/drlvm/trunk/vm/vmcore/src/class_support/classloader.cpp:1534)
 29: ClassLoader::LoadClass(Global_Env*, String const*) (/export/cruise/trunk/cc/projects/drlvm/trunk/vm/vmcore/src/class_support/classloader.cpp:1400)
 30: ClassLoader::LoadVerifyAndPrepareClass(Global_Env*, String const*) (/export/cruise/trunk/cc/projects/drlvm/trunk/vm/vmcore/src/class_support/classloader.cpp:367)
 31: class_load_verify_prepare_by_loader_jni(Global_Env*, String const*, ClassLoader*) (/export/cruise/trunk/cc/projects/drlvm/trunk/vm/vmcore/src/class_support/Class_File_Loader.cpp:3644)
 32: FindClass(JNIEnv_External*, String*) (/export/cruise/trunk/cc/projects/drlvm/trunk/vm/vmcore/src/jni/jni_utils.cpp:688)
 33: FindClass(JNIEnv_External*, char const*) (/export/cruise/trunk/cc/projects/drlvm/trunk/vm/vmcore/src/jni/jni.cpp:638)
 34: main_runJavaMain (../shared/main.c:1230)
 35: invocation (../shared/main.c:732)
 36: gpProtectedMain (../shared/main.c:381)
 37: main (../shared/cmain.c:146)
 38: __libc_start_main (??:-1)
 39: _start (../sysdeps/i386/elf/start.S:105)
<end of stack trace>

        ==================================
        Run kernel tests using jitrino.JET
        ==================================
        

Using exclude file = /export/cruise/trunk/cc/projects/drlvm/trunk/build/make/excludes/exclude.drlvm_kernel.linux.x86.jet   
        
## These tests are too slow
java/lang/RuntimeAdditionalTest*.java

## Tese tests are unstable and hang often
java/lang/RuntimeAdditionalTest11.java
java/lang/RuntimeAdditionalTest34.java
java/lang/RuntimeAdditionalTest39.java
java/lang/RuntimeAdditionalTest40.java
java/lang/RuntimeAdditionalTest41.java
java/lang/RuntimeAdditionalTest42.java


                  
java: /export/cruise/trunk/cc/projects/drlvm/trunk/vm/vmcore/src/class_support/classloader.cpp:365: Class* ClassLoader::LoadVerifyAndPrepareClass(Global_Env*, const String*): Assertion `hythread_is_suspend_enabled()' failed.
SIGABRT in VM code.
Stack trace:
  0: ?? (??:-1)
  1: abort (??:-1)
  2: __assert_fail (??:-1)
  3: ClassLoader::LoadVerifyAndPrepareClass(Global_Env*, String const*) (/export/cruise/trunk/cc/projects/drlvm/trunk/vm/vmcore/src/class_support/classloader.cpp:367)
  4: Global_Env::LoadCoreClass(String const*) (/export/cruise/trunk/cc/projects/drlvm/trunk/vm/vmcore/src/class_support/Environment.cpp:280)
  5: Global_Env::LoadCoreClass(char const*) (/export/cruise/trunk/cc/projects/drlvm/trunk/vm/vmcore/src/class_support/Environment.cpp:292)
  6: getClassRegistryMethod (/export/cruise/trunk/cc/projects/drlvm/trunk/vm/vmcore/src/class_support/classloader.cpp:1601)
  7: ClassLoader::InsertClass(Class*) (/export/cruise/trunk/cc/projects/drlvm/trunk/vm/vmcore/src/class_support/classloader.cpp:1645)
  8: ClassLoader::DefineClass(Global_Env*, char const*, unsigned char*, unsigned int, unsigned int, String const**) (/export/cruise/trunk/cc/projects/drlvm/trunk/vm/vmcore/src/class_support/classloader.cpp:317)
  9: DefineClass(JNIEnv_External*, char const*, _jobject*, signed char const*, int) (/export/cruise/trunk/cc/projects/drlvm/trunk/vm/vmcore/src/jni/jni.cpp:603)
 10: Java_java_lang_ClassLoader_defineClass0 (/export/cruise/trunk/cc/projects/drlvm/trunk/vm/vmcore/src/kernel_classes/native/java_lang_VMClassRegistry.cpp:64)
 11: 0x5298ACE1  <Generated stub>
 12: java/lang/ClassLoader.defineClass(Ljava/lang/String;[BIILjava/security/ProtectionDomain;)Ljava/lang/Class; (ClassLoader.java:436)
 13: java/security/SecureClassLoader.defineClass(Ljava/lang/String;[BIILjava/security/CodeSource;)Ljava/lang/Class; (SecureClassLoader.java:70)
 14: java/net/URLClassLoader.findClassImpl([Ljava/net/URL;Ljava/lang/String;)Ljava/lang/Class; (URLClassLoader.java:1214)
 15: java/net/URLClassLoader$4.run()Ljava/lang/Class; (URLClassLoader.java:625)
 16: java/net/URLClassLoader$4.run()Ljava/lang/Object; (URLClassLoader.java:1)
 17: java/security/AccessController.doPrivilegedImpl(Ljava/security/PrivilegedAction;Ljava/security/AccessControlContext;)Ljava/lang/Object; (AccessController.java:171)
 18: java/security/AccessController.doPrivileged(Ljava/security/PrivilegedAction;Ljava/security/AccessControlContext;)Ljava/lang/Object; (AccessController.java:64)
 19: java/net/URLClassLoader.findClass(Ljava/lang/String;)Ljava/lang/Class; (URLClassLoader.java:627)
 20: java/lang/ClassLoader.loadClass(Ljava/lang/String;Z)Ljava/lang/Class; (ClassLoader.java:574)
 21: java/lang/ClassLoader$SystemClassLoader.loadClass(Ljava/lang/String;Z)Ljava/lang/Class; (ClassLoader.java:962)
 22: java/lang/ClassLoader.loadClass(Ljava/lang/String;)Ljava/lang/Class; (ClassLoader.java:319)
 23: vm_invoke_native_array_stub (/export/cruise/trunk/cc/projects/drlvm/trunk/vm/vmcore/src/util/ia32/base/invoke_native_stub_ia32.asm:41)
 24: JIT_execute_method_default(void*, _jmethodID*, jvalue*, jvalue*) (/export/cruise/trunk/cc/projects/drlvm/trunk/vm/vmcore/src/util/ia32/base/ini_iA32.cpp:206)
 25: DrlEMImpl::executeMethod(_jmethodID*, jvalue*, jvalue*) (/export/cruise/trunk/cc/projects/drlvm/trunk/vm/em/src/DrlEMImpl.cpp:509)
 26: ExecuteMethod (/export/cruise/trunk/cc/projects/drlvm/trunk/vm/em/src/em_intf.cpp:43)
 27: vm_execute_java_method_array(_jmethodID*, jvalue*, jvalue*) (/export/cruise/trunk/cc/projects/drlvm/trunk/vm/vmcore/src/jit/ini.cpp:60)
 28: UserDefinedClassLoader::DoLoadClass(Global_Env*, String const*) (/export/cruise/trunk/cc/projects/drlvm/trunk/vm/vmcore/src/class_support/classloader.cpp:1534)
 29: ClassLoader::LoadClass(Global_Env*, String const*) (/export/cruise/trunk/cc/projects/drlvm/trunk/vm/vmcore/src/class_support/classloader.cpp:1400)
 30: ClassLoader::LoadVerifyAndPrepareClass(Global_Env*, String const*) (/export/cruise/trunk/cc/projects/drlvm/trunk/vm/vmcore/src/class_support/classloader.cpp:367)
 31: class_load_verify_prepare_by_loader_jni(Global_Env*, String const*, ClassLoader*) (/export/cruise/trunk/cc/projects/drlvm/trunk/vm/vmcore/src/class_support/Class_File_Loader.cpp:3644)
 32: FindClass(JNIEnv_External*, String*) (/export/cruise/trunk/cc/projects/drlvm/trunk/vm/vmcore/src/jni/jni_utils.cpp:688)
 33: FindClass(JNIEnv_External*, char const*) (/export/cruise/trunk/cc/projects/drlvm/trunk/vm/vmcore/src/jni/jni.cpp:638)
 34: main_runJavaMain (../shared/main.c:1230)
 35: invocation (../shared/main.c:732)
 36: gpProtectedMain (../shared/main.c:381)
 37: main (../shared/cmain.c:146)
 38: __libc_start_main (??:-1)
 39: _start (../sysdeps/i386/elf/start.S:105)
<end of stack trace>

        ==================================
        Run kernel tests using jitrino.OPT
        ==================================
        

Using exclude file = /export/cruise/trunk/cc/projects/drlvm/trunk/build/make/excludes/exclude.drlvm_kernel.linux.x86.opt   
        
## These tests are too slow
java/lang/RuntimeAdditionalTest*.java

## Tese tests are unstable and hang often
java/lang/RuntimeAdditionalTest11.java
java/lang/RuntimeAdditionalTest34.java
java/lang/RuntimeAdditionalTest39.java
java/lang/RuntimeAdditionalTest40.java
java/lang/RuntimeAdditionalTest41.java
java/lang/RuntimeAdditionalTest42.java


                  
java: /export/cruise/trunk/cc/projects/drlvm/trunk/vm/vmcore/src/class_support/classloader.cpp:365: Class* ClassLoader::LoadVerifyAndPrepareClass(Global_Env*, const String*): Assertion `hythread_is_suspend_enabled()' failed.
SIGABRT in VM code.
Stack trace:
  0: ?? (??:-1)
  1: abort (??:-1)
  2: __assert_fail (??:-1)
  3: ClassLoader::LoadVerifyAndPrepareClass(Global_Env*, String const*) (/export/cruise/trunk/cc/projects/drlvm/trunk/vm/vmcore/src/class_support/classloader.cpp:367)
  4: Global_Env::LoadCoreClass(String const*) (/export/cruise/trunk/cc/projects/drlvm/trunk/vm/vmcore/src/class_support/Environment.cpp:280)
  5: Global_Env::LoadCoreClass(char const*) (/export/cruise/trunk/cc/projects/drlvm/trunk/vm/vmcore/src/class_support/Environment.cpp:292)
  6: getClassRegistryMethod (/export/cruise/trunk/cc/projects/drlvm/trunk/vm/vmcore/src/class_support/classloader.cpp:1601)
  7: ClassLoader::InsertClass(Class*) (/export/cruise/trunk/cc/projects/drlvm/trunk/vm/vmcore/src/class_support/classloader.cpp:1645)
  8: ClassLoader::DefineClass(Global_Env*, char const*, unsigned char*, unsigned int, unsigned int, String const**) (/export/cruise/trunk/cc/projects/drlvm/trunk/vm/vmcore/src/class_support/classloader.cpp:317)
  9: DefineClass(JNIEnv_External*, char const*, _jobject*, signed char const*, int) (/export/cruise/trunk/cc/projects/drlvm/trunk/vm/vmcore/src/jni/jni.cpp:603)
 10: Java_java_lang_ClassLoader_defineClass0 (/export/cruise/trunk/cc/projects/drlvm/trunk/vm/vmcore/src/kernel_classes/native/java_lang_VMClassRegistry.cpp:64)
 11: 0x52DD5EB1  <Generated stub>
 12: java/lang/ClassLoader.defineClass(Ljava/lang/String;[BIILjava/security/ProtectionDomain;)Ljava/lang/Class; (ClassLoader.java:436)
 13: java/security/SecureClassLoader.defineClass(Ljava/lang/String;[BIILjava/security/CodeSource;)Ljava/lang/Class; (SecureClassLoader.java:70)
 14: java/net/URLClassLoader.findClassImpl([Ljava/net/URL;Ljava/lang/String;)Ljava/lang/Class; (URLClassLoader.java:1214)
 15: java/net/URLClassLoader$4.run()Ljava/lang/Class; (URLClassLoader.java:-1)
 16: java/net/URLClassLoader$4.run()Ljava/lang/Object; (URLClassLoader.java:1)
 17: java/security/AccessController.doPrivilegedImpl(Ljava/security/PrivilegedAction;Ljava/security/AccessControlContext;)Ljava/lang/Object; (AccessController.java:-1)
 18: java/security/AccessController.doPrivileged(Ljava/security/PrivilegedAction;Ljava/security/AccessControlContext;)Ljava/lang/Object; (AccessController.java:64)
 19: java/net/URLClassLoader.findClass(Ljava/lang/String;)Ljava/lang/Class; (URLClassLoader.java:622)
 20: java/lang/ClassLoader.loadClass(Ljava/lang/String;Z)Ljava/lang/Class; (ClassLoader.java:-1)
 21: java/lang/ClassLoader$SystemClassLoader.loadClass(Ljava/lang/String;Z)Ljava/lang/Class; (ClassLoader.java:962)
 22: java/lang/ClassLoader.loadClass(Ljava/lang/String;)Ljava/lang/Class; (ClassLoader.java:-1)
 23: vm_invoke_native_array_stub (/export/cruise/trunk/cc/projects/drlvm/trunk/vm/vmcore/src/util/ia32/base/invoke_native_stub_ia32.asm:41)
 24: JIT_execute_method_default(void*, _jmethodID*, jvalue*, jvalue*) (/export/cruise/trunk/cc/projects/drlvm/trunk/vm/vmcore/src/util/ia32/base/ini_iA32.cpp:206)
 25: DrlEMImpl::executeMethod(_jmethodID*, jvalue*, jvalue*) (/export/cruise/trunk/cc/projects/drlvm/trunk/vm/em/src/DrlEMImpl.cpp:509)
 26: ExecuteMethod (/export/cruise/trunk/cc/projects/drlvm/trunk/vm/em/src/em_intf.cpp:43)
 27: vm_execute_java_method_array(_jmethodID*, jvalue*, jvalue*) (/export/cruise/trunk/cc/projects/drlvm/trunk/vm/vmcore/src/jit/ini.cpp:60)
 28: UserDefinedClassLoader::DoLoadClass(Global_Env*, String const*) (/export/cruise/trunk/cc/projects/drlvm/trunk/vm/vmcore/src/class_support/classloader.cpp:1534)
 29: ClassLoader::LoadClass(Global_Env*, String const*) (/export/cruise/trunk/cc/projects/drlvm/trunk/vm/vmcore/src/class_support/classloader.cpp:1400)
 30: ClassLoader::LoadVerifyAndPrepareClass(Global_Env*, String const*) (/export/cruise/trunk/cc/projects/drlvm/trunk/vm/vmcore/src/class_support/classloader.cpp:367)
 31: class_load_verify_prepare_by_loader_jni(Global_Env*, String const*, ClassLoader*) (/export/cruise/trunk/cc/projects/drlvm/trunk/vm/vmcore/src/class_support/Class_File_Loader.cpp:3644)
 32: FindClass(JNIEnv_External*, String*) (/export/cruise/trunk/cc/projects/drlvm/trunk/vm/vmcore/src/jni/jni_utils.cpp:688)
 33: FindClass(JNIEnv_External*, char const*) (/export/cruise/trunk/cc/projects/drlvm/trunk/vm/vmcore/src/jni/jni.cpp:638)
 34: main_runJavaMain (../shared/main.c:1230)
 35: invocation (../shared/main.c:732)
 36: gpProtectedMain (../shared/main.c:381)
 37: main (../shared/cmain.c:146)
 38: __libc_start_main (??:-1)
 39: _start (../sysdeps/i386/elf/start.S:105)
<end of stack trace>

        ==================================
        Run kernel tests using Server mode JIT
        ==================================
        

Using exclude file = /export/cruise/trunk/cc/projects/drlvm/trunk/build/make/excludes/exclude.drlvm_kernel.linux.x86.srv   
        
## These tests are too slow
java/lang/RuntimeAdditionalTest*.java

## Tese tests are unstable and hang often
java/lang/RuntimeAdditionalTest11.java
java/lang/RuntimeAdditionalTest34.java
java/lang/RuntimeAdditionalTest39.java
java/lang/RuntimeAdditionalTest40.java
java/lang/RuntimeAdditionalTest41.java
java/lang/RuntimeAdditionalTest42.java


                  
java: /export/cruise/trunk/cc/projects/drlvm/trunk/vm/vmcore/src/class_support/classloader.cpp:365: Class* ClassLoader::LoadVerifyAndPrepareClass(Global_Env*, const String*): Assertion `hythread_is_suspend_enabled()' failed.
SIGABRT in VM code.
Stack trace:
  0: ?? (??:-1)
  1: abort (??:-1)
  2: __assert_fail (??:-1)
  3: ClassLoader::LoadVerifyAndPrepareClass(Global_Env*, String const*) (/export/cruise/trunk/cc/projects/drlvm/trunk/vm/vmcore/src/class_support/classloader.cpp:367)
  4: Global_Env::LoadCoreClass(String const*) (/export/cruise/trunk/cc/projects/drlvm/trunk/vm/vmcore/src/class_support/Environment.cpp:280)
  5: Global_Env::LoadCoreClass(char const*) (/export/cruise/trunk/cc/projects/drlvm/trunk/vm/vmcore/src/class_support/Environment.cpp:292)
  6: getClassRegistryMethod (/export/cruise/trunk/cc/projects/drlvm/trunk/vm/vmcore/src/class_support/classloader.cpp:1601)
  7: ClassLoader::InsertClass(Class*) (/export/cruise/trunk/cc/projects/drlvm/trunk/vm/vmcore/src/class_support/classloader.cpp:1645)
  8: ClassLoader::DefineClass(Global_Env*, char const*, unsigned char*, unsigned int, unsigned int, String const**) (/export/cruise/trunk/cc/projects/drlvm/trunk/vm/vmcore/src/class_support/classloader.cpp:317)
  9: DefineClass(JNIEnv_External*, char const*, _jobject*, signed char const*, int) (/export/cruise/trunk/cc/projects/drlvm/trunk/vm/vmcore/src/jni/jni.cpp:603)
 10: Java_java_lang_ClassLoader_defineClass0 (/export/cruise/trunk/cc/projects/drlvm/trunk/vm/vmcore/src/kernel_classes/native/java_lang_VMClassRegistry.cpp:64)
 11: 0x5296E611  <Generated stub>
 12: java/lang/ClassLoader.defineClass(Ljava/lang/String;[BIILjava/security/ProtectionDomain;)Ljava/lang/Class; (ClassLoader.java:436)
 13: java/security/SecureClassLoader.defineClass(Ljava/lang/String;[BIILjava/security/CodeSource;)Ljava/lang/Class; (SecureClassLoader.java:70)
 14: java/net/URLClassLoader.findClassImpl([Ljava/net/URL;Ljava/lang/String;)Ljava/lang/Class; (URLClassLoader.java:1214)
 15: java/net/URLClassLoader$4.run()Ljava/lang/Class; (URLClassLoader.java:-1)
 16: java/net/URLClassLoader$4.run()Ljava/lang/Object; (URLClassLoader.java:1)
 17: java/security/AccessController.doPrivilegedImpl(Ljava/security/PrivilegedAction;Ljava/security/AccessControlContext;)Ljava/lang/Object; (AccessController.java:-1)
 18: java/security/AccessController.doPrivileged(Ljava/security/PrivilegedAction;Ljava/security/AccessControlContext;)Ljava/lang/Object; (AccessController.java:64)
 19: java/net/URLClassLoader.findClass(Ljava/lang/String;)Ljava/lang/Class; (URLClassLoader.java:622)
 20: java/lang/ClassLoader.loadClass(Ljava/lang/String;Z)Ljava/lang/Class; (ClassLoader.java:-1)
 21: java/lang/ClassLoader$SystemClassLoader.loadClass(Ljava/lang/String;Z)Ljava/lang/Class; (ClassLoader.java:962)
 22: java/lang/ClassLoader.loadClass(Ljava/lang/String;)Ljava/lang/Class; (ClassLoader.java:-1)
 23: vm_invoke_native_array_stub (/export/cruise/trunk/cc/projects/drlvm/trunk/vm/vmcore/src/util/ia32/base/invoke_native_stub_ia32.asm:41)
 24: JIT_execute_method_default(void*, _jmethodID*, jvalue*, jvalue*) (/export/cruise/trunk/cc/projects/drlvm/trunk/vm/vmcore/src/util/ia32/base/ini_iA32.cpp:206)
 25: DrlEMImpl::executeMethod(_jmethodID*, jvalue*, jvalue*) (/export/cruise/trunk/cc/projects/drlvm/trunk/vm/em/src/DrlEMImpl.cpp:509)
 26: ExecuteMethod (/export/cruise/trunk/cc/projects/drlvm/trunk/vm/em/src/em_intf.cpp:43)
 27: vm_execute_java_method_array(_jmethodID*, jvalue*, jvalue*) (/export/cruise/trunk/cc/projects/drlvm/trunk/vm/vmcore/src/jit/ini.cpp:60)
 28: UserDefinedClassLoader::DoLoadClass(Global_Env*, String const*) (/export/cruise/trunk/cc/projects/drlvm/trunk/vm/vmcore/src/class_support/classloader.cpp:1534)
 29: ClassLoader::LoadClass(Global_Env*, String const*) (/export/cruise/trunk/cc/projects/drlvm/trunk/vm/vmcore/src/class_support/classloader.cpp:1400)
 30: ClassLoader::LoadVerifyAndPrepareClass(Global_Env*, String const*) (/export/cruise/trunk/cc/projects/drlvm/trunk/vm/vmcore/src/class_support/classloader.cpp:367)
 31: class_load_verify_prepare_by_loader_jni(Global_Env*, String const*, ClassLoader*) (/export/cruise/trunk/cc/projects/drlvm/trunk/vm/vmcore/src/class_support/Class_File_Loader.cpp:3644)
 32: FindClass(JNIEnv_External*, String*) (/export/cruise/trunk/cc/projects/drlvm/trunk/vm/vmcore/src/jni/jni_utils.cpp:688)
 33: FindClass(JNIEnv_External*, char const*) (/export/cruise/trunk/cc/projects/drlvm/trunk/vm/vmcore/src/jni/jni.cpp:638)
 34: main_runJavaMain (../shared/main.c:1230)
 35: invocation (../shared/main.c:732)
 36: gpProtectedMain (../shared/main.c:381)
 37: main (../shared/cmain.c:146)
 38: __libc_start_main (??:-1)
 39: _start (../sysdeps/i386/elf/start.S:105)
<end of stack trace>
  ***************************
  *** Kernel tests status ***
  ***************************
      interpreter FAILED
      Client mode JIT (default) FAILED
      jitrino.JET FAILED
      jitrino.OPT FAILED
      Server mode JIT FAILED
Please find detailed results under /export/cruise/trunk/cc/projects/drlvm/trunk/build/lnx_ia32_gcc_debug/semis/kernel.tests/reports directory.

***********************************************************
Unit Tests: (373)
        
error: test Hi_int
error: test Hi_jet
error: test Hi_jit
error: test Hi_opt
error: test Hi_srv
error: test StackTest_int
error: test StackTest_jet
error: test StackTest_jit
error: test StackTest_opt
error: test classloader.ClassTestGetDeclaringClass_int
error: test classloader.ClassTestGetDeclaringClass_jet
error: test classloader.ClassTestGetDeclaringClass_jit
error: test classloader.ClassTestGetDeclaringClass_opt
error: test classloader.ClassTestGetDeclaringClass_srv
error: test classloader.ExceptionInInitializerTest_int
error: test classloader.ExceptionInInitializerTest_jet
error: test classloader.ExceptionInInitializerTest_jit
error: test classloader.ExceptionInInitializerTest_opt
error: test classloader.ExceptionInInitializerTest_srv
error: test classloader.LogLoader_int
error: test classloader.LogLoader_jet
error: test classloader.LogLoader_jit
error: test classloader.LogLoader_opt
error: test classloader.LogLoader_srv
error: test classloader.NotFound_int
error: test classloader.NotFound_jet
error: test classloader.NotFound_jit
error: test classloader.NotFound_opt
error: test classloader.NotFound_srv
error: test classloader.StressLoader_int
error: test classloader.StressLoader_jet
error: test classloader.StressLoader_jit
error: test classloader.StressLoader_opt
error: test classloader.StressLoader_srv
error: test exception.ExceptionStackTest_int
error: test exception.ExceptionStackTest_jet
error: test exception.ExceptionStackTest_jit
error: test exception.ExceptionStackTest_opt
error: test exception.ExceptionStackTest_srv
error: test exception.FinalizeStackTest_int
error: test exception.FinalizeStackTest_jet
error: test exception.FinalizeStackTest_jit
error: test exception.FinalizeStackTest_opt
error: test exception.FinalizeStackTest_srv
error: test exception.NPE_int
error: test exception.NPE_jet
error: test exception.NPE_jit
error: test exception.NPE_opt
error: test exception.NPE_srv
error: test gc.FinAlloc_int
error: test gc.FinAlloc_jet
error: test gc.FinAlloc_jit
error: test gc.FinAlloc_opt
error: test gc.FinAlloc_srv
error: test gc.Finalizer_int
error: test gc.Finalizer_jet
error: test gc.Finalizer_jit
error: test gc.Finalizer_srv
error: test gc.Force_int
error: test gc.Force_jet
error: test gc.Force_jit
error: test gc.Force_opt
error: test gc.Force_srv
error: test gc.Fragment_int
error: test gc.Fragment_jet
error: test gc.Fragment_jit
error: test gc.Fragment_opt
error: test gc.Fragment_srv
error: test gc.Free_int
error: test gc.Free_jet
error: test gc.Free_jit
error: test gc.Free_opt
error: test gc.Free_srv
error: test gc.LOS_int
error: test gc.LOS_jet
error: test gc.LOS_jit
error: test gc.LOS_opt
error: test gc.LOS_srv
error: test gc.List_int
error: test gc.List_jet
error: test gc.List_jit
error: test gc.List_opt
error: test gc.List_srv
error: test gc.Mark_jet
error: test gc.Mark_jit
error: test gc.Mark_opt
error: test gc.Mark_srv
error: test gc.MultiThreads_int
error: test gc.MultiThreads_jet
error: test gc.MultiThreads_jit
error: test gc.MultiThreads_opt
error: test gc.MultiThreads_srv
error: test gc.NPE_int
error: test gc.PhantomReferenceQueueTest_int
error: test gc.PhantomReferenceQueueTest_jet
error: test gc.PhantomReferenceQueueTest_jit
error: test gc.PhantomReferenceQueueTest_opt
error: test gc.PhantomReferenceQueueTest_srv
error: test gc.PhantomReferenceTest_int
error: test gc.PhantomReferenceTest_jet
error: test gc.PhantomReferenceTest_jit
error: test gc.PhantomReferenceTest_opt
error: test gc.PhantomReferenceTest_srv
error: test gc.RefRemove_int
error: test gc.RefRemove_jet
error: test gc.RefRemove_jit
error: test gc.RefRemove_opt
error: test gc.RefRemove_srv
error: test gc.RunFinalizersOnExitTest_int
error: test gc.RunFinalizersOnExitTest_jet
error: test gc.RunFinalizersOnExitTest_jit
error: test gc.RunFinalizersOnExitTest_srv
error: test gc.StressRef_int
error: test gc.StressRef_jet
error: test gc.StressRef_jit
error: test gc.StressRef_opt
error: test gc.StressRef_srv
error: test gc.SynchronizedFinalizersTest_int
error: test gc.SynchronizedFinalizersTest_opt
error: test gc.SynchronizedFinalizersTest_srv
error: test gc.ThreadSuspension_int
error: test gc.ThreadSuspension_jet
error: test gc.ThreadSuspension_jit
error: test gc.ThreadSuspension_opt
error: test gc.ThreadSuspension_srv
error: test gc.WeakReferenceTest_int
error: test gc.WeakReferenceTest_jet
error: test gc.WeakReferenceTest_jit
error: test gc.WeakReferenceTest_opt
error: test gc.WeakReferenceTest_srv
error: test init.ErrorInInitializer_int
error: test init.ErrorInInitializer_jet
error: test init.ErrorInInitializer_jit
error: test init.ErrorInInitializer_opt
error: test init.ErrorInInitializer_srv
error: test init.Other_int
error: test init.Other_jet
error: test init.Other_jit
error: test init.Other_opt
error: test init.Other_srv
error: test io.ArrayList_int
error: test io.ArrayList_jet
error: test io.ArrayList_jit
error: test io.ArrayList_opt
error: test io.ArrayList_srv
error: test io.Integers_jet
error: test io.Integers_jit
error: test io.Integers_opt
error: test io.Integers_srv
error: test jni.LoadLibrary_int
error: test jni.LoadLibrary_jet
error: test jni.LoadLibrary_jit
error: test jni.LoadLibrary_opt
error: test jni.LoadLibrary_srv
error: test outofmemory.Double_int
error: test outofmemory.Double_jet
error: test outofmemory.Double_jit
error: test outofmemory.Double_opt
error: test outofmemory.Double_srv
error: test outofmemory.Int_int
error: test outofmemory.Int_jet
error: test outofmemory.Int_jit
error: test outofmemory.Int_opt
error: test outofmemory.Int_srv
error: test outofmemory.Plain_int
error: test outofmemory.Plain_jet
error: test outofmemory.Plain_jit
error: test outofmemory.Plain_opt
error: test outofmemory.Plain_srv
error: test outofmemory.Ref_int
error: test outofmemory.Ref_jet
error: test outofmemory.Ref_jit
error: test outofmemory.Ref_opt
error: test outofmemory.Ref_srv
error: test outofmemory.Throw_int
error: test outofmemory.Throw_jet
error: test outofmemory.Throw_jit
error: test outofmemory.Throw_opt
error: test outofmemory.Throw_srv
error: test outofmemory.VectorDouble_int
error: test outofmemory.VectorDouble_jet
error: test outofmemory.VectorDouble_jit
error: test outofmemory.VectorDouble_opt
error: test outofmemory.VectorDouble_srv
error: test outofmemory.VectorInt_int
error: test outofmemory.VectorInt_jet
error: test outofmemory.VectorInt_jit
error: test outofmemory.VectorInt_opt
error: test outofmemory.VectorInt_srv
error: test outofmemory.VectorRef_int
error: test outofmemory.VectorRef_jet
error: test outofmemory.VectorRef_jit
error: test outofmemory.VectorRef_opt
error: test outofmemory.VectorRef_srv
error: test outofmemory.Vector_int
error: test outofmemory.Vector_jet
error: test outofmemory.Vector_jit
error: test outofmemory.Vector_opt
error: test outofmemory.Vector_srv
error: test perf.CreateManyExceptions_depth_int
error: test perf.CreateManyExceptions_depth_jet
error: test perf.CreateManyExceptions_depth_jit
error: test perf.CreateManyExceptions_depth_opt
error: test perf.CreateManyExceptions_depth_srv
error: test perf.CreateManyExceptions_int
error: test perf.CreateManyExceptions_jet
error: test perf.CreateManyExceptions_jit
error: test perf.CreateManyExceptions_opt
error: test perf.CreateManyExceptions_srv
error: test perf.MultiThreadsSimple_int
error: test perf.MultiThreadsSimple_jet
error: test perf.MultiThreadsSimple_jit
error: test perf.MultiThreadsSimple_opt
error: test perf.MultiThreadsSimple_srv
error: test perf.SeveralThreads_int
error: test perf.SeveralThreads_jet
error: test perf.SeveralThreads_jit
error: test perf.SeveralThreads_opt
error: test perf.SeveralThreads_srv
error: test perf.StressCornerSize_a_int
error: test perf.StressCornerSize_a_jet
error: test perf.StressCornerSize_a_jit
error: test perf.StressCornerSize_a_opt
error: test perf.StressCornerSize_a_srv
error: test perf.StressCornerSize_int
error: test perf.StressCornerSize_jet
error: test perf.StressCornerSize_jit
error: test perf.StressCornerSize_opt
error: test perf.StressCornerSize_srv
error: test perf.ThrowManyExceptions_depth_int
error: test perf.ThrowManyExceptions_depth_jet
error: test perf.ThrowManyExceptions_depth_jit
error: test perf.ThrowManyExceptions_depth_opt
error: test perf.ThrowManyExceptions_depth_srv
error: test perf.ThrowManyExceptions_int
error: test perf.ThrowManyExceptions_jet
error: test perf.ThrowManyExceptions_jit
error: test perf.ThrowManyExceptions_opt
error: test perf.ThrowManyExceptions_srv
error: test perf.ThrowMany_depth_int
error: test perf.ThrowMany_depth_jet
error: test perf.ThrowMany_depth_jit
error: test perf.ThrowMany_depth_opt
error: test perf.ThrowMany_depth_srv
error: test perf.ThrowMany_int
error: test perf.ThrowMany_jet
error: test perf.ThrowMany_jit
error: test perf.ThrowMany_opt
error: test perf.ThrowMany_srv
error: test reflect.GetMethod_int
error: test reflect.GetMethod_jet
error: test reflect.GetMethod_jit
error: test reflect.GetMethod_opt
error: test reflect.GetMethod_srv
error: test shutdown.TestDaemonOnWait_int
error: test shutdown.TestDaemonOnWait_jet
error: test shutdown.TestDaemonOnWait_jit
error: test shutdown.TestDaemonOnWait_opt
error: test shutdown.TestDaemonOnWait_srv
error: test shutdown.TestFatalError_int
error: test shutdown.TestFatalError_jet
error: test shutdown.TestFatalError_jit
error: test shutdown.TestFatalError_opt
error: test shutdown.TestFatalError_srv
error: test shutdown.TestInterrupt_int
error: test shutdown.TestInterrupt_jet
error: test shutdown.TestInterrupt_jit
error: test shutdown.TestInterrupt_opt
error: test shutdown.TestInterrupt_srv
error: test shutdown.TestLock_int
error: test shutdown.TestLock_jet
error: test shutdown.TestLock_jit
error: test shutdown.TestLock_opt
error: test shutdown.TestLock_srv
error: test stress.BigStringBuffer_int
error: test stress.BigStringBuffer_jet
error: test stress.BigStringBuffer_jit
error: test stress.BigStringBuffer_opt
error: test stress.BigStringBuffer_srv
error: test stress.Finalizer_int
error: test stress.Finalizer_jet
error: test stress.Finalizer_jit
error: test stress.Finalizer_opt
error: test stress.Finalizer_srv
error: test stress.Mix_int
error: test stress.Mix_jet
error: test stress.Mix_jit
error: test stress.Mix_opt
error: test stress.Mix_srv
error: test stress.Stack_int
error: test stress.Stack_jet
error: test stress.Stack_jit
error: test stress.Stack_opt
error: test stress.Stack_srv
error: test stress.Sync_int
error: test stress.Sync_jet
error: test stress.Sync_jit
error: test stress.Sync_opt
error: test stress.Sync_srv
error: test stress.Vector_int
error: test stress.Vector_jet
error: test stress.Vector_jit
error: test stress.Vector_opt
error: test stress.Vector_srv
error: test stress.WeakHashmapTest_int
error: test stress.WeakHashmapTest_jet
error: test stress.WeakHashmapTest_jit
error: test stress.WeakHashmapTest_opt
error: test stress.WeakHashmapTest_srv
error: test thread.ExitShutdownHook_int
error: test thread.ExitShutdownHook_jet
error: test thread.ExitShutdownHook_jit
error: test thread.ExitShutdownHook_opt
error: test thread.ExitShutdownHook_srv
error: test thread.InfiniteFinalizer_int
error: test thread.InfiniteFinalizer_jet
error: test thread.InfiniteFinalizer_jit
error: test thread.InfiniteFinalizer_opt
error: test thread.InfiniteFinalizer_srv
error: test thread.Sleep_int
error: test thread.Sleep_jet
error: test thread.Sleep_jit
error: test thread.Sleep_opt
error: test thread.Sleep_srv
error: test thread.ThreadInterrupt_int
error: test thread.ThreadInterrupt_jet
error: test thread.ThreadInterrupt_jit
error: test thread.ThreadInterrupt_opt
error: test thread.ThreadInterrupt_srv
error: test thread.ThreadOOM_int
error: test thread.ThreadOOM_jet
error: test thread.ThreadOOM_jit
error: test thread.ThreadOOM_opt
error: test thread.ThreadOOM_srv
error: test util.Date_int
error: test util.Date_jet
error: test util.Date_jit
error: test util.Date_opt
error: test util.Date_srv
error: test util.DoPriveleged_int
error: test util.DoPriveleged_jet
error: test util.DoPriveleged_jit
error: test util.DoPriveleged_opt
error: test util.DoPriveleged_srv
error: test util.Prop_int
error: test util.Prop_jet
error: test util.Prop_jit
error: test util.Prop_opt
error: test util.Prop_srv
error: test util.StringIntern_int
error: test util.StringIntern_jet
error: test util.StringIntern_jit
error: test util.StringIntern_opt
error: test util.StringIntern_srv
Unit Test Error Details:	(354)
                
Test: testClass: Hi_int
Test: testClass: Hi_jet
Test: testClass: Hi_jit
Test: testClass: Hi_opt
Test: testClass: Hi_srv
Test: testClass: StackTest_int
Test: testClass: StackTest_jet
Test: testClass: StackTest_jit
Test: testClass: StackTest_opt
Test: testClass: classloader.ClassTestGetDeclaringClass_int
Test: testClass: classloader.ClassTestGetDeclaringClass_jet
Test: testClass: classloader.ClassTestGetDeclaringClass_jit
Test: testClass: classloader.ClassTestGetDeclaringClass_opt
Test: testClass: classloader.ClassTestGetDeclaringClass_srv
Test: testClass: classloader.ExceptionInInitializerTest_int
Test: testClass: classloader.ExceptionInInitializerTest_jet
Test: testClass: classloader.ExceptionInInitializerTest_jit
Test: testClass: classloader.ExceptionInInitializerTest_opt
Test: testClass: classloader.ExceptionInInitializerTest_srv
Test: testClass: classloader.LogLoader_int
Test: testClass: classloader.LogLoader_jet
Test: testClass: classloader.LogLoader_jit
Test: testClass: classloader.LogLoader_opt
Test: testClass: classloader.LogLoader_srv
Test: testClass: classloader.NotFound_int
Test: testClass: classloader.NotFound_jet
Test: testClass: classloader.NotFound_jit
Test: testClass: classloader.NotFound_opt
Test: testClass: classloader.NotFound_srv
Test: testClass: classloader.StressLoader_int
Test: testClass: classloader.StressLoader_jet
Test: testClass: classloader.StressLoader_jit
Test: testClass: classloader.StressLoader_opt
Test: testClass: classloader.StressLoader_srv
Test: testClass: exception.ExceptionStackTest_int
Test: testClass: exception.ExceptionStackTest_jet
Test: testClass: exception.ExceptionStackTest_jit
Test: testClass: exception.ExceptionStackTest_opt
Test: testClass: exception.ExceptionStackTest_srv
Test: testClass: exception.FinalizeStackTest_int
Test: testClass: exception.FinalizeStackTest_jet
Test: testClass: exception.FinalizeStackTest_jit
Test: testClass: exception.FinalizeStackTest_opt
Test: testClass: exception.FinalizeStackTest_srv
Test: testClass: exception.NPE_int
Test: testClass: exception.NPE_jet
Test: testClass: exception.NPE_jit
Test: testClass: exception.NPE_opt
Test: testClass: exception.NPE_srv
Test: testClass: gc.FinAlloc_int
Test: testClass: gc.FinAlloc_jet
Test: testClass: gc.FinAlloc_jit
Test: testClass: gc.FinAlloc_opt
Test: testClass: gc.FinAlloc_srv
Test: testClass: gc.Finalizer_int
Test: testClass: gc.Finalizer_jet
Test: testClass: gc.Finalizer_jit
Test: testClass: gc.Finalizer_srv
Test: testClass: gc.Force_int
Test: testClass: gc.Force_jet
Test: testClass: gc.Force_jit
Test: testClass: gc.Force_opt
Test: testClass: gc.Force_srv
Test: testClass: gc.Fragment_int
Test: testClass: gc.Fragment_jet
Test: testClass: gc.Fragment_jit
Test: testClass: gc.Fragment_opt
Test: testClass: gc.Fragment_srv
Test: testClass: gc.Free_int
Test: testClass: gc.Free_jet
Test: testClass: gc.Free_jit
Test: testClass: gc.Free_opt
Test: testClass: gc.Free_srv
Test: testClass: gc.LOS_int
Test: testClass: gc.LOS_jet
Test: testClass: gc.LOS_jit
Test: testClass: gc.LOS_opt
Test: testClass: gc.LOS_srv
Test: testClass: gc.List_int
Test: testClass: gc.List_jet
Test: testClass: gc.List_jit
Test: testClass: gc.List_opt
Test: testClass: gc.List_srv
Test: testClass: gc.Mark_jet
Test: testClass: gc.Mark_jit
Test: testClass: gc.Mark_opt
Test: testClass: gc.Mark_srv
Test: testClass: gc.MultiThreads_int
Test: testClass: gc.MultiThreads_jet
Test: testClass: gc.MultiThreads_jit
Test: testClass: gc.MultiThreads_opt
Test: testClass: gc.MultiThreads_srv
Test: testClass: gc.NPE_int
Test: testClass: gc.PhantomReferenceQueueTest_int
Test: testClass: gc.PhantomReferenceQueueTest_jet
Test: testClass: gc.PhantomReferenceQueueTest_jit
Test: testClass: gc.PhantomReferenceQueueTest_opt
Test: testClass: gc.PhantomReferenceQueueTest_srv
Test: testClass: gc.PhantomReferenceTest_int
Test: testClass: gc.PhantomReferenceTest_jet
Test: testClass: gc.PhantomReferenceTest_jit
Test: testClass: gc.PhantomReferenceTest_opt
Test: testClass: gc.PhantomReferenceTest_srv
Test: testClass: gc.RefRemove_int
Test: testClass: gc.RefRemove_jet
Test: testClass: gc.RefRemove_jit
Test: testClass: gc.RefRemove_opt
Test: testClass: gc.RefRemove_srv
Test: testClass: gc.RunFinalizersOnExitTest_int
Test: testClass: gc.RunFinalizersOnExitTest_jet
Test: testClass: gc.RunFinalizersOnExitTest_jit
Test: testClass: gc.RunFinalizersOnExitTest_srv
Test: testClass: gc.StressRef_int
Test: testClass: gc.StressRef_jet
Test: testClass: gc.StressRef_jit
Test: testClass: gc.StressRef_opt
Test: testClass: gc.StressRef_srv
Test: testClass: gc.SynchronizedFinalizersTest_int
Test: testClass: gc.SynchronizedFinalizersTest_opt
Test: testClass: gc.SynchronizedFinalizersTest_srv
Test: testClass: gc.ThreadSuspension_int
Test: testClass: gc.ThreadSuspension_jet
Test: testClass: gc.ThreadSuspension_jit
Test: testClass: gc.ThreadSuspension_opt
Test: testClass: gc.ThreadSuspension_srv
Test: testClass: gc.WeakReferenceTest_int
Test: testClass: gc.WeakReferenceTest_jet
Test: testClass: gc.WeakReferenceTest_jit
Test: testClass: gc.WeakReferenceTest_opt
Test: testClass: gc.WeakReferenceTest_srv
Test: testClass: init.ErrorInInitializer_int
Test: testClass: init.ErrorInInitializer_jet
Test: testClass: init.ErrorInInitializer_jit
Test: testClass: init.ErrorInInitializer_opt
Test: testClass: init.ErrorInInitializer_srv
Test: testClass: init.Other_int
Test: testClass: init.Other_jet
Test: testClass: init.Other_jit
Test: testClass: init.Other_opt
Test: testClass: init.Other_srv
Test: testClass: io.ArrayList_int
Test: testClass: io.ArrayList_jet
Test: testClass: io.ArrayList_jit
Test: testClass: io.ArrayList_opt
Test: testClass: io.ArrayList_srv
Test: testClass: io.Integers_jet
Test: testClass: io.Integers_jit
Test: testClass: io.Integers_opt
Test: testClass: io.Integers_srv
Test: testClass: jni.LoadLibrary_int
Test: testClass: jni.LoadLibrary_jet
Test: testClass: jni.LoadLibrary_jit
Test: testClass: jni.LoadLibrary_opt
Test: testClass: jni.LoadLibrary_srv
Test: testClass: outofmemory.Double_int
Test: testClass: outofmemory.Double_jet
Test: testClass: outofmemory.Double_jit
Test: testClass: outofmemory.Double_opt
Test: testClass: outofmemory.Double_srv
Test: testClass: outofmemory.Int_int
Test: testClass: outofmemory.Int_jet
Test: testClass: outofmemory.Int_jit
Test: testClass: outofmemory.Int_opt
Test: testClass: outofmemory.Int_srv
Test: testClass: outofmemory.Plain_int
Test: testClass: outofmemory.Plain_jet
Test: testClass: outofmemory.Plain_jit
Test: testClass: outofmemory.Plain_opt
Test: testClass: outofmemory.Plain_srv
Test: testClass: outofmemory.Ref_int
Test: testClass: outofmemory.Ref_jet
Test: testClass: outofmemory.Ref_jit
Test: testClass: outofmemory.Ref_opt
Test: testClass: outofmemory.Ref_srv
Test: testClass: outofmemory.Throw_int
Test: testClass: outofmemory.Throw_jet
Test: testClass: outofmemory.Throw_jit
Test: testClass: outofmemory.Throw_opt
Test: testClass: outofmemory.Throw_srv
Test: testClass: outofmemory.VectorDouble_int
Test: testClass: outofmemory.VectorDouble_jet
Test: testClass: outofmemory.VectorDouble_jit
Test: testClass: outofmemory.VectorDouble_opt
Test: testClass: outofmemory.VectorDouble_srv
Test: testClass: outofmemory.VectorInt_int
Test: testClass: outofmemory.VectorInt_jet
Test: testClass: outofmemory.VectorInt_jit
Test: testClass: outofmemory.VectorInt_opt
Test: testClass: outofmemory.VectorInt_srv
Test: testClass: outofmemory.VectorRef_int
Test: testClass: outofmemory.VectorRef_jet
Test: testClass: outofmemory.VectorRef_jit
Test: testClass: outofmemory.VectorRef_opt
Test: testClass: outofmemory.VectorRef_srv
Test: testClass: outofmemory.Vector_int
Test: testClass: outofmemory.Vector_jet
Test: testClass: outofmemory.Vector_jit
Test: testClass: outofmemory.Vector_opt
Test: testClass: outofmemory.Vector_srv
Test: testClass: perf.CreateManyExceptions_depth_int
Test: testClass: perf.CreateManyExceptions_depth_jet
Test: testClass: perf.CreateManyExceptions_depth_jit
Test: testClass: perf.CreateManyExceptions_depth_opt
Test: testClass: perf.CreateManyExceptions_depth_srv
Test: testClass: perf.CreateManyExceptions_int
Test: testClass: perf.CreateManyExceptions_jet
Test: testClass: perf.CreateManyExceptions_jit
Test: testClass: perf.CreateManyExceptions_opt
Test: testClass: perf.CreateManyExceptions_srv
Test: testClass: perf.MultiThreadsSimple_int
Test: testClass: perf.MultiThreadsSimple_jet
Test: testClass: perf.MultiThreadsSimple_jit
Test: testClass: perf.MultiThreadsSimple_opt
Test: testClass: perf.MultiThreadsSimple_srv
Test: testClass: perf.SeveralThreads_int
Test: testClass: perf.SeveralThreads_jet
Test: testClass: perf.SeveralThreads_jit
Test: testClass: perf.SeveralThreads_opt
Test: testClass: perf.SeveralThreads_srv
Test: testClass: perf.StressCornerSize_a_int
Test: testClass: perf.StressCornerSize_a_jet
Test: testClass: perf.StressCornerSize_a_jit
Test: testClass: perf.StressCornerSize_a_opt
Test: testClass: perf.StressCornerSize_a_srv
Test: testClass: perf.StressCornerSize_int
Test: testClass: perf.StressCornerSize_jet
Test: testClass: perf.StressCornerSize_jit
Test: testClass: perf.StressCornerSize_opt
Test: testClass: perf.StressCornerSize_srv
Test: testClass: perf.ThrowManyExceptions_depth_int
Test: testClass: perf.ThrowManyExceptions_depth_jet
Test: testClass: perf.ThrowManyExceptions_depth_jit
Test: testClass: perf.ThrowManyExceptions_depth_opt
Test: testClass: perf.ThrowManyExceptions_depth_srv
Test: testClass: perf.ThrowManyExceptions_int
Test: testClass: perf.ThrowManyExceptions_jet
Test: testClass: perf.ThrowManyExceptions_jit
Test: testClass: perf.ThrowManyExceptions_opt
Test: testClass: perf.ThrowManyExceptions_srv
Test: testClass: perf.ThrowMany_depth_int
Test: testClass: perf.ThrowMany_depth_jet
Test: testClass: perf.ThrowMany_depth_jit
Test: testClass: perf.ThrowMany_depth_opt
Test: testClass: perf.ThrowMany_depth_srv
Test: testClass: perf.ThrowMany_int
Test: testClass: perf.ThrowMany_jet
Test: testClass: perf.ThrowMany_jit
Test: testClass: perf.ThrowMany_opt
Test: testClass: perf.ThrowMany_srv
Test: testClass: reflect.GetMethod_int
Test: testClass: reflect.GetMethod_jet
Test: testClass: reflect.GetMethod_jit
Test: testClass: reflect.GetMethod_opt
Test: testClass: reflect.GetMethod_srv
Test: testClass: shutdown.TestDaemonOnWait_int
Test: testClass: shutdown.TestDaemonOnWait_jet
Test: testClass: shutdown.TestDaemonOnWait_jit
Test: testClass: shutdown.TestDaemonOnWait_opt
Test: testClass: shutdown.TestDaemonOnWait_srv
Test: testClass: shutdown.TestFatalError_int
Test: testClass: shutdown.TestFatalError_jet
Test: testClass: shutdown.TestFatalError_jit
Test: testClass: shutdown.TestFatalError_opt
Test: testClass: shutdown.TestFatalError_srv
Test: testClass: shutdown.TestInterrupt_int
Test: testClass: shutdown.TestInterrupt_jet
Test: testClass: shutdown.TestInterrupt_jit
Test: testClass: shutdown.TestInterrupt_opt
Test: testClass: shutdown.TestInterrupt_srv
Test: testClass: shutdown.TestLock_int
Test: testClass: shutdown.TestLock_jet
Test: testClass: shutdown.TestLock_jit
Test: testClass: shutdown.TestLock_opt
Test: testClass: shutdown.TestLock_srv
Test: testClass: stress.BigStringBuffer_int
Test: testClass: stress.BigStringBuffer_jet
Test: testClass: stress.BigStringBuffer_jit
Test: testClass: stress.BigStringBuffer_opt
Test: testClass: stress.BigStringBuffer_srv
Test: testClass: stress.Finalizer_int
Test: testClass: stress.Finalizer_jet
Test: testClass: stress.Finalizer_jit
Test: testClass: stress.Finalizer_opt
Test: testClass: stress.Finalizer_srv
Test: testClass: stress.Mix_int
Test: testClass: stress.Mix_jet
Test: testClass: stress.Mix_jit
Test: testClass: stress.Mix_opt
Test: testClass: stress.Mix_srv
Test: testClass: stress.Stack_int
Test: testClass: stress.Stack_jet
Test: testClass: stress.Stack_jit
Test: testClass: stress.Stack_opt
Test: testClass: stress.Stack_srv
Test: testClass: stress.Sync_int
Test: testClass: stress.Sync_jet
Test: testClass: stress.Sync_jit
Test: testClass: stress.Sync_opt
Test: testClass: stress.Sync_srv
Test: testClass: stress.Vector_int
Test: testClass: stress.Vector_jet
Test: testClass: stress.Vector_jit
Test: testClass: stress.Vector_opt
Test: testClass: stress.Vector_srv
Test: testClass: stress.WeakHashmapTest_int
Test: testClass: stress.WeakHashmapTest_jet
Test: testClass: stress.WeakHashmapTest_jit
Test: testClass: stress.WeakHashmapTest_opt
Test: testClass: stress.WeakHashmapTest_srv
Test: testClass: thread.ExitShutdownHook_int
Test: testClass: thread.ExitShutdownHook_jet
Test: testClass: thread.ExitShutdownHook_jit
Test: testClass: thread.ExitShutdownHook_opt
Test: testClass: thread.ExitShutdownHook_srv
Test: testClass: thread.InfiniteFinalizer_int
Test: testClass: thread.InfiniteFinalizer_jet
Test: testClass: thread.InfiniteFinalizer_jit
Test: testClass: thread.InfiniteFinalizer_opt
Test: testClass: thread.InfiniteFinalizer_srv
Test: testClass: thread.Sleep_int
Test: testClass: thread.Sleep_jet
Test: testClass: thread.Sleep_jit
Test: testClass: thread.Sleep_opt
Test: testClass: thread.Sleep_srv
Test: testClass: thread.ThreadInterrupt_int
Test: testClass: thread.ThreadInterrupt_jet
Test: testClass: thread.ThreadInterrupt_jit
Test: testClass: thread.ThreadInterrupt_opt
Test: testClass: thread.ThreadInterrupt_srv
Test: testClass: thread.ThreadOOM_int
Test: testClass: thread.ThreadOOM_jet
Test: testClass: thread.ThreadOOM_jit
Test: testClass: thread.ThreadOOM_opt
Test: testClass: thread.ThreadOOM_srv
Test: testClass: util.Date_int
Test: testClass: util.Date_jet
Test: testClass: util.Date_jit
Test: testClass: util.Date_opt
Test: testClass: util.Date_srv
Test: testClass: util.DoPriveleged_int
Test: testClass: util.DoPriveleged_jet
Test: testClass: util.DoPriveleged_jit
Test: testClass: util.DoPriveleged_opt
Test: testClass: util.DoPriveleged_srv
Test: testClass: util.Prop_int
Test: testClass: util.Prop_jet
Test: testClass: util.Prop_jit
Test: testClass: util.Prop_opt
Test: testClass: util.Prop_srv
Test: testClass: util.StringIntern_int
Test: testClass: util.StringIntern_jet
Test: testClass: util.StringIntern_jit
Test: testClass: util.StringIntern_opt
Test: testClass: util.StringIntern_srv

***********************************************************
Modifications since last successful build:	(6)
            
modified gshimansky  /harmony/enhanced/drlvm/trunk/vm/jitrino/src/optimizer/IRBuilder.cpp 05/23/2007 21:31:24 Fixed compilation on gcc 4.1.1 after HARMONY-3874 was committed. The redundant initialization of helperArgs causes compiler to report a warning
modified ayza  /harmony/enhanced/classlib/trunk/modules/awt/src/main/java/common/org/apache/harmony/awt/gl/image/ImageLoader.java 05/23/2007 20:24:33 Removing obsolete call to Thread.interrupt(). This is an additional fix for HARMONY-3602.
modified varlax  /harmony/enhanced/drlvm/trunk/vm/vmcore/src/gc/root_set_enum_common.cpp 05/23/2007 19:54:51 Postfix to HARMONY-3462, corrected spotted issues.
modified varlax  /harmony/enhanced/drlvm/trunk/vm/vmcore/src/kernel_classes/javasrc/java/lang/ClassLoader.java 05/23/2007 19:54:51 Postfix to HARMONY-3462, corrected spotted issues.
modified varlax  /harmony/enhanced/drlvm/trunk/vm/vmcore/src/kernel_classes/javasrc/java/lang/Class.java 05/23/2007 19:54:51 Postfix to HARMONY-3462, corrected spotted issues.
modified varlax  /harmony/enhanced/drlvm/trunk/vm/vmcore/src/class_support/classloader.cpp 05/23/2007 19:54:51 Postfix to HARMONY-3462, corrected spotted issues.

Mime
View raw message