harmony-alerts mailing list archives

Site index · List index
Message view « Date » · « Thread »
Top « Date » · « Thread »
From nbe...@kc.rr.com
Subject [build-test alert] BUILD FAILED Windows XP x86: drlvm-test
Date Sat, 19 May 2007 00:14:06 GMT
BUILD FAILED:
	Ant Error Message:
C:\harmony\buildtest2\scripts\cc-exec-adaptor.xml:34: The following error occurred while executing this line: C:\harmony\buildtest2\adaptors\drlvm-test\adaptor.xml:75: There were drlvm-test failures

Date of build:	05/18/2007 15:49:57
Time to build:	202 minutes 51 seconds
Last changed:	05/18/2007 15:30:36
Last log entry:	drlvm

***********************************************************
Errors/Warnings:	(25)
            
[java] Java Result: 1
[java] Java Result: 1
[java] Java Result: 130
[java] Java Result: 1
[java] Java Result: 1
[java] Java Result: 130
[java] Java Result: 1
[java] Java Result: 1
[java] Java Result: 130
[java] Java Result: 1
[java] Java Result: 130
[java] Java Result: 1
[java] Java Result: 1
[java] Java Result: 130
[junit] Tests FAILED
[junit] Tests FAILED
[junit] Tests FAILED
[junit] Tests FAILED
[junit] Tests FAILED
BUILD FAILED
C:\harmony\buildtest2\build\checkouts\drlvm\build\make\build.xml:400: The following error occurred while executing this line:
C:\harmony\buildtest2\build\checkouts\drlvm\build\make\build_component.xml:72: The following error occurred while executing this line:
C:\harmony\buildtest2\build\checkouts\drlvm\build\win_ia32_msvc_debug\semis\build\targets\test.xml:6: Some tests failed
Total time: 201 minutes 15 seconds

***********************************************************
Unit Tests: (4281)
        
error: testNoInheritance java.lang.Package5Test
error: testGetAnnotation java.lang.Package5Test
error: testGetAnnotation2 java.lang.Package5Test
error: testGetAnnotation_Negative java.lang.Package5Test
error: testGetDeclaredAnnotations java.lang.Package5Test
error: testGetDeclaredAnnotations2 java.lang.Package5Test
error: testGetDeclaredAnnotationsImmutable java.lang.Package5Test
error: testGetAnnotations java.lang.Package5Test
error: testGetAnnotations2 java.lang.Package5Test
error: testGetAnnotations4 java.lang.Package5Test
error: testGetAnnotations5 java.lang.Package5Test
error: testGetAnnotations6 java.lang.Package5Test
error: testGetAnnotationsImmutable java.lang.Package5Test
error: testIsAnnotationPresent java.lang.Package5Test
error: testIsAnnotationPresent_Negative java.lang.Package5Test
error: testPackage org.apache.harmony.lang.annotation.AnnotationLoaderTest
error: testNoInheritance java.lang.Package5Test
error: testGetAnnotation java.lang.Package5Test
error: testGetAnnotation2 java.lang.Package5Test
error: testGetAnnotation_Negative java.lang.Package5Test
error: testGetDeclaredAnnotations java.lang.Package5Test
error: testGetDeclaredAnnotations2 java.lang.Package5Test
error: testGetDeclaredAnnotationsImmutable java.lang.Package5Test
error: testGetAnnotations java.lang.Package5Test
error: testGetAnnotations2 java.lang.Package5Test
error: testGetAnnotations4 java.lang.Package5Test
error: testGetAnnotations5 java.lang.Package5Test
error: testGetAnnotations6 java.lang.Package5Test
error: testGetAnnotationsImmutable java.lang.Package5Test
error: testIsAnnotationPresent java.lang.Package5Test
error: testIsAnnotationPresent_Negative java.lang.Package5Test
error: testPackage org.apache.harmony.lang.annotation.AnnotationLoaderTest
error: testNoInheritance java.lang.Package5Test
error: testGetAnnotation java.lang.Package5Test
error: testGetAnnotation2 java.lang.Package5Test
error: testGetAnnotation_Negative java.lang.Package5Test
error: testGetDeclaredAnnotations java.lang.Package5Test
error: testGetDeclaredAnnotations2 java.lang.Package5Test
error: testGetDeclaredAnnotationsImmutable java.lang.Package5Test
error: testGetAnnotations java.lang.Package5Test
error: testGetAnnotations2 java.lang.Package5Test
error: testGetAnnotations4 java.lang.Package5Test
error: testGetAnnotations5 java.lang.Package5Test
error: testGetAnnotations6 java.lang.Package5Test
error: testGetAnnotationsImmutable java.lang.Package5Test
error: testIsAnnotationPresent java.lang.Package5Test
error: testIsAnnotationPresent_Negative java.lang.Package5Test
error: testPackage org.apache.harmony.lang.annotation.AnnotationLoaderTest
error: testNoInheritance java.lang.Package5Test
error: testGetAnnotation java.lang.Package5Test
error: testGetAnnotation2 java.lang.Package5Test
error: testGetAnnotation_Negative java.lang.Package5Test
error: testGetDeclaredAnnotations java.lang.Package5Test
error: testGetDeclaredAnnotations2 java.lang.Package5Test
error: testGetDeclaredAnnotationsImmutable java.lang.Package5Test
error: testGetAnnotations java.lang.Package5Test
error: testGetAnnotations2 java.lang.Package5Test
error: testGetAnnotations4 java.lang.Package5Test
error: testGetAnnotations5 java.lang.Package5Test
error: testGetAnnotations6 java.lang.Package5Test
error: testGetAnnotationsImmutable java.lang.Package5Test
error: testIsAnnotationPresent java.lang.Package5Test
error: testIsAnnotationPresent_Negative java.lang.Package5Test
error: testPackage org.apache.harmony.lang.annotation.AnnotationLoaderTest
error: testNoInheritance java.lang.Package5Test
error: testGetAnnotation java.lang.Package5Test
error: testGetAnnotation2 java.lang.Package5Test
error: testGetAnnotation_Negative java.lang.Package5Test
error: testGetDeclaredAnnotations java.lang.Package5Test
error: testGetDeclaredAnnotations2 java.lang.Package5Test
error: testGetDeclaredAnnotationsImmutable java.lang.Package5Test
error: testGetAnnotations java.lang.Package5Test
error: testGetAnnotations2 java.lang.Package5Test
error: testGetAnnotations4 java.lang.Package5Test
error: testGetAnnotations5 java.lang.Package5Test
error: testGetAnnotations6 java.lang.Package5Test
error: testGetAnnotationsImmutable java.lang.Package5Test
error: testIsAnnotationPresent java.lang.Package5Test
error: testIsAnnotationPresent_Negative java.lang.Package5Test
error: testPackage org.apache.harmony.lang.annotation.AnnotationLoaderTest
failure: test_exec_Str java.lang.RuntimeTest2
failure: test_exec_Str java.lang.RuntimeTest2
failure: test_exec_Str java.lang.RuntimeTest2
failure: test_exec_Str java.lang.RuntimeTest2
Unit Test Error Details:	(84)
                
Test: testNoInheritanceClass: java.lang.Package5Testjava.lang.ClassFormatError: java/lang/pkg3/package-info : if class is interface, no flags except ACC_ABSTRACT or ACC_PUBLIC can be set
	at java.lang.VMClassRegistry.loadBootstrapClass(VMClassRegistry.java)
	at java.lang.Class.forName(Class.java:151)
	at java.lang.Package.getDeclaredAnnotations(Package.java:52)
	at java.lang.Package.getAnnotations(Package.java:65)
	at java.lang.Package5Test.testNoInheritance(Package5Test.java:110)
	at java.lang.reflect.VMReflection.invokeMethod(VMReflection.java)
	at java.lang.reflect.Method.invoke(Method.java:382)
	at junit.framework.TestCase.runTest(TestCase.java:164)
	at junit.framework.TestCase.runBare(TestCase.java:130)
	at junit.framework.TestResult$1.protect(TestResult.java:106)
	at junit.framework.TestResult.runProtected(TestResult.java:124)
	at junit.framework.TestResult.run(TestResult.java:109)
	at junit.framework.TestCase.run(TestCase.java:120)
	at junit.framework.TestSuite.runTest(TestSuite.java:230)
	at junit.framework.TestSuite.run(TestSuite.java:225)
	at org.apache.tools.ant.taskdefs.optional.junit.JUnitTestRunner.run(JUnitTestRunner.java:297)
	at org.apache.tools.ant.taskdefs.optional.junit.JUnitTestRunner.launch(JUnitTestRunner.java:672)
	at org.apache.tools.ant.taskdefs.optional.junit.JUnitTestRunner.main(JUnitTestRunner.java:546)
Test: testGetAnnotationClass: java.lang.Package5Testjava.lang.ClassFormatError: java/lang/pkg1/package-info : if class is interface, no flags except ACC_ABSTRACT or ACC_PUBLIC can be set
	at java.lang.VMClassRegistry.loadBootstrapClass(VMClassRegistry.java)
	at java.lang.Class.forName(Class.java:151)
	at java.lang.Package.getDeclaredAnnotations(Package.java:52)
	at java.lang.Package.getAnnotations(Package.java:65)
	at java.lang.Package.getAnnotation(Package.java:78)
	at org.apache.harmony.lang.AnnotatedElementTestFrame.testGetAnnotation(AnnotatedElementTestFrame.java:114)
	at java.lang.reflect.VMReflection.invokeMethod(VMReflection.java)
	at java.lang.reflect.Method.invoke(Method.java:382)
	at junit.framework.TestCase.runTest(TestCase.java:164)
	at junit.framework.TestCase.runBare(TestCase.java:130)
	at junit.framework.TestResult$1.protect(TestResult.java:106)
	at junit.framework.TestResult.runProtected(TestResult.java:124)
	at junit.framework.TestResult.run(TestResult.java:109)
	at junit.framework.TestCase.run(TestCase.java:120)
	at junit.framework.TestSuite.runTest(TestSuite.java:230)
	at junit.framework.TestSuite.run(TestSuite.java:225)
	at org.apache.tools.ant.taskdefs.optional.junit.JUnitTestRunner.run(JUnitTestRunner.java:297)
	at org.apache.tools.ant.taskdefs.optional.junit.JUnitTestRunner.launch(JUnitTestRunner.java:672)
	at org.apache.tools.ant.taskdefs.optional.junit.JUnitTestRunner.main(JUnitTestRunner.java:546)
Test: testGetAnnotation2Class: java.lang.Package5Testjava.lang.ClassFormatError: java/lang/pkg2/package-info : if class is interface, no flags except ACC_ABSTRACT or ACC_PUBLIC can be set
	at java.lang.VMClassRegistry.loadBootstrapClass(VMClassRegistry.java)
	at java.lang.Class.forName(Class.java:151)
	at java.lang.Package.getDeclaredAnnotations(Package.java:52)
	at java.lang.Package.getAnnotations(Package.java:65)
	at java.lang.Package.getAnnotation(Package.java:78)
	at org.apache.harmony.lang.AnnotatedElementTestFrame.testGetAnnotation2(AnnotatedElementTestFrame.java:124)
	at java.lang.reflect.VMReflection.invokeMethod(VMReflection.java)
	at java.lang.reflect.Method.invoke(Method.java:382)
	at junit.framework.TestCase.runTest(TestCase.java:164)
	at junit.framework.TestCase.runBare(TestCase.java:130)
	at junit.framework.TestResult$1.protect(TestResult.java:106)
	at junit.framework.TestResult.runProtected(TestResult.java:124)
	at junit.framework.TestResult.run(TestResult.java:109)
	at junit.framework.TestCase.run(TestCase.java:120)
	at junit.framework.TestSuite.runTest(TestSuite.java:230)
	at junit.framework.TestSuite.run(TestSuite.java:225)
	at org.apache.tools.ant.taskdefs.optional.junit.JUnitTestRunner.run(JUnitTestRunner.java:297)
	at org.apache.tools.ant.taskdefs.optional.junit.JUnitTestRunner.launch(JUnitTestRunner.java:672)
	at org.apache.tools.ant.taskdefs.optional.junit.JUnitTestRunner.main(JUnitTestRunner.java:546)
Test: testGetAnnotation_NegativeClass: java.lang.Package5Testjava.lang.ClassFormatError: java/lang/pkg2/package-info : if class is interface, no flags except ACC_ABSTRACT or ACC_PUBLIC can be set
	at java.lang.VMClassRegistry.loadBootstrapClass(VMClassRegistry.java)
	at java.lang.Class.forName(Class.java:151)
	at java.lang.Package.getDeclaredAnnotations(Package.java:52)
	at java.lang.Package.getAnnotations(Package.java:65)
	at java.lang.Package.getAnnotation(Package.java:78)
	at org.apache.harmony.lang.AnnotatedElementTestFrame.testGetAnnotation_Negative(AnnotatedElementTestFrame.java:134)
	at java.lang.reflect.VMReflection.invokeMethod(VMReflection.java)
	at java.lang.reflect.Method.invoke(Method.java:382)
	at junit.framework.TestCase.runTest(TestCase.java:164)
	at junit.framework.TestCase.runBare(TestCase.java:130)
	at junit.framework.TestResult$1.protect(TestResult.java:106)
	at junit.framework.TestResult.runProtected(TestResult.java:124)
	at junit.framework.TestResult.run(TestResult.java:109)
	at junit.framework.TestCase.run(TestCase.java:120)
	at junit.framework.TestSuite.runTest(TestSuite.java:230)
	at junit.framework.TestSuite.run(TestSuite.java:225)
	at org.apache.tools.ant.taskdefs.optional.junit.JUnitTestRunner.run(JUnitTestRunner.java:297)
	at org.apache.tools.ant.taskdefs.optional.junit.JUnitTestRunner.launch(JUnitTestRunner.java:672)
	at org.apache.tools.ant.taskdefs.optional.junit.JUnitTestRunner.main(JUnitTestRunner.java:546)
Test: testGetDeclaredAnnotationsClass: java.lang.Package5Testjava.lang.ClassFormatError: java/lang/pkg1/package-info : if class is interface, no flags except ACC_ABSTRACT or ACC_PUBLIC can be set
	at java.lang.VMClassRegistry.loadBootstrapClass(VMClassRegistry.java)
	at java.lang.Class.forName(Class.java:151)
	at java.lang.Package.getDeclaredAnnotations(Package.java:52)
	at org.apache.harmony.lang.AnnotatedElementTestFrame.testGetDeclaredAnnotations(AnnotatedElementTestFrame.java:162)
	at java.lang.reflect.VMReflection.invokeMethod(VMReflection.java)
	at java.lang.reflect.Method.invoke(Method.java:382)
	at junit.framework.TestCase.runTest(TestCase.java:164)
	at junit.framework.TestCase.runBare(TestCase.java:130)
	at junit.framework.TestResult$1.protect(TestResult.java:106)
	at junit.framework.TestResult.runProtected(TestResult.java:124)
	at junit.framework.TestResult.run(TestResult.java:109)
	at junit.framework.TestCase.run(TestCase.java:120)
	at junit.framework.TestSuite.runTest(TestSuite.java:230)
	at junit.framework.TestSuite.run(TestSuite.java:225)
	at org.apache.tools.ant.taskdefs.optional.junit.JUnitTestRunner.run(JUnitTestRunner.java:297)
	at org.apache.tools.ant.taskdefs.optional.junit.JUnitTestRunner.launch(JUnitTestRunner.java:672)
	at org.apache.tools.ant.taskdefs.optional.junit.JUnitTestRunner.main(JUnitTestRunner.java:546)
Test: testGetDeclaredAnnotations2Class: java.lang.Package5Testjava.lang.ClassFormatError: java/lang/pkg2/package-info : if class is interface, no flags except ACC_ABSTRACT or ACC_PUBLIC can be set
	at java.lang.VMClassRegistry.loadBootstrapClass(VMClassRegistry.java)
	at java.lang.Class.forName(Class.java:151)
	at java.lang.Package.getDeclaredAnnotations(Package.java:52)
	at org.apache.harmony.lang.AnnotatedElementTestFrame.testGetDeclaredAnnotations2(AnnotatedElementTestFrame.java:173)
	at java.lang.reflect.VMReflection.invokeMethod(VMReflection.java)
	at java.lang.reflect.Method.invoke(Method.java:382)
	at junit.framework.TestCase.runTest(TestCase.java:164)
	at junit.framework.TestCase.runBare(TestCase.java:130)
	at junit.framework.TestResult$1.protect(TestResult.java:106)
	at junit.framework.TestResult.runProtected(TestResult.java:124)
	at junit.framework.TestResult.run(TestResult.java:109)
	at junit.framework.TestCase.run(TestCase.java:120)
	at junit.framework.TestSuite.runTest(TestSuite.java:230)
	at junit.framework.TestSuite.run(TestSuite.java:225)
	at org.apache.tools.ant.taskdefs.optional.junit.JUnitTestRunner.run(JUnitTestRunner.java:297)
	at org.apache.tools.ant.taskdefs.optional.junit.JUnitTestRunner.launch(JUnitTestRunner.java:672)
	at org.apache.tools.ant.taskdefs.optional.junit.JUnitTestRunner.main(JUnitTestRunner.java:546)
Test: testGetDeclaredAnnotationsImmutableClass: java.lang.Package5Testjava.lang.ClassFormatError: java/lang/pkg1/package-info : if class is interface, no flags except ACC_ABSTRACT or ACC_PUBLIC can be set
	at java.lang.VMClassRegistry.loadBootstrapClass(VMClassRegistry.java)
	at java.lang.Class.forName(Class.java:151)
	at java.lang.Package.getDeclaredAnnotations(Package.java:52)
	at org.apache.harmony.lang.AnnotatedElementTestFrame.testGetDeclaredAnnotationsImmutable(AnnotatedElementTestFrame.java:198)
	at java.lang.reflect.VMReflection.invokeMethod(VMReflection.java)
	at java.lang.reflect.Method.invoke(Method.java:382)
	at junit.framework.TestCase.runTest(TestCase.java:164)
	at junit.framework.TestCase.runBare(TestCase.java:130)
	at junit.framework.TestResult$1.protect(TestResult.java:106)
	at junit.framework.TestResult.runProtected(TestResult.java:124)
	at junit.framework.TestResult.run(TestResult.java:109)
	at junit.framework.TestCase.run(TestCase.java:120)
	at junit.framework.TestSuite.runTest(TestSuite.java:230)
	at junit.framework.TestSuite.run(TestSuite.java:225)
	at org.apache.tools.ant.taskdefs.optional.junit.JUnitTestRunner.run(JUnitTestRunner.java:297)
	at org.apache.tools.ant.taskdefs.optional.junit.JUnitTestRunner.launch(JUnitTestRunner.java:672)
	at org.apache.tools.ant.taskdefs.optional.junit.JUnitTestRunner.main(JUnitTestRunner.java:546)
Test: testGetAnnotationsClass: java.lang.Package5Testjava.lang.ClassFormatError: java/lang/pkg1/package-info : if class is interface, no flags except ACC_ABSTRACT or ACC_PUBLIC can be set
	at java.lang.VMClassRegistry.loadBootstrapClass(VMClassRegistry.java)
	at java.lang.Class.forName(Class.java:151)
	at java.lang.Package.getDeclaredAnnotations(Package.java:52)
	at java.lang.Package.getAnnotations(Package.java:65)
	at org.apache.harmony.lang.AnnotatedElementTestFrame.testGetAnnotations(AnnotatedElementTestFrame.java:215)
	at java.lang.reflect.VMReflection.invokeMethod(VMReflection.java)
	at java.lang.reflect.Method.invoke(Method.java:382)
	at junit.framework.TestCase.runTest(TestCase.java:164)
	at junit.framework.TestCase.runBare(TestCase.java:130)
	at junit.framework.TestResult$1.protect(TestResult.java:106)
	at junit.framework.TestResult.runProtected(TestResult.java:124)
	at junit.framework.TestResult.run(TestResult.java:109)
	at junit.framework.TestCase.run(TestCase.java:120)
	at junit.framework.TestSuite.runTest(TestSuite.java:230)
	at junit.framework.TestSuite.run(TestSuite.java:225)
	at org.apache.tools.ant.taskdefs.optional.junit.JUnitTestRunner.run(JUnitTestRunner.java:297)
	at org.apache.tools.ant.taskdefs.optional.junit.JUnitTestRunner.launch(JUnitTestRunner.java:672)
	at org.apache.tools.ant.taskdefs.optional.junit.JUnitTestRunner.main(JUnitTestRunner.java:546)
Test: testGetAnnotations2Class: java.lang.Package5Testjava.lang.ClassFormatError: java/lang/pkg2/package-info : if class is interface, no flags except ACC_ABSTRACT or ACC_PUBLIC can be set
	at java.lang.VMClassRegistry.loadBootstrapClass(VMClassRegistry.java)
	at java.lang.Class.forName(Class.java:151)
	at java.lang.Package.getDeclaredAnnotations(Package.java:52)
	at java.lang.Package.getAnnotations(Package.java:65)
	at org.apache.harmony.lang.AnnotatedElementTestFrame.testGetAnnotations2(AnnotatedElementTestFrame.java:226)
	at java.lang.reflect.VMReflection.invokeMethod(VMReflection.java)
	at java.lang.reflect.Method.invoke(Method.java:382)
	at junit.framework.TestCase.runTest(TestCase.java:164)
	at junit.framework.TestCase.runBare(TestCase.java:130)
	at junit.framework.TestResult$1.protect(TestResult.java:106)
	at junit.framework.TestResult.runProtected(TestResult.java:124)
	at junit.framework.TestResult.run(TestResult.java:109)
	at junit.framework.TestCase.run(TestCase.java:120)
	at junit.framework.TestSuite.runTest(TestSuite.java:230)
	at junit.framework.TestSuite.run(TestSuite.java:225)
	at org.apache.tools.ant.taskdefs.optional.junit.JUnitTestRunner.run(JUnitTestRunner.java:297)
	at org.apache.tools.ant.taskdefs.optional.junit.JUnitTestRunner.launch(JUnitTestRunner.java:672)
	at org.apache.tools.ant.taskdefs.optional.junit.JUnitTestRunner.main(JUnitTestRunner.java:546)
Test: testGetAnnotations4Class: java.lang.Package5Testjava.lang.ClassFormatError: java/lang/pkg4/package-info : if class is interface, no flags except ACC_ABSTRACT or ACC_PUBLIC can be set
	at java.lang.VMClassRegistry.loadBootstrapClass(VMClassRegistry.java)
	at java.lang.Class.forName(Class.java:151)
	at java.lang.Package.getDeclaredAnnotations(Package.java:52)
	at java.lang.Package.getAnnotations(Package.java:65)
	at org.apache.harmony.lang.AnnotatedElementTestFrame.testGetAnnotations4(AnnotatedElementTestFrame.java:251)
	at java.lang.reflect.VMReflection.invokeMethod(VMReflection.java)
	at java.lang.reflect.Method.invoke(Method.java:382)
	at junit.framework.TestCase.runTest(TestCase.java:164)
	at junit.framework.TestCase.runBare(TestCase.java:130)
	at junit.framework.TestResult$1.protect(TestResult.java:106)
	at junit.framework.TestResult.runProtected(TestResult.java:124)
	at junit.framework.TestResult.run(TestResult.java:109)
	at junit.framework.TestCase.run(TestCase.java:120)
	at junit.framework.TestSuite.runTest(TestSuite.java:230)
	at junit.framework.TestSuite.run(TestSuite.java:225)
	at org.apache.tools.ant.taskdefs.optional.junit.JUnitTestRunner.run(JUnitTestRunner.java:297)
	at org.apache.tools.ant.taskdefs.optional.junit.JUnitTestRunner.launch(JUnitTestRunner.java:672)
	at org.apache.tools.ant.taskdefs.optional.junit.JUnitTestRunner.main(JUnitTestRunner.java:546)
Test: testGetAnnotations5Class: java.lang.Package5Testjava.lang.ClassFormatError: java/lang/pkg5/package-info : if class is interface, no flags except ACC_ABSTRACT or ACC_PUBLIC can be set
	at java.lang.VMClassRegistry.loadBootstrapClass(VMClassRegistry.java)
	at java.lang.Class.forName(Class.java:151)
	at java.lang.Package.getDeclaredAnnotations(Package.java:52)
	at java.lang.Package.getAnnotations(Package.java:65)
	at org.apache.harmony.lang.AnnotatedElementTestFrame.testGetAnnotations5(AnnotatedElementTestFrame.java:264)
	at java.lang.reflect.VMReflection.invokeMethod(VMReflection.java)
	at java.lang.reflect.Method.invoke(Method.java:382)
	at junit.framework.TestCase.runTest(TestCase.java:164)
	at junit.framework.TestCase.runBare(TestCase.java:130)
	at junit.framework.TestResult$1.protect(TestResult.java:106)
	at junit.framework.TestResult.runProtected(TestResult.java:124)
	at junit.framework.TestResult.run(TestResult.java:109)
	at junit.framework.TestCase.run(TestCase.java:120)
	at junit.framework.TestSuite.runTest(TestSuite.java:230)
	at junit.framework.TestSuite.run(TestSuite.java:225)
	at org.apache.tools.ant.taskdefs.optional.junit.JUnitTestRunner.run(JUnitTestRunner.java:297)
	at org.apache.tools.ant.taskdefs.optional.junit.JUnitTestRunner.launch(JUnitTestRunner.java:672)
	at org.apache.tools.ant.taskdefs.optional.junit.JUnitTestRunner.main(JUnitTestRunner.java:546)
Test: testGetAnnotations6Class: java.lang.Package5Testjava.lang.ClassFormatError: java/lang/pkg6/package-info : if class is interface, no flags except ACC_ABSTRACT or ACC_PUBLIC can be set
	at java.lang.VMClassRegistry.loadBootstrapClass(VMClassRegistry.java)
	at java.lang.Class.forName(Class.java:151)
	at java.lang.Package.getDeclaredAnnotations(Package.java:52)
	at java.lang.Package.getAnnotations(Package.java:65)
	at org.apache.harmony.lang.AnnotatedElementTestFrame.testGetAnnotations6(AnnotatedElementTestFrame.java:276)
	at java.lang.reflect.VMReflection.invokeMethod(VMReflection.java)
	at java.lang.reflect.Method.invoke(Method.java:382)
	at junit.framework.TestCase.runTest(TestCase.java:164)
	at junit.framework.TestCase.runBare(TestCase.java:130)
	at junit.framework.TestResult$1.protect(TestResult.java:106)
	at junit.framework.TestResult.runProtected(TestResult.java:124)
	at junit.framework.TestResult.run(TestResult.java:109)
	at junit.framework.TestCase.run(TestCase.java:120)
	at junit.framework.TestSuite.runTest(TestSuite.java:230)
	at junit.framework.TestSuite.run(TestSuite.java:225)
	at org.apache.tools.ant.taskdefs.optional.junit.JUnitTestRunner.run(JUnitTestRunner.java:297)
	at org.apache.tools.ant.taskdefs.optional.junit.JUnitTestRunner.launch(JUnitTestRunner.java:672)
	at org.apache.tools.ant.taskdefs.optional.junit.JUnitTestRunner.main(JUnitTestRunner.java:546)
Test: testGetAnnotationsImmutableClass: java.lang.Package5Testjava.lang.ClassFormatError: java/lang/pkg1/package-info : if class is interface, no flags except ACC_ABSTRACT or ACC_PUBLIC can be set
	at java.lang.VMClassRegistry.loadBootstrapClass(VMClassRegistry.java)
	at java.lang.Class.forName(Class.java:151)
	at java.lang.Package.getDeclaredAnnotations(Package.java:52)
	at java.lang.Package.getAnnotations(Package.java:65)
	at org.apache.harmony.lang.AnnotatedElementTestFrame.testGetAnnotationsImmutable(AnnotatedElementTestFrame.java:293)
	at java.lang.reflect.VMReflection.invokeMethod(VMReflection.java)
	at java.lang.reflect.Method.invoke(Method.java:382)
	at junit.framework.TestCase.runTest(TestCase.java:164)
	at junit.framework.TestCase.runBare(TestCase.java:130)
	at junit.framework.TestResult$1.protect(TestResult.java:106)
	at junit.framework.TestResult.runProtected(TestResult.java:124)
	at junit.framework.TestResult.run(TestResult.java:109)
	at junit.framework.TestCase.run(TestCase.java:120)
	at junit.framework.TestSuite.runTest(TestSuite.java:230)
	at junit.framework.TestSuite.run(TestSuite.java:225)
	at org.apache.tools.ant.taskdefs.optional.junit.JUnitTestRunner.run(JUnitTestRunner.java:297)
	at org.apache.tools.ant.taskdefs.optional.junit.JUnitTestRunner.launch(JUnitTestRunner.java:672)
	at org.apache.tools.ant.taskdefs.optional.junit.JUnitTestRunner.main(JUnitTestRunner.java:546)
Test: testIsAnnotationPresentClass: java.lang.Package5Testjava.lang.ClassFormatError: java/lang/pkg1/package-info : if class is interface, no flags except ACC_ABSTRACT or ACC_PUBLIC can be set
	at java.lang.VMClassRegistry.loadBootstrapClass(VMClassRegistry.java)
	at java.lang.Class.forName(Class.java:151)
	at java.lang.Package.getDeclaredAnnotations(Package.java:52)
	at java.lang.Package.getAnnotations(Package.java:65)
	at java.lang.Package.getAnnotation(Package.java:78)
	at java.lang.Package.isAnnotationPresent(Package.java:93)
	at org.apache.harmony.lang.AnnotatedElementTestFrame.testIsAnnotationPresent(AnnotatedElementTestFrame.java:310)
	at java.lang.reflect.VMReflection.invokeMethod(VMReflection.java)
	at java.lang.reflect.Method.invoke(Method.java:382)
	at junit.framework.TestCase.runTest(TestCase.java:164)
	at junit.framework.TestCase.runBare(TestCase.java:130)
	at junit.framework.TestResult$1.protect(TestResult.java:106)
	at junit.framework.TestResult.runProtected(TestResult.java:124)
	at junit.framework.TestResult.run(TestResult.java:109)
	at junit.framework.TestCase.run(TestCase.java:120)
	at junit.framework.TestSuite.runTest(TestSuite.java:230)
	at junit.framework.TestSuite.run(TestSuite.java:225)
	at org.apache.tools.ant.taskdefs.optional.junit.JUnitTestRunner.run(JUnitTestRunner.java:297)
	at org.apache.tools.ant.taskdefs.optional.junit.JUnitTestRunner.launch(JUnitTestRunner.java:672)
	at org.apache.tools.ant.taskdefs.optional.junit.JUnitTestRunner.main(JUnitTestRunner.java:546)
Test: testIsAnnotationPresent_NegativeClass: java.lang.Package5Testjava.lang.ClassFormatError: java/lang/pkg1/package-info : if class is interface, no flags except ACC_ABSTRACT or ACC_PUBLIC can be set
	at java.lang.VMClassRegistry.loadBootstrapClass(VMClassRegistry.java)
	at java.lang.Class.forName(Class.java:151)
	at java.lang.Package.getDeclaredAnnotations(Package.java:52)
	at java.lang.Package.getAnnotations(Package.java:65)
	at java.lang.Package.getAnnotation(Package.java:78)
	at java.lang.Package.isAnnotationPresent(Package.java:93)
	at org.apache.harmony.lang.AnnotatedElementTestFrame.testIsAnnotationPresent_Negative(AnnotatedElementTestFrame.java:320)
	at java.lang.reflect.VMReflection.invokeMethod(VMReflection.java)
	at java.lang.reflect.Method.invoke(Method.java:382)
	at junit.framework.TestCase.runTest(TestCase.java:164)
	at junit.framework.TestCase.runBare(TestCase.java:130)
	at junit.framework.TestResult$1.protect(TestResult.java:106)
	at junit.framework.TestResult.runProtected(TestResult.java:124)
	at junit.framework.TestResult.run(TestResult.java:109)
	at junit.framework.TestCase.run(TestCase.java:120)
	at junit.framework.TestSuite.runTest(TestSuite.java:230)
	at junit.framework.TestSuite.run(TestSuite.java:225)
	at org.apache.tools.ant.taskdefs.optional.junit.JUnitTestRunner.run(JUnitTestRunner.java:297)
	at org.apache.tools.ant.taskdefs.optional.junit.JUnitTestRunner.launch(JUnitTestRunner.java:672)
	at org.apache.tools.ant.taskdefs.optional.junit.JUnitTestRunner.main(JUnitTestRunner.java:546)
Test: testPackageClass: org.apache.harmony.lang.annotation.AnnotationLoaderTestjava.lang.ClassFormatError: org/apache/harmony/lang/test/resource/package-info : if class is interface, no flags except ACC_ABSTRACT or ACC_PUBLIC can be set
	at java.lang.ClassLoader.defineClass0(ClassLoader.java)
	at java.lang.ClassLoader.defineClass(ClassLoader.java:417)
	at java.security.SecureClassLoader.defineClass(SecureClassLoader.java:70)
	at java.net.URLClassLoader.findClassImpl(URLClassLoader.java:1214)
	at java.net.URLClassLoader$4.run(URLClassLoader.java:625)
	at java.net.URLClassLoader$4.run(URLClassLoader.java:1)
	at java.security.AccessController.doPrivilegedImpl(AccessController.java:173)
	at java.security.AccessController.doPrivileged(AccessController.java:64)
	at java.net.URLClassLoader.findClass(URLClassLoader.java:622)
	at java.lang.ClassLoader.loadClass(ClassLoader.java:554)
	at java.net.URLClassLoader$SubURLClassLoader.loadClass(URLClassLoader.java:129)
	at java.lang.ClassLoader.loadClass(ClassLoader.java:311)
	at java.lang.Class.forName(Class.java:170)
	at java.lang.Package.getDeclaredAnnotations(Package.java:52)
	at java.lang.Package.getAnnotations(Package.java:65)
	at org.apache.harmony.lang.annotation.AnnotationLoaderTest.testPackage(AnnotationLoaderTest.java:66)
	at java.lang.reflect.VMReflection.invokeMethod(VMReflection.java)
	at java.lang.reflect.Method.invoke(Method.java:382)
	at junit.framework.TestCase.runTest(TestCase.java:164)
	at junit.framework.TestCase.runBare(TestCase.java:130)
	at junit.framework.TestResult$1.protect(TestResult.java:106)
	at junit.framework.TestResult.runProtected(TestResult.java:124)
	at junit.framework.TestResult.run(TestResult.java:109)
	at junit.framework.TestCase.run(TestCase.java:120)
	at junit.framework.TestSuite.runTest(TestSuite.java:230)
	at junit.framework.TestSuite.run(TestSuite.java:225)
	at org.apache.tools.ant.taskdefs.optional.junit.JUnitTestRunner.run(JUnitTestRunner.java:297)
	at org.apache.tools.ant.taskdefs.optional.junit.JUnitTestRunner.launch(JUnitTestRunner.java:672)
	at org.apache.tools.ant.taskdefs.optional.junit.JUnitTestRunner.main(JUnitTestRunner.java:546)
Test: testNoInheritanceClass: java.lang.Package5Testjava.lang.ClassFormatError: java/lang/pkg3/package-info : if class is interface, no flags except ACC_ABSTRACT or ACC_PUBLIC can be set
	at java.lang.VMClassRegistry.loadBootstrapClass(VMClassRegistry.java)
	at java.lang.Class.forName(Class.java:151)
	at java.lang.Package.getDeclaredAnnotations(Package.java:52)
	at java.lang.Package.getAnnotations(Package.java:65)
	at java.lang.Package5Test.testNoInheritance(Package5Test.java:110)
	at java.lang.reflect.VMReflection.invokeMethod(VMReflection.java)
	at java.lang.reflect.Method.invoke(Method.java:382)
	at junit.framework.TestCase.runTest(TestCase.java:164)
	at junit.framework.TestCase.runBare(TestCase.java:130)
	at junit.framework.TestResult$1.protect(TestResult.java:106)
	at junit.framework.TestResult.runProtected(TestResult.java:124)
	at junit.framework.TestResult.run(TestResult.java:109)
	at junit.framework.TestCase.run(TestCase.java:120)
	at junit.framework.TestSuite.runTest(TestSuite.java:230)
	at junit.framework.TestSuite.run(TestSuite.java:225)
	at org.apache.tools.ant.taskdefs.optional.junit.JUnitTestRunner.run(JUnitTestRunner.java:297)
	at org.apache.tools.ant.taskdefs.optional.junit.JUnitTestRunner.launch(JUnitTestRunner.java:672)
	at org.apache.tools.ant.taskdefs.optional.junit.JUnitTestRunner.main(JUnitTestRunner.java:546)
Test: testGetAnnotationClass: java.lang.Package5Testjava.lang.ClassFormatError: java/lang/pkg1/package-info : if class is interface, no flags except ACC_ABSTRACT or ACC_PUBLIC can be set
	at java.lang.VMClassRegistry.loadBootstrapClass(VMClassRegistry.java)
	at java.lang.Class.forName(Class.java:151)
	at java.lang.Package.getDeclaredAnnotations(Package.java:52)
	at java.lang.Package.getAnnotations(Package.java:65)
	at java.lang.Package.getAnnotation(Package.java:78)
	at org.apache.harmony.lang.AnnotatedElementTestFrame.testGetAnnotation(AnnotatedElementTestFrame.java:114)
	at java.lang.reflect.VMReflection.invokeMethod(VMReflection.java)
	at java.lang.reflect.Method.invoke(Method.java:382)
	at junit.framework.TestCase.runTest(TestCase.java:164)
	at junit.framework.TestCase.runBare(TestCase.java:130)
	at junit.framework.TestResult$1.protect(TestResult.java:106)
	at junit.framework.TestResult.runProtected(TestResult.java:124)
	at junit.framework.TestResult.run(TestResult.java:109)
	at junit.framework.TestCase.run(TestCase.java:120)
	at junit.framework.TestSuite.runTest(TestSuite.java:230)
	at junit.framework.TestSuite.run(TestSuite.java:225)
	at org.apache.tools.ant.taskdefs.optional.junit.JUnitTestRunner.run(JUnitTestRunner.java:297)
	at org.apache.tools.ant.taskdefs.optional.junit.JUnitTestRunner.launch(JUnitTestRunner.java:672)
	at org.apache.tools.ant.taskdefs.optional.junit.JUnitTestRunner.main(JUnitTestRunner.java:546)
Test: testGetAnnotation2Class: java.lang.Package5Testjava.lang.ClassFormatError: java/lang/pkg2/package-info : if class is interface, no flags except ACC_ABSTRACT or ACC_PUBLIC can be set
	at java.lang.VMClassRegistry.loadBootstrapClass(VMClassRegistry.java)
	at java.lang.Class.forName(Class.java:151)
	at java.lang.Package.getDeclaredAnnotations(Package.java:52)
	at java.lang.Package.getAnnotations(Package.java:65)
	at java.lang.Package.getAnnotation(Package.java:78)
	at org.apache.harmony.lang.AnnotatedElementTestFrame.testGetAnnotation2(AnnotatedElementTestFrame.java:124)
	at java.lang.reflect.VMReflection.invokeMethod(VMReflection.java)
	at java.lang.reflect.Method.invoke(Method.java:382)
	at junit.framework.TestCase.runTest(TestCase.java:164)
	at junit.framework.TestCase.runBare(TestCase.java:130)
	at junit.framework.TestResult$1.protect(TestResult.java:106)
	at junit.framework.TestResult.runProtected(TestResult.java:124)
	at junit.framework.TestResult.run(TestResult.java:109)
	at junit.framework.TestCase.run(TestCase.java:120)
	at junit.framework.TestSuite.runTest(TestSuite.java:230)
	at junit.framework.TestSuite.run(TestSuite.java:225)
	at org.apache.tools.ant.taskdefs.optional.junit.JUnitTestRunner.run(JUnitTestRunner.java:297)
	at org.apache.tools.ant.taskdefs.optional.junit.JUnitTestRunner.launch(JUnitTestRunner.java:672)
	at org.apache.tools.ant.taskdefs.optional.junit.JUnitTestRunner.main(JUnitTestRunner.java:546)
Test: testGetAnnotation_NegativeClass: java.lang.Package5Testjava.lang.ClassFormatError: java/lang/pkg2/package-info : if class is interface, no flags except ACC_ABSTRACT or ACC_PUBLIC can be set
	at java.lang.VMClassRegistry.loadBootstrapClass(VMClassRegistry.java)
	at java.lang.Class.forName(Class.java:151)
	at java.lang.Package.getDeclaredAnnotations(Package.java:52)
	at java.lang.Package.getAnnotations(Package.java:65)
	at java.lang.Package.getAnnotation(Package.java:78)
	at org.apache.harmony.lang.AnnotatedElementTestFrame.testGetAnnotation_Negative(AnnotatedElementTestFrame.java:134)
	at java.lang.reflect.VMReflection.invokeMethod(VMReflection.java)
	at java.lang.reflect.Method.invoke(Method.java:382)
	at junit.framework.TestCase.runTest(TestCase.java:164)
	at junit.framework.TestCase.runBare(TestCase.java:130)
	at junit.framework.TestResult$1.protect(TestResult.java:106)
	at junit.framework.TestResult.runProtected(TestResult.java:124)
	at junit.framework.TestResult.run(TestResult.java:109)
	at junit.framework.TestCase.run(TestCase.java:120)
	at junit.framework.TestSuite.runTest(TestSuite.java:230)
	at junit.framework.TestSuite.run(TestSuite.java:225)
	at org.apache.tools.ant.taskdefs.optional.junit.JUnitTestRunner.run(JUnitTestRunner.java:297)
	at org.apache.tools.ant.taskdefs.optional.junit.JUnitTestRunner.launch(JUnitTestRunner.java:672)
	at org.apache.tools.ant.taskdefs.optional.junit.JUnitTestRunner.main(JUnitTestRunner.java:546)
Test: testGetDeclaredAnnotationsClass: java.lang.Package5Testjava.lang.ClassFormatError: java/lang/pkg1/package-info : if class is interface, no flags except ACC_ABSTRACT or ACC_PUBLIC can be set
	at java.lang.VMClassRegistry.loadBootstrapClass(VMClassRegistry.java)
	at java.lang.Class.forName(Class.java:151)
	at java.lang.Package.getDeclaredAnnotations(Package.java:52)
	at org.apache.harmony.lang.AnnotatedElementTestFrame.testGetDeclaredAnnotations(AnnotatedElementTestFrame.java:162)
	at java.lang.reflect.VMReflection.invokeMethod(VMReflection.java)
	at java.lang.reflect.Method.invoke(Method.java:382)
	at junit.framework.TestCase.runTest(TestCase.java:164)
	at junit.framework.TestCase.runBare(TestCase.java:130)
	at junit.framework.TestResult$1.protect(TestResult.java:106)
	at junit.framework.TestResult.runProtected(TestResult.java:124)
	at junit.framework.TestResult.run(TestResult.java:109)
	at junit.framework.TestCase.run(TestCase.java:120)
	at junit.framework.TestSuite.runTest(TestSuite.java:230)
	at junit.framework.TestSuite.run(TestSuite.java:225)
	at org.apache.tools.ant.taskdefs.optional.junit.JUnitTestRunner.run(JUnitTestRunner.java:297)
	at org.apache.tools.ant.taskdefs.optional.junit.JUnitTestRunner.launch(JUnitTestRunner.java:672)
	at org.apache.tools.ant.taskdefs.optional.junit.JUnitTestRunner.main(JUnitTestRunner.java:546)
Test: testGetDeclaredAnnotations2Class: java.lang.Package5Testjava.lang.ClassFormatError: java/lang/pkg2/package-info : if class is interface, no flags except ACC_ABSTRACT or ACC_PUBLIC can be set
	at java.lang.VMClassRegistry.loadBootstrapClass(VMClassRegistry.java)
	at java.lang.Class.forName(Class.java:151)
	at java.lang.Package.getDeclaredAnnotations(Package.java:52)
	at org.apache.harmony.lang.AnnotatedElementTestFrame.testGetDeclaredAnnotations2(AnnotatedElementTestFrame.java:173)
	at java.lang.reflect.VMReflection.invokeMethod(VMReflection.java)
	at java.lang.reflect.Method.invoke(Method.java:382)
	at junit.framework.TestCase.runTest(TestCase.java:164)
	at junit.framework.TestCase.runBare(TestCase.java:130)
	at junit.framework.TestResult$1.protect(TestResult.java:106)
	at junit.framework.TestResult.runProtected(TestResult.java:124)
	at junit.framework.TestResult.run(TestResult.java:109)
	at junit.framework.TestCase.run(TestCase.java:120)
	at junit.framework.TestSuite.runTest(TestSuite.java:230)
	at junit.framework.TestSuite.run(TestSuite.java:225)
	at org.apache.tools.ant.taskdefs.optional.junit.JUnitTestRunner.run(JUnitTestRunner.java:297)
	at org.apache.tools.ant.taskdefs.optional.junit.JUnitTestRunner.launch(JUnitTestRunner.java:672)
	at org.apache.tools.ant.taskdefs.optional.junit.JUnitTestRunner.main(JUnitTestRunner.java:546)
Test: testGetDeclaredAnnotationsImmutableClass: java.lang.Package5Testjava.lang.ClassFormatError: java/lang/pkg1/package-info : if class is interface, no flags except ACC_ABSTRACT or ACC_PUBLIC can be set
	at java.lang.VMClassRegistry.loadBootstrapClass(VMClassRegistry.java)
	at java.lang.Class.forName(Class.java:151)
	at java.lang.Package.getDeclaredAnnotations(Package.java:52)
	at org.apache.harmony.lang.AnnotatedElementTestFrame.testGetDeclaredAnnotationsImmutable(AnnotatedElementTestFrame.java:198)
	at java.lang.reflect.VMReflection.invokeMethod(VMReflection.java)
	at java.lang.reflect.Method.invoke(Method.java:382)
	at junit.framework.TestCase.runTest(TestCase.java:164)
	at junit.framework.TestCase.runBare(TestCase.java:130)
	at junit.framework.TestResult$1.protect(TestResult.java:106)
	at junit.framework.TestResult.runProtected(TestResult.java:124)
	at junit.framework.TestResult.run(TestResult.java:109)
	at junit.framework.TestCase.run(TestCase.java:120)
	at junit.framework.TestSuite.runTest(TestSuite.java:230)
	at junit.framework.TestSuite.run(TestSuite.java:225)
	at org.apache.tools.ant.taskdefs.optional.junit.JUnitTestRunner.run(JUnitTestRunner.java:297)
	at org.apache.tools.ant.taskdefs.optional.junit.JUnitTestRunner.launch(JUnitTestRunner.java:672)
	at org.apache.tools.ant.taskdefs.optional.junit.JUnitTestRunner.main(JUnitTestRunner.java:546)
Test: testGetAnnotationsClass: java.lang.Package5Testjava.lang.ClassFormatError: java/lang/pkg1/package-info : if class is interface, no flags except ACC_ABSTRACT or ACC_PUBLIC can be set
	at java.lang.VMClassRegistry.loadBootstrapClass(VMClassRegistry.java)
	at java.lang.Class.forName(Class.java:151)
	at java.lang.Package.getDeclaredAnnotations(Package.java:52)
	at java.lang.Package.getAnnotations(Package.java:65)
	at org.apache.harmony.lang.AnnotatedElementTestFrame.testGetAnnotations(AnnotatedElementTestFrame.java:215)
	at java.lang.reflect.VMReflection.invokeMethod(VMReflection.java)
	at java.lang.reflect.Method.invoke(Method.java:382)
	at junit.framework.TestCase.runTest(TestCase.java:164)
	at junit.framework.TestCase.runBare(TestCase.java:130)
	at junit.framework.TestResult$1.protect(TestResult.java:106)
	at junit.framework.TestResult.runProtected(TestResult.java:124)
	at junit.framework.TestResult.run(TestResult.java:109)
	at junit.framework.TestCase.run(TestCase.java:120)
	at junit.framework.TestSuite.runTest(TestSuite.java:230)
	at junit.framework.TestSuite.run(TestSuite.java:225)
	at org.apache.tools.ant.taskdefs.optional.junit.JUnitTestRunner.run(JUnitTestRunner.java:297)
	at org.apache.tools.ant.taskdefs.optional.junit.JUnitTestRunner.launch(JUnitTestRunner.java:672)
	at org.apache.tools.ant.taskdefs.optional.junit.JUnitTestRunner.main(JUnitTestRunner.java:546)
Test: testGetAnnotations2Class: java.lang.Package5Testjava.lang.ClassFormatError: java/lang/pkg2/package-info : if class is interface, no flags except ACC_ABSTRACT or ACC_PUBLIC can be set
	at java.lang.VMClassRegistry.loadBootstrapClass(VMClassRegistry.java)
	at java.lang.Class.forName(Class.java:151)
	at java.lang.Package.getDeclaredAnnotations(Package.java:52)
	at java.lang.Package.getAnnotations(Package.java:65)
	at org.apache.harmony.lang.AnnotatedElementTestFrame.testGetAnnotations2(AnnotatedElementTestFrame.java:226)
	at java.lang.reflect.VMReflection.invokeMethod(VMReflection.java)
	at java.lang.reflect.Method.invoke(Method.java:382)
	at junit.framework.TestCase.runTest(TestCase.java:164)
	at junit.framework.TestCase.runBare(TestCase.java:130)
	at junit.framework.TestResult$1.protect(TestResult.java:106)
	at junit.framework.TestResult.runProtected(TestResult.java:124)
	at junit.framework.TestResult.run(TestResult.java:109)
	at junit.framework.TestCase.run(TestCase.java:120)
	at junit.framework.TestSuite.runTest(TestSuite.java:230)
	at junit.framework.TestSuite.run(TestSuite.java:225)
	at org.apache.tools.ant.taskdefs.optional.junit.JUnitTestRunner.run(JUnitTestRunner.java:297)
	at org.apache.tools.ant.taskdefs.optional.junit.JUnitTestRunner.launch(JUnitTestRunner.java:672)
	at org.apache.tools.ant.taskdefs.optional.junit.JUnitTestRunner.main(JUnitTestRunner.java:546)
Test: testGetAnnotations4Class: java.lang.Package5Testjava.lang.ClassFormatError: java/lang/pkg4/package-info : if class is interface, no flags except ACC_ABSTRACT or ACC_PUBLIC can be set
	at java.lang.VMClassRegistry.loadBootstrapClass(VMClassRegistry.java)
	at java.lang.Class.forName(Class.java:151)
	at java.lang.Package.getDeclaredAnnotations(Package.java:52)
	at java.lang.Package.getAnnotations(Package.java:65)
	at org.apache.harmony.lang.AnnotatedElementTestFrame.testGetAnnotations4(AnnotatedElementTestFrame.java:251)
	at java.lang.reflect.VMReflection.invokeMethod(VMReflection.java)
	at java.lang.reflect.Method.invoke(Method.java:382)
	at junit.framework.TestCase.runTest(TestCase.java:164)
	at junit.framework.TestCase.runBare(TestCase.java:130)
	at junit.framework.TestResult$1.protect(TestResult.java:106)
	at junit.framework.TestResult.runProtected(TestResult.java:124)
	at junit.framework.TestResult.run(TestResult.java:109)
	at junit.framework.TestCase.run(TestCase.java:120)
	at junit.framework.TestSuite.runTest(TestSuite.java:230)
	at junit.framework.TestSuite.run(TestSuite.java:225)
	at org.apache.tools.ant.taskdefs.optional.junit.JUnitTestRunner.run(JUnitTestRunner.java:297)
	at org.apache.tools.ant.taskdefs.optional.junit.JUnitTestRunner.launch(JUnitTestRunner.java:672)
	at org.apache.tools.ant.taskdefs.optional.junit.JUnitTestRunner.main(JUnitTestRunner.java:546)
Test: testGetAnnotations5Class: java.lang.Package5Testjava.lang.ClassFormatError: java/lang/pkg5/package-info : if class is interface, no flags except ACC_ABSTRACT or ACC_PUBLIC can be set
	at java.lang.VMClassRegistry.loadBootstrapClass(VMClassRegistry.java)
	at java.lang.Class.forName(Class.java:151)
	at java.lang.Package.getDeclaredAnnotations(Package.java:52)
	at java.lang.Package.getAnnotations(Package.java:65)
	at org.apache.harmony.lang.AnnotatedElementTestFrame.testGetAnnotations5(AnnotatedElementTestFrame.java:264)
	at java.lang.reflect.VMReflection.invokeMethod(VMReflection.java)
	at java.lang.reflect.Method.invoke(Method.java:382)
	at junit.framework.TestCase.runTest(TestCase.java:164)
	at junit.framework.TestCase.runBare(TestCase.java:130)
	at junit.framework.TestResult$1.protect(TestResult.java:106)
	at junit.framework.TestResult.runProtected(TestResult.java:124)
	at junit.framework.TestResult.run(TestResult.java:109)
	at junit.framework.TestCase.run(TestCase.java:120)
	at junit.framework.TestSuite.runTest(TestSuite.java:230)
	at junit.framework.TestSuite.run(TestSuite.java:225)
	at org.apache.tools.ant.taskdefs.optional.junit.JUnitTestRunner.run(JUnitTestRunner.java:297)
	at org.apache.tools.ant.taskdefs.optional.junit.JUnitTestRunner.launch(JUnitTestRunner.java:672)
	at org.apache.tools.ant.taskdefs.optional.junit.JUnitTestRunner.main(JUnitTestRunner.java:546)
Test: testGetAnnotations6Class: java.lang.Package5Testjava.lang.ClassFormatError: java/lang/pkg6/package-info : if class is interface, no flags except ACC_ABSTRACT or ACC_PUBLIC can be set
	at java.lang.VMClassRegistry.loadBootstrapClass(VMClassRegistry.java)
	at java.lang.Class.forName(Class.java:151)
	at java.lang.Package.getDeclaredAnnotations(Package.java:52)
	at java.lang.Package.getAnnotations(Package.java:65)
	at org.apache.harmony.lang.AnnotatedElementTestFrame.testGetAnnotations6(AnnotatedElementTestFrame.java:276)
	at java.lang.reflect.VMReflection.invokeMethod(VMReflection.java)
	at java.lang.reflect.Method.invoke(Method.java:382)
	at junit.framework.TestCase.runTest(TestCase.java:164)
	at junit.framework.TestCase.runBare(TestCase.java:130)
	at junit.framework.TestResult$1.protect(TestResult.java:106)
	at junit.framework.TestResult.runProtected(TestResult.java:124)
	at junit.framework.TestResult.run(TestResult.java:109)
	at junit.framework.TestCase.run(TestCase.java:120)
	at junit.framework.TestSuite.runTest(TestSuite.java:230)
	at junit.framework.TestSuite.run(TestSuite.java:225)
	at org.apache.tools.ant.taskdefs.optional.junit.JUnitTestRunner.run(JUnitTestRunner.java:297)
	at org.apache.tools.ant.taskdefs.optional.junit.JUnitTestRunner.launch(JUnitTestRunner.java:672)
	at org.apache.tools.ant.taskdefs.optional.junit.JUnitTestRunner.main(JUnitTestRunner.java:546)
Test: testGetAnnotationsImmutableClass: java.lang.Package5Testjava.lang.ClassFormatError: java/lang/pkg1/package-info : if class is interface, no flags except ACC_ABSTRACT or ACC_PUBLIC can be set
	at java.lang.VMClassRegistry.loadBootstrapClass(VMClassRegistry.java)
	at java.lang.Class.forName(Class.java:151)
	at java.lang.Package.getDeclaredAnnotations(Package.java:52)
	at java.lang.Package.getAnnotations(Package.java:65)
	at org.apache.harmony.lang.AnnotatedElementTestFrame.testGetAnnotationsImmutable(AnnotatedElementTestFrame.java:293)
	at java.lang.reflect.VMReflection.invokeMethod(VMReflection.java)
	at java.lang.reflect.Method.invoke(Method.java:382)
	at junit.framework.TestCase.runTest(TestCase.java:164)
	at junit.framework.TestCase.runBare(TestCase.java:130)
	at junit.framework.TestResult$1.protect(TestResult.java:106)
	at junit.framework.TestResult.runProtected(TestResult.java:124)
	at junit.framework.TestResult.run(TestResult.java:109)
	at junit.framework.TestCase.run(TestCase.java:120)
	at junit.framework.TestSuite.runTest(TestSuite.java:230)
	at junit.framework.TestSuite.run(TestSuite.java:225)
	at org.apache.tools.ant.taskdefs.optional.junit.JUnitTestRunner.run(JUnitTestRunner.java:297)
	at org.apache.tools.ant.taskdefs.optional.junit.JUnitTestRunner.launch(JUnitTestRunner.java:672)
	at org.apache.tools.ant.taskdefs.optional.junit.JUnitTestRunner.main(JUnitTestRunner.java:546)
Test: testIsAnnotationPresentClass: java.lang.Package5Testjava.lang.ClassFormatError: java/lang/pkg1/package-info : if class is interface, no flags except ACC_ABSTRACT or ACC_PUBLIC can be set
	at java.lang.VMClassRegistry.loadBootstrapClass(VMClassRegistry.java)
	at java.lang.Class.forName(Class.java:151)
	at java.lang.Package.getDeclaredAnnotations(Package.java:52)
	at java.lang.Package.getAnnotations(Package.java:65)
	at java.lang.Package.getAnnotation(Package.java:78)
	at java.lang.Package.isAnnotationPresent(Package.java:93)
	at org.apache.harmony.lang.AnnotatedElementTestFrame.testIsAnnotationPresent(AnnotatedElementTestFrame.java:310)
	at java.lang.reflect.VMReflection.invokeMethod(VMReflection.java)
	at java.lang.reflect.Method.invoke(Method.java:382)
	at junit.framework.TestCase.runTest(TestCase.java:164)
	at junit.framework.TestCase.runBare(TestCase.java:130)
	at junit.framework.TestResult$1.protect(TestResult.java:106)
	at junit.framework.TestResult.runProtected(TestResult.java:124)
	at junit.framework.TestResult.run(TestResult.java:109)
	at junit.framework.TestCase.run(TestCase.java:120)
	at junit.framework.TestSuite.runTest(TestSuite.java:230)
	at junit.framework.TestSuite.run(TestSuite.java:225)
	at org.apache.tools.ant.taskdefs.optional.junit.JUnitTestRunner.run(JUnitTestRunner.java:297)
	at org.apache.tools.ant.taskdefs.optional.junit.JUnitTestRunner.launch(JUnitTestRunner.java:672)
	at org.apache.tools.ant.taskdefs.optional.junit.JUnitTestRunner.main(JUnitTestRunner.java:546)
Test: testIsAnnotationPresent_NegativeClass: java.lang.Package5Testjava.lang.ClassFormatError: java/lang/pkg1/package-info : if class is interface, no flags except ACC_ABSTRACT or ACC_PUBLIC can be set
	at java.lang.VMClassRegistry.loadBootstrapClass(VMClassRegistry.java)
	at java.lang.Class.forName(Class.java:151)
	at java.lang.Package.getDeclaredAnnotations(Package.java:52)
	at java.lang.Package.getAnnotations(Package.java:65)
	at java.lang.Package.getAnnotation(Package.java:78)
	at java.lang.Package.isAnnotationPresent(Package.java:93)
	at org.apache.harmony.lang.AnnotatedElementTestFrame.testIsAnnotationPresent_Negative(AnnotatedElementTestFrame.java:320)
	at java.lang.reflect.VMReflection.invokeMethod(VMReflection.java)
	at java.lang.reflect.Method.invoke(Method.java:382)
	at junit.framework.TestCase.runTest(TestCase.java:164)
	at junit.framework.TestCase.runBare(TestCase.java:130)
	at junit.framework.TestResult$1.protect(TestResult.java:106)
	at junit.framework.TestResult.runProtected(TestResult.java:124)
	at junit.framework.TestResult.run(TestResult.java:109)
	at junit.framework.TestCase.run(TestCase.java:120)
	at junit.framework.TestSuite.runTest(TestSuite.java:230)
	at junit.framework.TestSuite.run(TestSuite.java:225)
	at org.apache.tools.ant.taskdefs.optional.junit.JUnitTestRunner.run(JUnitTestRunner.java:297)
	at org.apache.tools.ant.taskdefs.optional.junit.JUnitTestRunner.launch(JUnitTestRunner.java:672)
	at org.apache.tools.ant.taskdefs.optional.junit.JUnitTestRunner.main(JUnitTestRunner.java:546)
Test: testPackageClass: org.apache.harmony.lang.annotation.AnnotationLoaderTestjava.lang.ClassFormatError: org/apache/harmony/lang/test/resource/package-info : if class is interface, no flags except ACC_ABSTRACT or ACC_PUBLIC can be set
	at java.lang.ClassLoader.defineClass0(ClassLoader.java)
	at java.lang.ClassLoader.defineClass(ClassLoader.java:417)
	at java.security.SecureClassLoader.defineClass(SecureClassLoader.java:70)
	at java.net.URLClassLoader.findClassImpl(URLClassLoader.java:1214)
	at java.net.URLClassLoader$4.run(URLClassLoader.java:625)
	at java.net.URLClassLoader$4.run(URLClassLoader.java:1)
	at java.security.AccessController.doPrivilegedImpl(AccessController.java:171)
	at java.security.AccessController.doPrivileged(AccessController.java:64)
	at java.net.URLClassLoader.findClass(URLClassLoader.java:627)
	at java.lang.ClassLoader.loadClass(ClassLoader.java:554)
	at java.net.URLClassLoader$SubURLClassLoader.loadClass(URLClassLoader.java:129)
	at java.lang.ClassLoader.loadClass(ClassLoader.java:311)
	at java.lang.Class.forName(Class.java:170)
	at java.lang.Package.getDeclaredAnnotations(Package.java:52)
	at java.lang.Package.getAnnotations(Package.java:65)
	at org.apache.harmony.lang.annotation.AnnotationLoaderTest.testPackage(AnnotationLoaderTest.java:66)
	at java.lang.reflect.VMReflection.invokeMethod(VMReflection.java)
	at java.lang.reflect.Method.invoke(Method.java:382)
	at junit.framework.TestCase.runTest(TestCase.java:164)
	at junit.framework.TestCase.runBare(TestCase.java:130)
	at junit.framework.TestResult$1.protect(TestResult.java:106)
	at junit.framework.TestResult.runProtected(TestResult.java:124)
	at junit.framework.TestResult.run(TestResult.java:109)
	at junit.framework.TestCase.run(TestCase.java:120)
	at junit.framework.TestSuite.runTest(TestSuite.java:230)
	at junit.framework.TestSuite.run(TestSuite.java:225)
	at org.apache.tools.ant.taskdefs.optional.junit.JUnitTestRunner.run(JUnitTestRunner.java:297)
	at org.apache.tools.ant.taskdefs.optional.junit.JUnitTestRunner.launch(JUnitTestRunner.java:672)
	at org.apache.tools.ant.taskdefs.optional.junit.JUnitTestRunner.main(JUnitTestRunner.java:546)
Test: testNoInheritanceClass: java.lang.Package5Testjava.lang.ClassFormatError: java/lang/pkg3/package-info : if class is interface, no flags except ACC_ABSTRACT or ACC_PUBLIC can be set
	at java.lang.VMClassRegistry.loadBootstrapClass(VMClassRegistry.java)
	at java.lang.Class.forName(Class.java:151)
	at java.lang.Package.getDeclaredAnnotations(Package.java:52)
	at java.lang.Package.getAnnotations(Package.java:65)
	at java.lang.Package5Test.testNoInheritance(Package5Test.java:110)
	at java.lang.reflect.VMReflection.invokeMethod(VMReflection.java)
	at java.lang.reflect.Method.invoke(Method.java:382)
	at junit.framework.TestCase.runTest(TestCase.java:164)
	at junit.framework.TestCase.runBare(TestCase.java:130)
	at junit.framework.TestResult$1.protect(TestResult.java:106)
	at junit.framework.TestResult.runProtected(TestResult.java:124)
	at junit.framework.TestResult.run(TestResult.java:109)
	at junit.framework.TestCase.run(TestCase.java:120)
	at junit.framework.TestSuite.runTest(TestSuite.java:230)
	at junit.framework.TestSuite.run(TestSuite.java:225)
	at org.apache.tools.ant.taskdefs.optional.junit.JUnitTestRunner.run(JUnitTestRunner.java:297)
	at org.apache.tools.ant.taskdefs.optional.junit.JUnitTestRunner.launch(JUnitTestRunner.java:672)
	at org.apache.tools.ant.taskdefs.optional.junit.JUnitTestRunner.main(JUnitTestRunner.java:546)
Test: testGetAnnotationClass: java.lang.Package5Testjava.lang.ClassFormatError: java/lang/pkg1/package-info : if class is interface, no flags except ACC_ABSTRACT or ACC_PUBLIC can be set
	at java.lang.VMClassRegistry.loadBootstrapClass(VMClassRegistry.java)
	at java.lang.Class.forName(Class.java:151)
	at java.lang.Package.getDeclaredAnnotations(Package.java:52)
	at java.lang.Package.getAnnotations(Package.java:65)
	at java.lang.Package.getAnnotation(Package.java:78)
	at org.apache.harmony.lang.AnnotatedElementTestFrame.testGetAnnotation(AnnotatedElementTestFrame.java:114)
	at java.lang.reflect.VMReflection.invokeMethod(VMReflection.java)
	at java.lang.reflect.Method.invoke(Method.java:382)
	at junit.framework.TestCase.runTest(TestCase.java:164)
	at junit.framework.TestCase.runBare(TestCase.java:130)
	at junit.framework.TestResult$1.protect(TestResult.java:106)
	at junit.framework.TestResult.runProtected(TestResult.java:124)
	at junit.framework.TestResult.run(TestResult.java:109)
	at junit.framework.TestCase.run(TestCase.java:120)
	at junit.framework.TestSuite.runTest(TestSuite.java:230)
	at junit.framework.TestSuite.run(TestSuite.java:225)
	at org.apache.tools.ant.taskdefs.optional.junit.JUnitTestRunner.run(JUnitTestRunner.java:297)
	at org.apache.tools.ant.taskdefs.optional.junit.JUnitTestRunner.launch(JUnitTestRunner.java:672)
	at org.apache.tools.ant.taskdefs.optional.junit.JUnitTestRunner.main(JUnitTestRunner.java:546)
Test: testGetAnnotation2Class: java.lang.Package5Testjava.lang.ClassFormatError: java/lang/pkg2/package-info : if class is interface, no flags except ACC_ABSTRACT or ACC_PUBLIC can be set
	at java.lang.VMClassRegistry.loadBootstrapClass(VMClassRegistry.java)
	at java.lang.Class.forName(Class.java:151)
	at java.lang.Package.getDeclaredAnnotations(Package.java:52)
	at java.lang.Package.getAnnotations(Package.java:65)
	at java.lang.Package.getAnnotation(Package.java:78)
	at org.apache.harmony.lang.AnnotatedElementTestFrame.testGetAnnotation2(AnnotatedElementTestFrame.java:124)
	at java.lang.reflect.VMReflection.invokeMethod(VMReflection.java)
	at java.lang.reflect.Method.invoke(Method.java:382)
	at junit.framework.TestCase.runTest(TestCase.java:164)
	at junit.framework.TestCase.runBare(TestCase.java:130)
	at junit.framework.TestResult$1.protect(TestResult.java:106)
	at junit.framework.TestResult.runProtected(TestResult.java:124)
	at junit.framework.TestResult.run(TestResult.java:109)
	at junit.framework.TestCase.run(TestCase.java:120)
	at junit.framework.TestSuite.runTest(TestSuite.java:230)
	at junit.framework.TestSuite.run(TestSuite.java:225)
	at org.apache.tools.ant.taskdefs.optional.junit.JUnitTestRunner.run(JUnitTestRunner.java:297)
	at org.apache.tools.ant.taskdefs.optional.junit.JUnitTestRunner.launch(JUnitTestRunner.java:672)
	at org.apache.tools.ant.taskdefs.optional.junit.JUnitTestRunner.main(JUnitTestRunner.java:546)
Test: testGetAnnotation_NegativeClass: java.lang.Package5Testjava.lang.ClassFormatError: java/lang/pkg2/package-info : if class is interface, no flags except ACC_ABSTRACT or ACC_PUBLIC can be set
	at java.lang.VMClassRegistry.loadBootstrapClass(VMClassRegistry.java)
	at java.lang.Class.forName(Class.java:151)
	at java.lang.Package.getDeclaredAnnotations(Package.java:52)
	at java.lang.Package.getAnnotations(Package.java:65)
	at java.lang.Package.getAnnotation(Package.java:78)
	at org.apache.harmony.lang.AnnotatedElementTestFrame.testGetAnnotation_Negative(AnnotatedElementTestFrame.java:134)
	at java.lang.reflect.VMReflection.invokeMethod(VMReflection.java)
	at java.lang.reflect.Method.invoke(Method.java:382)
	at junit.framework.TestCase.runTest(TestCase.java:164)
	at junit.framework.TestCase.runBare(TestCase.java:130)
	at junit.framework.TestResult$1.protect(TestResult.java:106)
	at junit.framework.TestResult.runProtected(TestResult.java:124)
	at junit.framework.TestResult.run(TestResult.java:109)
	at junit.framework.TestCase.run(TestCase.java:120)
	at junit.framework.TestSuite.runTest(TestSuite.java:230)
	at junit.framework.TestSuite.run(TestSuite.java:225)
	at org.apache.tools.ant.taskdefs.optional.junit.JUnitTestRunner.run(JUnitTestRunner.java:297)
	at org.apache.tools.ant.taskdefs.optional.junit.JUnitTestRunner.launch(JUnitTestRunner.java:672)
	at org.apache.tools.ant.taskdefs.optional.junit.JUnitTestRunner.main(JUnitTestRunner.java:546)
Test: testGetDeclaredAnnotationsClass: java.lang.Package5Testjava.lang.ClassFormatError: java/lang/pkg1/package-info : if class is interface, no flags except ACC_ABSTRACT or ACC_PUBLIC can be set
	at java.lang.VMClassRegistry.loadBootstrapClass(VMClassRegistry.java)
	at java.lang.Class.forName(Class.java:151)
	at java.lang.Package.getDeclaredAnnotations(Package.java:52)
	at org.apache.harmony.lang.AnnotatedElementTestFrame.testGetDeclaredAnnotations(AnnotatedElementTestFrame.java:162)
	at java.lang.reflect.VMReflection.invokeMethod(VMReflection.java)
	at java.lang.reflect.Method.invoke(Method.java:382)
	at junit.framework.TestCase.runTest(TestCase.java:164)
	at junit.framework.TestCase.runBare(TestCase.java:130)
	at junit.framework.TestResult$1.protect(TestResult.java:106)
	at junit.framework.TestResult.runProtected(TestResult.java:124)
	at junit.framework.TestResult.run(TestResult.java:109)
	at junit.framework.TestCase.run(TestCase.java:120)
	at junit.framework.TestSuite.runTest(TestSuite.java:230)
	at junit.framework.TestSuite.run(TestSuite.java:225)
	at org.apache.tools.ant.taskdefs.optional.junit.JUnitTestRunner.run(JUnitTestRunner.java:297)
	at org.apache.tools.ant.taskdefs.optional.junit.JUnitTestRunner.launch(JUnitTestRunner.java:672)
	at org.apache.tools.ant.taskdefs.optional.junit.JUnitTestRunner.main(JUnitTestRunner.java:546)
Test: testGetDeclaredAnnotations2Class: java.lang.Package5Testjava.lang.ClassFormatError: java/lang/pkg2/package-info : if class is interface, no flags except ACC_ABSTRACT or ACC_PUBLIC can be set
	at java.lang.VMClassRegistry.loadBootstrapClass(VMClassRegistry.java)
	at java.lang.Class.forName(Class.java:151)
	at java.lang.Package.getDeclaredAnnotations(Package.java:52)
	at org.apache.harmony.lang.AnnotatedElementTestFrame.testGetDeclaredAnnotations2(AnnotatedElementTestFrame.java:173)
	at java.lang.reflect.VMReflection.invokeMethod(VMReflection.java)
	at java.lang.reflect.Method.invoke(Method.java:382)
	at junit.framework.TestCase.runTest(TestCase.java:164)
	at junit.framework.TestCase.runBare(TestCase.java:130)
	at junit.framework.TestResult$1.protect(TestResult.java:106)
	at junit.framework.TestResult.runProtected(TestResult.java:124)
	at junit.framework.TestResult.run(TestResult.java:109)
	at junit.framework.TestCase.run(TestCase.java:120)
	at junit.framework.TestSuite.runTest(TestSuite.java:230)
	at junit.framework.TestSuite.run(TestSuite.java:225)
	at org.apache.tools.ant.taskdefs.optional.junit.JUnitTestRunner.run(JUnitTestRunner.java:297)
	at org.apache.tools.ant.taskdefs.optional.junit.JUnitTestRunner.launch(JUnitTestRunner.java:672)
	at org.apache.tools.ant.taskdefs.optional.junit.JUnitTestRunner.main(JUnitTestRunner.java:546)
Test: testGetDeclaredAnnotationsImmutableClass: java.lang.Package5Testjava.lang.ClassFormatError: java/lang/pkg1/package-info : if class is interface, no flags except ACC_ABSTRACT or ACC_PUBLIC can be set
	at java.lang.VMClassRegistry.loadBootstrapClass(VMClassRegistry.java)
	at java.lang.Class.forName(Class.java:151)
	at java.lang.Package.getDeclaredAnnotations(Package.java:52)
	at org.apache.harmony.lang.AnnotatedElementTestFrame.testGetDeclaredAnnotationsImmutable(AnnotatedElementTestFrame.java:198)
	at java.lang.reflect.VMReflection.invokeMethod(VMReflection.java)
	at java.lang.reflect.Method.invoke(Method.java:382)
	at junit.framework.TestCase.runTest(TestCase.java:164)
	at junit.framework.TestCase.runBare(TestCase.java:130)
	at junit.framework.TestResult$1.protect(TestResult.java:106)
	at junit.framework.TestResult.runProtected(TestResult.java:124)
	at junit.framework.TestResult.run(TestResult.java:109)
	at junit.framework.TestCase.run(TestCase.java:120)
	at junit.framework.TestSuite.runTest(TestSuite.java:230)
	at junit.framework.TestSuite.run(TestSuite.java:225)
	at org.apache.tools.ant.taskdefs.optional.junit.JUnitTestRunner.run(JUnitTestRunner.java:297)
	at org.apache.tools.ant.taskdefs.optional.junit.JUnitTestRunner.launch(JUnitTestRunner.java:672)
	at org.apache.tools.ant.taskdefs.optional.junit.JUnitTestRunner.main(JUnitTestRunner.java:546)
Test: testGetAnnotationsClass: java.lang.Package5Testjava.lang.ClassFormatError: java/lang/pkg1/package-info : if class is interface, no flags except ACC_ABSTRACT or ACC_PUBLIC can be set
	at java.lang.VMClassRegistry.loadBootstrapClass(VMClassRegistry.java)
	at java.lang.Class.forName(Class.java:151)
	at java.lang.Package.getDeclaredAnnotations(Package.java:52)
	at java.lang.Package.getAnnotations(Package.java:65)
	at org.apache.harmony.lang.AnnotatedElementTestFrame.testGetAnnotations(AnnotatedElementTestFrame.java:215)
	at java.lang.reflect.VMReflection.invokeMethod(VMReflection.java)
	at java.lang.reflect.Method.invoke(Method.java:382)
	at junit.framework.TestCase.runTest(TestCase.java:164)
	at junit.framework.TestCase.runBare(TestCase.java:130)
	at junit.framework.TestResult$1.protect(TestResult.java:106)
	at junit.framework.TestResult.runProtected(TestResult.java:124)
	at junit.framework.TestResult.run(TestResult.java:109)
	at junit.framework.TestCase.run(TestCase.java:120)
	at junit.framework.TestSuite.runTest(TestSuite.java:230)
	at junit.framework.TestSuite.run(TestSuite.java:225)
	at org.apache.tools.ant.taskdefs.optional.junit.JUnitTestRunner.run(JUnitTestRunner.java:297)
	at org.apache.tools.ant.taskdefs.optional.junit.JUnitTestRunner.launch(JUnitTestRunner.java:672)
	at org.apache.tools.ant.taskdefs.optional.junit.JUnitTestRunner.main(JUnitTestRunner.java:546)
Test: testGetAnnotations2Class: java.lang.Package5Testjava.lang.ClassFormatError: java/lang/pkg2/package-info : if class is interface, no flags except ACC_ABSTRACT or ACC_PUBLIC can be set
	at java.lang.VMClassRegistry.loadBootstrapClass(VMClassRegistry.java)
	at java.lang.Class.forName(Class.java:151)
	at java.lang.Package.getDeclaredAnnotations(Package.java:52)
	at java.lang.Package.getAnnotations(Package.java:65)
	at org.apache.harmony.lang.AnnotatedElementTestFrame.testGetAnnotations2(AnnotatedElementTestFrame.java:226)
	at java.lang.reflect.VMReflection.invokeMethod(VMReflection.java)
	at java.lang.reflect.Method.invoke(Method.java:382)
	at junit.framework.TestCase.runTest(TestCase.java:164)
	at junit.framework.TestCase.runBare(TestCase.java:130)
	at junit.framework.TestResult$1.protect(TestResult.java:106)
	at junit.framework.TestResult.runProtected(TestResult.java:124)
	at junit.framework.TestResult.run(TestResult.java:109)
	at junit.framework.TestCase.run(TestCase.java:120)
	at junit.framework.TestSuite.runTest(TestSuite.java:230)
	at junit.framework.TestSuite.run(TestSuite.java:225)
	at org.apache.tools.ant.taskdefs.optional.junit.JUnitTestRunner.run(JUnitTestRunner.java:297)
	at org.apache.tools.ant.taskdefs.optional.junit.JUnitTestRunner.launch(JUnitTestRunner.java:672)
	at org.apache.tools.ant.taskdefs.optional.junit.JUnitTestRunner.main(JUnitTestRunner.java:546)
Test: testGetAnnotations4Class: java.lang.Package5Testjava.lang.ClassFormatError: java/lang/pkg4/package-info : if class is interface, no flags except ACC_ABSTRACT or ACC_PUBLIC can be set
	at java.lang.VMClassRegistry.loadBootstrapClass(VMClassRegistry.java)
	at java.lang.Class.forName(Class.java:151)
	at java.lang.Package.getDeclaredAnnotations(Package.java:52)
	at java.lang.Package.getAnnotations(Package.java:65)
	at org.apache.harmony.lang.AnnotatedElementTestFrame.testGetAnnotations4(AnnotatedElementTestFrame.java:251)
	at java.lang.reflect.VMReflection.invokeMethod(VMReflection.java)
	at java.lang.reflect.Method.invoke(Method.java:382)
	at junit.framework.TestCase.runTest(TestCase.java:164)
	at junit.framework.TestCase.runBare(TestCase.java:130)
	at junit.framework.TestResult$1.protect(TestResult.java:106)
	at junit.framework.TestResult.runProtected(TestResult.java:124)
	at junit.framework.TestResult.run(TestResult.java:109)
	at junit.framework.TestCase.run(TestCase.java:120)
	at junit.framework.TestSuite.runTest(TestSuite.java:230)
	at junit.framework.TestSuite.run(TestSuite.java:225)
	at org.apache.tools.ant.taskdefs.optional.junit.JUnitTestRunner.run(JUnitTestRunner.java:297)
	at org.apache.tools.ant.taskdefs.optional.junit.JUnitTestRunner.launch(JUnitTestRunner.java:672)
	at org.apache.tools.ant.taskdefs.optional.junit.JUnitTestRunner.main(JUnitTestRunner.java:546)
Test: testGetAnnotations5Class: java.lang.Package5Testjava.lang.ClassFormatError: java/lang/pkg5/package-info : if class is interface, no flags except ACC_ABSTRACT or ACC_PUBLIC can be set
	at java.lang.VMClassRegistry.loadBootstrapClass(VMClassRegistry.java)
	at java.lang.Class.forName(Class.java:151)
	at java.lang.Package.getDeclaredAnnotations(Package.java:52)
	at java.lang.Package.getAnnotations(Package.java:65)
	at org.apache.harmony.lang.AnnotatedElementTestFrame.testGetAnnotations5(AnnotatedElementTestFrame.java:264)
	at java.lang.reflect.VMReflection.invokeMethod(VMReflection.java)
	at java.lang.reflect.Method.invoke(Method.java:382)
	at junit.framework.TestCase.runTest(TestCase.java:164)
	at junit.framework.TestCase.runBare(TestCase.java:130)
	at junit.framework.TestResult$1.protect(TestResult.java:106)
	at junit.framework.TestResult.runProtected(TestResult.java:124)
	at junit.framework.TestResult.run(TestResult.java:109)
	at junit.framework.TestCase.run(TestCase.java:120)
	at junit.framework.TestSuite.runTest(TestSuite.java:230)
	at junit.framework.TestSuite.run(TestSuite.java:225)
	at org.apache.tools.ant.taskdefs.optional.junit.JUnitTestRunner.run(JUnitTestRunner.java:297)
	at org.apache.tools.ant.taskdefs.optional.junit.JUnitTestRunner.launch(JUnitTestRunner.java:672)
	at org.apache.tools.ant.taskdefs.optional.junit.JUnitTestRunner.main(JUnitTestRunner.java:546)
Test: testGetAnnotations6Class: java.lang.Package5Testjava.lang.ClassFormatError: java/lang/pkg6/package-info : if class is interface, no flags except ACC_ABSTRACT or ACC_PUBLIC can be set
	at java.lang.VMClassRegistry.loadBootstrapClass(VMClassRegistry.java)
	at java.lang.Class.forName(Class.java:151)
	at java.lang.Package.getDeclaredAnnotations(Package.java:52)
	at java.lang.Package.getAnnotations(Package.java:65)
	at org.apache.harmony.lang.AnnotatedElementTestFrame.testGetAnnotations6(AnnotatedElementTestFrame.java:276)
	at java.lang.reflect.VMReflection.invokeMethod(VMReflection.java)
	at java.lang.reflect.Method.invoke(Method.java:382)
	at junit.framework.TestCase.runTest(TestCase.java:164)
	at junit.framework.TestCase.runBare(TestCase.java:130)
	at junit.framework.TestResult$1.protect(TestResult.java:106)
	at junit.framework.TestResult.runProtected(TestResult.java:124)
	at junit.framework.TestResult.run(TestResult.java:109)
	at junit.framework.TestCase.run(TestCase.java:120)
	at junit.framework.TestSuite.runTest(TestSuite.java:230)
	at junit.framework.TestSuite.run(TestSuite.java:225)
	at org.apache.tools.ant.taskdefs.optional.junit.JUnitTestRunner.run(JUnitTestRunner.java:297)
	at org.apache.tools.ant.taskdefs.optional.junit.JUnitTestRunner.launch(JUnitTestRunner.java:672)
	at org.apache.tools.ant.taskdefs.optional.junit.JUnitTestRunner.main(JUnitTestRunner.java:546)
Test: testGetAnnotationsImmutableClass: java.lang.Package5Testjava.lang.ClassFormatError: java/lang/pkg1/package-info : if class is interface, no flags except ACC_ABSTRACT or ACC_PUBLIC can be set
	at java.lang.VMClassRegistry.loadBootstrapClass(VMClassRegistry.java)
	at java.lang.Class.forName(Class.java:151)
	at java.lang.Package.getDeclaredAnnotations(Package.java:52)
	at java.lang.Package.getAnnotations(Package.java:65)
	at org.apache.harmony.lang.AnnotatedElementTestFrame.testGetAnnotationsImmutable(AnnotatedElementTestFrame.java:293)
	at java.lang.reflect.VMReflection.invokeMethod(VMReflection.java)
	at java.lang.reflect.Method.invoke(Method.java:382)
	at junit.framework.TestCase.runTest(TestCase.java:164)
	at junit.framework.TestCase.runBare(TestCase.java:130)
	at junit.framework.TestResult$1.protect(TestResult.java:106)
	at junit.framework.TestResult.runProtected(TestResult.java:124)
	at junit.framework.TestResult.run(TestResult.java:109)
	at junit.framework.TestCase.run(TestCase.java:120)
	at junit.framework.TestSuite.runTest(TestSuite.java:230)
	at junit.framework.TestSuite.run(TestSuite.java:225)
	at org.apache.tools.ant.taskdefs.optional.junit.JUnitTestRunner.run(JUnitTestRunner.java:297)
	at org.apache.tools.ant.taskdefs.optional.junit.JUnitTestRunner.launch(JUnitTestRunner.java:672)
	at org.apache.tools.ant.taskdefs.optional.junit.JUnitTestRunner.main(JUnitTestRunner.java:546)
Test: testIsAnnotationPresentClass: java.lang.Package5Testjava.lang.ClassFormatError: java/lang/pkg1/package-info : if class is interface, no flags except ACC_ABSTRACT or ACC_PUBLIC can be set
	at java.lang.VMClassRegistry.loadBootstrapClass(VMClassRegistry.java)
	at java.lang.Class.forName(Class.java:151)
	at java.lang.Package.getDeclaredAnnotations(Package.java:52)
	at java.lang.Package.getAnnotations(Package.java:65)
	at java.lang.Package.getAnnotation(Package.java:78)
	at java.lang.Package.isAnnotationPresent(Package.java:93)
	at org.apache.harmony.lang.AnnotatedElementTestFrame.testIsAnnotationPresent(AnnotatedElementTestFrame.java:310)
	at java.lang.reflect.VMReflection.invokeMethod(VMReflection.java)
	at java.lang.reflect.Method.invoke(Method.java:382)
	at junit.framework.TestCase.runTest(TestCase.java:164)
	at junit.framework.TestCase.runBare(TestCase.java:130)
	at junit.framework.TestResult$1.protect(TestResult.java:106)
	at junit.framework.TestResult.runProtected(TestResult.java:124)
	at junit.framework.TestResult.run(TestResult.java:109)
	at junit.framework.TestCase.run(TestCase.java:120)
	at junit.framework.TestSuite.runTest(TestSuite.java:230)
	at junit.framework.TestSuite.run(TestSuite.java:225)
	at org.apache.tools.ant.taskdefs.optional.junit.JUnitTestRunner.run(JUnitTestRunner.java:297)
	at org.apache.tools.ant.taskdefs.optional.junit.JUnitTestRunner.launch(JUnitTestRunner.java:672)
	at org.apache.tools.ant.taskdefs.optional.junit.JUnitTestRunner.main(JUnitTestRunner.java:546)
Test: testIsAnnotationPresent_NegativeClass: java.lang.Package5Testjava.lang.ClassFormatError: java/lang/pkg1/package-info : if class is interface, no flags except ACC_ABSTRACT or ACC_PUBLIC can be set
	at java.lang.VMClassRegistry.loadBootstrapClass(VMClassRegistry.java)
	at java.lang.Class.forName(Class.java:151)
	at java.lang.Package.getDeclaredAnnotations(Package.java:52)
	at java.lang.Package.getAnnotations(Package.java:65)
	at java.lang.Package.getAnnotation(Package.java:78)
	at java.lang.Package.isAnnotationPresent(Package.java:93)
	at org.apache.harmony.lang.AnnotatedElementTestFrame.testIsAnnotationPresent_Negative(AnnotatedElementTestFrame.java:320)
	at java.lang.reflect.VMReflection.invokeMethod(VMReflection.java)
	at java.lang.reflect.Method.invoke(Method.java:382)
	at junit.framework.TestCase.runTest(TestCase.java:164)
	at junit.framework.TestCase.runBare(TestCase.java:130)
	at junit.framework.TestResult$1.protect(TestResult.java:106)
	at junit.framework.TestResult.runProtected(TestResult.java:124)
	at junit.framework.TestResult.run(TestResult.java:109)
	at junit.framework.TestCase.run(TestCase.java:120)
	at junit.framework.TestSuite.runTest(TestSuite.java:230)
	at junit.framework.TestSuite.run(TestSuite.java:225)
	at org.apache.tools.ant.taskdefs.optional.junit.JUnitTestRunner.run(JUnitTestRunner.java:297)
	at org.apache.tools.ant.taskdefs.optional.junit.JUnitTestRunner.launch(JUnitTestRunner.java:672)
	at org.apache.tools.ant.taskdefs.optional.junit.JUnitTestRunner.main(JUnitTestRunner.java:546)
Test: testPackageClass: org.apache.harmony.lang.annotation.AnnotationLoaderTestjava.lang.ClassFormatError: org/apache/harmony/lang/test/resource/package-info : if class is interface, no flags except ACC_ABSTRACT or ACC_PUBLIC can be set
	at java.lang.ClassLoader.defineClass0(ClassLoader.java)
	at java.lang.ClassLoader.defineClass(ClassLoader.java:417)
	at java.security.SecureClassLoader.defineClass(SecureClassLoader.java:70)
	at java.net.URLClassLoader.findClassImpl(URLClassLoader.java:1214)
	at java.net.URLClassLoader$4.run(URLClassLoader.java:625)
	at java.net.URLClassLoader$4.run(URLClassLoader.java:1)
	at java.security.AccessController.doPrivilegedImpl(AccessController.java:171)
	at java.security.AccessController.doPrivileged(AccessController.java:64)
	at java.net.URLClassLoader.findClass(URLClassLoader.java:627)
	at java.lang.ClassLoader.loadClass(ClassLoader.java:554)
	at java.net.URLClassLoader$SubURLClassLoader.loadClass(URLClassLoader.java:129)
	at java.lang.ClassLoader.loadClass(ClassLoader.java:311)
	at java.lang.Class.forName(Class.java:170)
	at java.lang.Package.getDeclaredAnnotations(Package.java:52)
	at java.lang.Package.getAnnotations(Package.java:65)
	at org.apache.harmony.lang.annotation.AnnotationLoaderTest.testPackage(AnnotationLoaderTest.java:66)
	at java.lang.reflect.VMReflection.invokeMethod(VMReflection.java)
	at java.lang.reflect.Method.invoke(Method.java:382)
	at junit.framework.TestCase.runTest(TestCase.java:164)
	at junit.framework.TestCase.runBare(TestCase.java:130)
	at junit.framework.TestResult$1.protect(TestResult.java:106)
	at junit.framework.TestResult.runProtected(TestResult.java:124)
	at junit.framework.TestResult.run(TestResult.java:109)
	at junit.framework.TestCase.run(TestCase.java:120)
	at junit.framework.TestSuite.runTest(TestSuite.java:230)
	at junit.framework.TestSuite.run(TestSuite.java:225)
	at org.apache.tools.ant.taskdefs.optional.junit.JUnitTestRunner.run(JUnitTestRunner.java:297)
	at org.apache.tools.ant.taskdefs.optional.junit.JUnitTestRunner.launch(JUnitTestRunner.java:672)
	at org.apache.tools.ant.taskdefs.optional.junit.JUnitTestRunner.main(JUnitTestRunner.java:546)
Test: testNoInheritanceClass: java.lang.Package5Testjava.lang.ClassFormatError: java/lang/pkg3/package-info : if class is interface, no flags except ACC_ABSTRACT or ACC_PUBLIC can be set
	at java.lang.VMClassRegistry.loadBootstrapClass(VMClassRegistry.java)
	at java.lang.Class.forName(Class.java:151)
	at java.lang.Package.getDeclaredAnnotations(Package.java:52)
	at java.lang.Package.getAnnotations(Package.java)
	at java.lang.Package5Test.testNoInheritance(Package5Test.java)
	at java.lang.reflect.VMReflection.invokeMethod(VMReflection.java)
	at java.lang.reflect.Method.invoke(Method.java:382)
	at junit.framework.TestCase.runTest(TestCase.java:164)
	at junit.framework.TestCase.runBare(TestCase.java)
	at junit.framework.TestResult$1.protect(TestResult.java)
	at junit.framework.TestResult.runProtected(TestResult.java)
	at junit.framework.TestResult.run(TestResult.java)
	at junit.framework.TestCase.run(TestCase.java)
	at junit.framework.TestSuite.runTest(TestSuite.java:230)
	at junit.framework.TestSuite.run(TestSuite.java)
	at org.apache.tools.ant.taskdefs.optional.junit.JUnitTestRunner.run(JUnitTestRunner.java)
	at org.apache.tools.ant.taskdefs.optional.junit.JUnitTestRunner.launch(JUnitTestRunner.java:672)
	at org.apache.tools.ant.taskdefs.optional.junit.JUnitTestRunner.main(JUnitTestRunner.java:546)
Test: testGetAnnotationClass: java.lang.Package5Testjava.lang.ClassFormatError: java/lang/pkg1/package-info : if class is interface, no flags except ACC_ABSTRACT or ACC_PUBLIC can be set
	at java.lang.VMClassRegistry.loadBootstrapClass(VMClassRegistry.java)
	at java.lang.Class.forName(Class.java:151)
	at java.lang.Package.getDeclaredAnnotations(Package.java:52)
	at java.lang.Package.getAnnotations(Package.java)
	at java.lang.Package.getAnnotation(Package.java)
	at org.apache.harmony.lang.AnnotatedElementTestFrame.testGetAnnotation(AnnotatedElementTestFrame.java)
	at java.lang.reflect.VMReflection.invokeMethod(VMReflection.java)
	at java.lang.reflect.Method.invoke(Method.java:382)
	at junit.framework.TestCase.runTest(TestCase.java:164)
	at junit.framework.TestCase.runBare(TestCase.java)
	at junit.framework.TestResult$1.protect(TestResult.java)
	at junit.framework.TestResult.runProtected(TestResult.java)
	at junit.framework.TestResult.run(TestResult.java)
	at junit.framework.TestCase.run(TestCase.java)
	at junit.framework.TestSuite.runTest(TestSuite.java:230)
	at junit.framework.TestSuite.run(TestSuite.java)
	at org.apache.tools.ant.taskdefs.optional.junit.JUnitTestRunner.run(JUnitTestRunner.java)
	at org.apache.tools.ant.taskdefs.optional.junit.JUnitTestRunner.launch(JUnitTestRunner.java:672)
	at org.apache.tools.ant.taskdefs.optional.junit.JUnitTestRunner.main(JUnitTestRunner.java:546)
Test: testGetAnnotation2Class: java.lang.Package5Testjava.lang.ClassFormatError: java/lang/pkg2/package-info : if class is interface, no flags except ACC_ABSTRACT or ACC_PUBLIC can be set
	at java.lang.VMClassRegistry.loadBootstrapClass(VMClassRegistry.java)
	at java.lang.Class.forName(Class.java:151)
	at java.lang.Package.getDeclaredAnnotations(Package.java:52)
	at java.lang.Package.getAnnotations(Package.java)
	at java.lang.Package.getAnnotation(Package.java)
	at org.apache.harmony.lang.AnnotatedElementTestFrame.testGetAnnotation2(AnnotatedElementTestFrame.java)
	at java.lang.reflect.VMReflection.invokeMethod(VMReflection.java)
	at java.lang.reflect.Method.invoke(Method.java:382)
	at junit.framework.TestCase.runTest(TestCase.java:164)
	at junit.framework.TestCase.runBare(TestCase.java)
	at junit.framework.TestResult$1.protect(TestResult.java)
	at junit.framework.TestResult.runProtected(TestResult.java)
	at junit.framework.TestResult.run(TestResult.java)
	at junit.framework.TestCase.run(TestCase.java)
	at junit.framework.TestSuite.runTest(TestSuite.java:230)
	at junit.framework.TestSuite.run(TestSuite.java)
	at org.apache.tools.ant.taskdefs.optional.junit.JUnitTestRunner.run(JUnitTestRunner.java)
	at org.apache.tools.ant.taskdefs.optional.junit.JUnitTestRunner.launch(JUnitTestRunner.java:672)
	at org.apache.tools.ant.taskdefs.optional.junit.JUnitTestRunner.main(JUnitTestRunner.java:546)
Test: testGetAnnotation_NegativeClass: java.lang.Package5Testjava.lang.ClassFormatError: java/lang/pkg2/package-info : if class is interface, no flags except ACC_ABSTRACT or ACC_PUBLIC can be set
	at java.lang.VMClassRegistry.loadBootstrapClass(VMClassRegistry.java)
	at java.lang.Class.forName(Class.java:151)
	at java.lang.Package.getDeclaredAnnotations(Package.java:52)
	at java.lang.Package.getAnnotations(Package.java)
	at java.lang.Package.getAnnotation(Package.java)
	at org.apache.harmony.lang.AnnotatedElementTestFrame.testGetAnnotation_Negative(AnnotatedElementTestFrame.java)
	at java.lang.reflect.VMReflection.invokeMethod(VMReflection.java)
	at java.lang.reflect.Method.invoke(Method.java:382)
	at junit.framework.TestCase.runTest(TestCase.java:164)
	at junit.framework.TestCase.runBare(TestCase.java)
	at junit.framework.TestResult$1.protect(TestResult.java)
	at junit.framework.TestResult.runProtected(TestResult.java)
	at junit.framework.TestResult.run(TestResult.java)
	at junit.framework.TestCase.run(TestCase.java)
	at junit.framework.TestSuite.runTest(TestSuite.java:230)
	at junit.framework.TestSuite.run(TestSuite.java)
	at org.apache.tools.ant.taskdefs.optional.junit.JUnitTestRunner.run(JUnitTestRunner.java)
	at org.apache.tools.ant.taskdefs.optional.junit.JUnitTestRunner.launch(JUnitTestRunner.java:672)
	at org.apache.tools.ant.taskdefs.optional.junit.JUnitTestRunner.main(JUnitTestRunner.java:546)
Test: testGetDeclaredAnnotationsClass: java.lang.Package5Testjava.lang.ClassFormatError: java/lang/pkg1/package-info : if class is interface, no flags except ACC_ABSTRACT or ACC_PUBLIC can be set
	at java.lang.VMClassRegistry.loadBootstrapClass(VMClassRegistry.java)
	at java.lang.Class.forName(Class.java:151)
	at java.lang.Package.getDeclaredAnnotations(Package.java:52)
	at org.apache.harmony.lang.AnnotatedElementTestFrame.testGetDeclaredAnnotations(AnnotatedElementTestFrame.java)
	at java.lang.reflect.VMReflection.invokeMethod(VMReflection.java)
	at java.lang.reflect.Method.invoke(Method.java:382)
	at junit.framework.TestCase.runTest(TestCase.java:164)
	at junit.framework.TestCase.runBare(TestCase.java)
	at junit.framework.TestResult$1.protect(TestResult.java)
	at junit.framework.TestResult.runProtected(TestResult.java)
	at junit.framework.TestResult.run(TestResult.java)
	at junit.framework.TestCase.run(TestCase.java)
	at junit.framework.TestSuite.runTest(TestSuite.java:230)
	at junit.framework.TestSuite.run(TestSuite.java)
	at org.apache.tools.ant.taskdefs.optional.junit.JUnitTestRunner.run(JUnitTestRunner.java)
	at org.apache.tools.ant.taskdefs.optional.junit.JUnitTestRunner.launch(JUnitTestRunner.java:672)
	at org.apache.tools.ant.taskdefs.optional.junit.JUnitTestRunner.main(JUnitTestRunner.java:546)
Test: testGetDeclaredAnnotations2Class: java.lang.Package5Testjava.lang.ClassFormatError: java/lang/pkg2/package-info : if class is interface, no flags except ACC_ABSTRACT or ACC_PUBLIC can be set
	at java.lang.VMClassRegistry.loadBootstrapClass(VMClassRegistry.java)
	at java.lang.Class.forName(Class.java:151)
	at java.lang.Package.getDeclaredAnnotations(Package.java:52)
	at org.apache.harmony.lang.AnnotatedElementTestFrame.testGetDeclaredAnnotations2(AnnotatedElementTestFrame.java)
	at java.lang.reflect.VMReflection.invokeMethod(VMReflection.java)
	at java.lang.reflect.Method.invoke(Method.java:382)
	at junit.framework.TestCase.runTest(TestCase.java:164)
	at junit.framework.TestCase.runBare(TestCase.java)
	at junit.framework.TestResult$1.protect(TestResult.java)
	at junit.framework.TestResult.runProtected(TestResult.java)
	at junit.framework.TestResult.run(TestResult.java)
	at junit.framework.TestCase.run(TestCase.java)
	at junit.framework.TestSuite.runTest(TestSuite.java:230)
	at junit.framework.TestSuite.run(TestSuite.java)
	at org.apache.tools.ant.taskdefs.optional.junit.JUnitTestRunner.run(JUnitTestRunner.java)
	at org.apache.tools.ant.taskdefs.optional.junit.JUnitTestRunner.launch(JUnitTestRunner.java:672)
	at org.apache.tools.ant.taskdefs.optional.junit.JUnitTestRunner.main(JUnitTestRunner.java:546)
Test: testGetDeclaredAnnotationsImmutableClass: java.lang.Package5Testjava.lang.ClassFormatError: java/lang/pkg1/package-info : if class is interface, no flags except ACC_ABSTRACT or ACC_PUBLIC can be set
	at java.lang.VMClassRegistry.loadBootstrapClass(VMClassRegistry.java)
	at java.lang.Class.forName(Class.java:151)
	at java.lang.Package.getDeclaredAnnotations(Package.java:52)
	at org.apache.harmony.lang.AnnotatedElementTestFrame.testGetDeclaredAnnotationsImmutable(AnnotatedElementTestFrame.java)
	at java.lang.reflect.VMReflection.invokeMethod(VMReflection.java)
	at java.lang.reflect.Method.invoke(Method.java:382)
	at junit.framework.TestCase.runTest(TestCase.java:164)
	at junit.framework.TestCase.runBare(TestCase.java)
	at junit.framework.TestResult$1.protect(TestResult.java)
	at junit.framework.TestResult.runProtected(TestResult.java)
	at junit.framework.TestResult.run(TestResult.java)
	at junit.framework.TestCase.run(TestCase.java)
	at junit.framework.TestSuite.runTest(TestSuite.java:230)
	at junit.framework.TestSuite.run(TestSuite.java)
	at org.apache.tools.ant.taskdefs.optional.junit.JUnitTestRunner.run(JUnitTestRunner.java)
	at org.apache.tools.ant.taskdefs.optional.junit.JUnitTestRunner.launch(JUnitTestRunner.java:672)
	at org.apache.tools.ant.taskdefs.optional.junit.JUnitTestRunner.main(JUnitTestRunner.java:546)
Test: testGetAnnotationsClass: java.lang.Package5Testjava.lang.ClassFormatError: java/lang/pkg1/package-info : if class is interface, no flags except ACC_ABSTRACT or ACC_PUBLIC can be set
	at java.lang.VMClassRegistry.loadBootstrapClass(VMClassRegistry.java)
	at java.lang.Class.forName(Class.java:151)
	at java.lang.Package.getDeclaredAnnotations(Package.java:52)
	at java.lang.Package.getAnnotations(Package.java)
	at org.apache.harmony.lang.AnnotatedElementTestFrame.testGetAnnotations(AnnotatedElementTestFrame.java)
	at java.lang.reflect.VMReflection.invokeMethod(VMReflection.java)
	at java.lang.reflect.Method.invoke(Method.java:382)
	at junit.framework.TestCase.runTest(TestCase.java:164)
	at junit.framework.TestCase.runBare(TestCase.java)
	at junit.framework.TestResult$1.protect(TestResult.java)
	at junit.framework.TestResult.runProtected(TestResult.java)
	at junit.framework.TestResult.run(TestResult.java)
	at junit.framework.TestCase.run(TestCase.java)
	at junit.framework.TestSuite.runTest(TestSuite.java:230)
	at junit.framework.TestSuite.run(TestSuite.java)
	at org.apache.tools.ant.taskdefs.optional.junit.JUnitTestRunner.run(JUnitTestRunner.java)
	at org.apache.tools.ant.taskdefs.optional.junit.JUnitTestRunner.launch(JUnitTestRunner.java:672)
	at org.apache.tools.ant.taskdefs.optional.junit.JUnitTestRunner.main(JUnitTestRunner.java:546)
Test: testGetAnnotations2Class: java.lang.Package5Testjava.lang.ClassFormatError: java/lang/pkg2/package-info : if class is interface, no flags except ACC_ABSTRACT or ACC_PUBLIC can be set
	at java.lang.VMClassRegistry.loadBootstrapClass(VMClassRegistry.java)
	at java.lang.Class.forName(Class.java:151)
	at java.lang.Package.getDeclaredAnnotations(Package.java:52)
	at java.lang.Package.getAnnotations(Package.java)
	at org.apache.harmony.lang.AnnotatedElementTestFrame.testGetAnnotations2(AnnotatedElementTestFrame.java)
	at java.lang.reflect.VMReflection.invokeMethod(VMReflection.java)
	at java.lang.reflect.Method.invoke(Method.java:382)
	at junit.framework.TestCase.runTest(TestCase.java:164)
	at junit.framework.TestCase.runBare(TestCase.java)
	at junit.framework.TestResult$1.protect(TestResult.java)
	at junit.framework.TestResult.runProtected(TestResult.java)
	at junit.framework.TestResult.run(TestResult.java)
	at junit.framework.TestCase.run(TestCase.java)
	at junit.framework.TestSuite.runTest(TestSuite.java:230)
	at junit.framework.TestSuite.run(TestSuite.java)
	at org.apache.tools.ant.taskdefs.optional.junit.JUnitTestRunner.run(JUnitTestRunner.java)
	at org.apache.tools.ant.taskdefs.optional.junit.JUnitTestRunner.launch(JUnitTestRunner.java:672)
	at org.apache.tools.ant.taskdefs.optional.junit.JUnitTestRunner.main(JUnitTestRunner.java:546)
Test: testGetAnnotations4Class: java.lang.Package5Testjava.lang.ClassFormatError: java/lang/pkg4/package-info : if class is interface, no flags except ACC_ABSTRACT or ACC_PUBLIC can be set
	at java.lang.VMClassRegistry.loadBootstrapClass(VMClassRegistry.java)
	at java.lang.Class.forName(Class.java:151)
	at java.lang.Package.getDeclaredAnnotations(Package.java:52)
	at java.lang.Package.getAnnotations(Package.java)
	at org.apache.harmony.lang.AnnotatedElementTestFrame.testGetAnnotations4(AnnotatedElementTestFrame.java)
	at java.lang.reflect.VMReflection.invokeMethod(VMReflection.java)
	at java.lang.reflect.Method.invoke(Method.java:382)
	at junit.framework.TestCase.runTest(TestCase.java:164)
	at junit.framework.TestCase.runBare(TestCase.java)
	at junit.framework.TestResult$1.protect(TestResult.java)
	at junit.framework.TestResult.runProtected(TestResult.java)
	at junit.framework.TestResult.run(TestResult.java)
	at junit.framework.TestCase.run(TestCase.java)
	at junit.framework.TestSuite.runTest(TestSuite.java:230)
	at junit.framework.TestSuite.run(TestSuite.java)
	at org.apache.tools.ant.taskdefs.optional.junit.JUnitTestRunner.run(JUnitTestRunner.java)
	at org.apache.tools.ant.taskdefs.optional.junit.JUnitTestRunner.launch(JUnitTestRunner.java:672)
	at org.apache.tools.ant.taskdefs.optional.junit.JUnitTestRunner.main(JUnitTestRunner.java:546)
Test: testGetAnnotations5Class: java.lang.Package5Testjava.lang.ClassFormatError: java/lang/pkg5/package-info : if class is interface, no flags except ACC_ABSTRACT or ACC_PUBLIC can be set
	at java.lang.VMClassRegistry.loadBootstrapClass(VMClassRegistry.java)
	at java.lang.Class.forName(Class.java:151)
	at java.lang.Package.getDeclaredAnnotations(Package.java:52)
	at java.lang.Package.getAnnotations(Package.java)
	at org.apache.harmony.lang.AnnotatedElementTestFrame.testGetAnnotations5(AnnotatedElementTestFrame.java)
	at java.lang.reflect.VMReflection.invokeMethod(VMReflection.java)
	at java.lang.reflect.Method.invoke(Method.java:382)
	at junit.framework.TestCase.runTest(TestCase.java:164)
	at junit.framework.TestCase.runBare(TestCase.java)
	at junit.framework.TestResult$1.protect(TestResult.java)
	at junit.framework.TestResult.runProtected(TestResult.java)
	at junit.framework.TestResult.run(TestResult.java)
	at junit.framework.TestCase.run(TestCase.java)
	at junit.framework.TestSuite.runTest(TestSuite.java:230)
	at junit.framework.TestSuite.run(TestSuite.java)
	at org.apache.tools.ant.taskdefs.optional.junit.JUnitTestRunner.run(JUnitTestRunner.java)
	at org.apache.tools.ant.taskdefs.optional.junit.JUnitTestRunner.launch(JUnitTestRunner.java:672)
	at org.apache.tools.ant.taskdefs.optional.junit.JUnitTestRunner.main(JUnitTestRunner.java:546)
Test: testGetAnnotations6Class: java.lang.Package5Testjava.lang.ClassFormatError: java/lang/pkg6/package-info : if class is interface, no flags except ACC_ABSTRACT or ACC_PUBLIC can be set
	at java.lang.VMClassRegistry.loadBootstrapClass(VMClassRegistry.java)
	at java.lang.Class.forName(Class.java:151)
	at java.lang.Package.getDeclaredAnnotations(Package.java:52)
	at java.lang.Package.getAnnotations(Package.java)
	at org.apache.harmony.lang.AnnotatedElementTestFrame.testGetAnnotations6(AnnotatedElementTestFrame.java)
	at java.lang.reflect.VMReflection.invokeMethod(VMReflection.java)
	at java.lang.reflect.Method.invoke(Method.java:382)
	at junit.framework.TestCase.runTest(TestCase.java:164)
	at junit.framework.TestCase.runBare(TestCase.java)
	at junit.framework.TestResult$1.protect(TestResult.java)
	at junit.framework.TestResult.runProtected(TestResult.java)
	at junit.framework.TestResult.run(TestResult.java)
	at junit.framework.TestCase.run(TestCase.java)
	at junit.framework.TestSuite.runTest(TestSuite.java:230)
	at junit.framework.TestSuite.run(TestSuite.java)
	at org.apache.tools.ant.taskdefs.optional.junit.JUnitTestRunner.run(JUnitTestRunner.java)
	at org.apache.tools.ant.taskdefs.optional.junit.JUnitTestRunner.launch(JUnitTestRunner.java:672)
	at org.apache.tools.ant.taskdefs.optional.junit.JUnitTestRunner.main(JUnitTestRunner.java:546)
Test: testGetAnnotationsImmutableClass: java.lang.Package5Testjava.lang.ClassFormatError: java/lang/pkg1/package-info : if class is interface, no flags except ACC_ABSTRACT or ACC_PUBLIC can be set
	at java.lang.VMClassRegistry.loadBootstrapClass(VMClassRegistry.java)
	at java.lang.Class.forName(Class.java:151)
	at java.lang.Package.getDeclaredAnnotations(Package.java:52)
	at java.lang.Package.getAnnotations(Package.java)
	at org.apache.harmony.lang.AnnotatedElementTestFrame.testGetAnnotationsImmutable(AnnotatedElementTestFrame.java)
	at java.lang.reflect.VMReflection.invokeMethod(VMReflection.java)
	at java.lang.reflect.Method.invoke(Method.java:382)
	at junit.framework.TestCase.runTest(TestCase.java:164)
	at junit.framework.TestCase.runBare(TestCase.java)
	at junit.framework.TestResult$1.protect(TestResult.java)
	at junit.framework.TestResult.runProtected(TestResult.java)
	at junit.framework.TestResult.run(TestResult.java)
	at junit.framework.TestCase.run(TestCase.java)
	at junit.framework.TestSuite.runTest(TestSuite.java:230)
	at junit.framework.TestSuite.run(TestSuite.java)
	at org.apache.tools.ant.taskdefs.optional.junit.JUnitTestRunner.run(JUnitTestRunner.java)
	at org.apache.tools.ant.taskdefs.optional.junit.JUnitTestRunner.launch(JUnitTestRunner.java:672)
	at org.apache.tools.ant.taskdefs.optional.junit.JUnitTestRunner.main(JUnitTestRunner.java:546)
Test: testIsAnnotationPresentClass: java.lang.Package5Testjava.lang.ClassFormatError: java/lang/pkg1/package-info : if class is interface, no flags except ACC_ABSTRACT or ACC_PUBLIC can be set
	at java.lang.VMClassRegistry.loadBootstrapClass(VMClassRegistry.java)
	at java.lang.Class.forName(Class.java:151)
	at java.lang.Package.getDeclaredAnnotations(Package.java:52)
	at java.lang.Package.getAnnotations(Package.java)
	at java.lang.Package.getAnnotation(Package.java)
	at java.lang.Package.isAnnotationPresent(Package.java)
	at org.apache.harmony.lang.AnnotatedElementTestFrame.testIsAnnotationPresent(AnnotatedElementTestFrame.java)
	at java.lang.reflect.VMReflection.invokeMethod(VMReflection.java)
	at java.lang.reflect.Method.invoke(Method.java:382)
	at junit.framework.TestCase.runTest(TestCase.java:164)
	at junit.framework.TestCase.runBare(TestCase.java)
	at junit.framework.TestResult$1.protect(TestResult.java)
	at junit.framework.TestResult.runProtected(TestResult.java)
	at junit.framework.TestResult.run(TestResult.java)
	at junit.framework.TestCase.run(TestCase.java)
	at junit.framework.TestSuite.runTest(TestSuite.java:230)
	at junit.framework.TestSuite.run(TestSuite.java)
	at org.apache.tools.ant.taskdefs.optional.junit.JUnitTestRunner.run(JUnitTestRunner.java)
	at org.apache.tools.ant.taskdefs.optional.junit.JUnitTestRunner.launch(JUnitTestRunner.java:672)
	at org.apache.tools.ant.taskdefs.optional.junit.JUnitTestRunner.main(JUnitTestRunner.java:546)
Test: testIsAnnotationPresent_NegativeClass: java.lang.Package5Testjava.lang.ClassFormatError: java/lang/pkg1/package-info : if class is interface, no flags except ACC_ABSTRACT or ACC_PUBLIC can be set
	at java.lang.VMClassRegistry.loadBootstrapClass(VMClassRegistry.java)
	at java.lang.Class.forName(Class.java:151)
	at java.lang.Package.getDeclaredAnnotations(Package.java:52)
	at java.lang.Package.getAnnotations(Package.java)
	at java.lang.Package.getAnnotation(Package.java)
	at java.lang.Package.isAnnotationPresent(Package.java)
	at org.apache.harmony.lang.AnnotatedElementTestFrame.testIsAnnotationPresent_Negative(AnnotatedElementTestFrame.java)
	at java.lang.reflect.VMReflection.invokeMethod(VMReflection.java)
	at java.lang.reflect.Method.invoke(Method.java:382)
	at junit.framework.TestCase.runTest(TestCase.java:164)
	at junit.framework.TestCase.runBare(TestCase.java)
	at junit.framework.TestResult$1.protect(TestResult.java)
	at junit.framework.TestResult.runProtected(TestResult.java)
	at junit.framework.TestResult.run(TestResult.java)
	at junit.framework.TestCase.run(TestCase.java)
	at junit.framework.TestSuite.runTest(TestSuite.java:230)
	at junit.framework.TestSuite.run(TestSuite.java)
	at org.apache.tools.ant.taskdefs.optional.junit.JUnitTestRunner.run(JUnitTestRunner.java)
	at org.apache.tools.ant.taskdefs.optional.junit.JUnitTestRunner.launch(JUnitTestRunner.java:672)
	at org.apache.tools.ant.taskdefs.optional.junit.JUnitTestRunner.main(JUnitTestRunner.java:546)
Test: testPackageClass: org.apache.harmony.lang.annotation.AnnotationLoaderTestjava.lang.ClassFormatError: org/apache/harmony/lang/test/resource/package-info : if class is interface, no flags except ACC_ABSTRACT or ACC_PUBLIC can be set
	at java.lang.ClassLoader.defineClass0(ClassLoader.java)
	at java.lang.ClassLoader.defineClass(ClassLoader.java:417)
	at java.security.SecureClassLoader.defineClass(SecureClassLoader.java:70)
	at java.net.URLClassLoader.findClassImpl(URLClassLoader.java:1214)
	at java.net.URLClassLoader$4.run(URLClassLoader.java)
	at java.net.URLClassLoader$4.run(URLClassLoader.java)
	at java.security.AccessController.doPrivilegedImpl(AccessController.java)
	at java.security.AccessController.doPrivileged(AccessController.java:64)
	at java.net.URLClassLoader.findClass(URLClassLoader.java:622)
	at java.lang.ClassLoader.loadClass(ClassLoader.java)
	at java.net.URLClassLoader$SubURLClassLoader.loadClass(URLClassLoader.java:129)
	at java.lang.ClassLoader.loadClass(ClassLoader.java)
	at java.lang.Class.forName(Class.java)
	at java.lang.Package.getDeclaredAnnotations(Package.java:52)
	at java.lang.Package.getAnnotations(Package.java)
	at org.apache.harmony.lang.annotation.AnnotationLoaderTest.testPackage(AnnotationLoaderTest.java)
	at java.lang.reflect.VMReflection.invokeMethod(VMReflection.java)
	at java.lang.reflect.Method.invoke(Method.java:382)
	at junit.framework.TestCase.runTest(TestCase.java:164)
	at junit.framework.TestCase.runBare(TestCase.java)
	at junit.framework.TestResult$1.protect(TestResult.java)
	at junit.framework.TestResult.runProtected(TestResult.java)
	at junit.framework.TestResult.run(TestResult.java)
	at junit.framework.TestCase.run(TestCase.java)
	at junit.framework.TestSuite.runTest(TestSuite.java:230)
	at junit.framework.TestSuite.run(TestSuite.java)
	at org.apache.tools.ant.taskdefs.optional.junit.JUnitTestRunner.run(JUnitTestRunner.java)
	at org.apache.tools.ant.taskdefs.optional.junit.JUnitTestRunner.launch(JUnitTestRunner.java:672)
	at org.apache.tools.ant.taskdefs.optional.junit.JUnitTestRunner.main(JUnitTestRunner.java:546)
Test: testNoInheritanceClass: java.lang.Package5Testjava.lang.ClassFormatError: java/lang/pkg3/package-info : if class is interface, no flags except ACC_ABSTRACT or ACC_PUBLIC can be set
	at java.lang.VMClassRegistry.loadBootstrapClass(VMClassRegistry.java)
	at java.lang.Class.forName(Class.java:151)
	at java.lang.Package.getDeclaredAnnotations(Package.java:52)
	at java.lang.Package.getAnnotations(Package.java)
	at java.lang.Package5Test.testNoInheritance(Package5Test.java)
	at java.lang.reflect.VMReflection.invokeMethod(VMReflection.java)
	at java.lang.reflect.Method.invoke(Method.java:382)
	at junit.framework.TestCase.runTest(TestCase.java:164)
	at junit.framework.TestCase.runBare(TestCase.java)
	at junit.framework.TestResult$1.protect(TestResult.java)
	at junit.framework.TestResult.runProtected(TestResult.java)
	at junit.framework.TestResult.run(TestResult.java)
	at junit.framework.TestCase.run(TestCase.java)
	at junit.framework.TestSuite.runTest(TestSuite.java)
	at junit.framework.TestSuite.run(TestSuite.java)
	at org.apache.tools.ant.taskdefs.optional.junit.JUnitTestRunner.run(JUnitTestRunner.java)
	at org.apache.tools.ant.taskdefs.optional.junit.JUnitTestRunner.launch(JUnitTestRunner.java:672)
	at org.apache.tools.ant.taskdefs.optional.junit.JUnitTestRunner.main(JUnitTestRunner.java:546)
Test: testGetAnnotationClass: java.lang.Package5Testjava.lang.ClassFormatError: java/lang/pkg1/package-info : if class is interface, no flags except ACC_ABSTRACT or ACC_PUBLIC can be set
	at java.lang.VMClassRegistry.loadBootstrapClass(VMClassRegistry.java)
	at java.lang.Class.forName(Class.java:151)
	at java.lang.Package.getDeclaredAnnotations(Package.java:52)
	at java.lang.Package.getAnnotations(Package.java)
	at java.lang.Package.getAnnotation(Package.java)
	at org.apache.harmony.lang.AnnotatedElementTestFrame.testGetAnnotation(AnnotatedElementTestFrame.java)
	at java.lang.reflect.VMReflection.invokeMethod(VMReflection.java)
	at java.lang.reflect.Method.invoke(Method.java:382)
	at junit.framework.TestCase.runTest(TestCase.java:164)
	at junit.framework.TestCase.runBare(TestCase.java)
	at junit.framework.TestResult$1.protect(TestResult.java)
	at junit.framework.TestResult.runProtected(TestResult.java)
	at junit.framework.TestResult.run(TestResult.java)
	at junit.framework.TestCase.run(TestCase.java)
	at junit.framework.TestSuite.runTest(TestSuite.java)
	at junit.framework.TestSuite.run(TestSuite.java)
	at org.apache.tools.ant.taskdefs.optional.junit.JUnitTestRunner.run(JUnitTestRunner.java)
	at org.apache.tools.ant.taskdefs.optional.junit.JUnitTestRunner.launch(JUnitTestRunner.java:672)
	at org.apache.tools.ant.taskdefs.optional.junit.JUnitTestRunner.main(JUnitTestRunner.java:546)
Test: testGetAnnotation2Class: java.lang.Package5Testjava.lang.ClassFormatError: java/lang/pkg2/package-info : if class is interface, no flags except ACC_ABSTRACT or ACC_PUBLIC can be set
	at java.lang.VMClassRegistry.loadBootstrapClass(VMClassRegistry.java)
	at java.lang.Class.forName(Class.java:151)
	at java.lang.Package.getDeclaredAnnotations(Package.java:52)
	at java.lang.Package.getAnnotations(Package.java)
	at java.lang.Package.getAnnotation(Package.java)
	at org.apache.harmony.lang.AnnotatedElementTestFrame.testGetAnnotation2(AnnotatedElementTestFrame.java)
	at java.lang.reflect.VMReflection.invokeMethod(VMReflection.java)
	at java.lang.reflect.Method.invoke(Method.java:382)
	at junit.framework.TestCase.runTest(TestCase.java:164)
	at junit.framework.TestCase.runBare(TestCase.java)
	at junit.framework.TestResult$1.protect(TestResult.java)
	at junit.framework.TestResult.runProtected(TestResult.java)
	at junit.framework.TestResult.run(TestResult.java)
	at junit.framework.TestCase.run(TestCase.java)
	at junit.framework.TestSuite.runTest(TestSuite.java)
	at junit.framework.TestSuite.run(TestSuite.java)
	at org.apache.tools.ant.taskdefs.optional.junit.JUnitTestRunner.run(JUnitTestRunner.java)
	at org.apache.tools.ant.taskdefs.optional.junit.JUnitTestRunner.launch(JUnitTestRunner.java:672)
	at org.apache.tools.ant.taskdefs.optional.junit.JUnitTestRunner.main(JUnitTestRunner.java:546)
Test: testGetAnnotation_NegativeClass: java.lang.Package5Testjava.lang.ClassFormatError: java/lang/pkg2/package-info : if class is interface, no flags except ACC_ABSTRACT or ACC_PUBLIC can be set
	at java.lang.VMClassRegistry.loadBootstrapClass(VMClassRegistry.java)
	at java.lang.Class.forName(Class.java:151)
	at java.lang.Package.getDeclaredAnnotations(Package.java:52)
	at java.lang.Package.getAnnotations(Package.java)
	at java.lang.Package.getAnnotation(Package.java)
	at org.apache.harmony.lang.AnnotatedElementTestFrame.testGetAnnotation_Negative(AnnotatedElementTestFrame.java)
	at java.lang.reflect.VMReflection.invokeMethod(VMReflection.java)
	at java.lang.reflect.Method.invoke(Method.java:382)
	at junit.framework.TestCase.runTest(TestCase.java:164)
	at junit.framework.TestCase.runBare(TestCase.java)
	at junit.framework.TestResult$1.protect(TestResult.java)
	at junit.framework.TestResult.runProtected(TestResult.java)
	at junit.framework.TestResult.run(TestResult.java)
	at junit.framework.TestCase.run(TestCase.java)
	at junit.framework.TestSuite.runTest(TestSuite.java)
	at junit.framework.TestSuite.run(TestSuite.java)
	at org.apache.tools.ant.taskdefs.optional.junit.JUnitTestRunner.run(JUnitTestRunner.java)
	at org.apache.tools.ant.taskdefs.optional.junit.JUnitTestRunner.launch(JUnitTestRunner.java:672)
	at org.apache.tools.ant.taskdefs.optional.junit.JUnitTestRunner.main(JUnitTestRunner.java:546)
Test: testGetDeclaredAnnotationsClass: java.lang.Package5Testjava.lang.ClassFormatError: java/lang/pkg1/package-info : if class is interface, no flags except ACC_ABSTRACT or ACC_PUBLIC can be set
	at java.lang.VMClassRegistry.loadBootstrapClass(VMClassRegistry.java)
	at java.lang.Class.forName(Class.java:151)
	at java.lang.Package.getDeclaredAnnotations(Package.java:52)
	at org.apache.harmony.lang.AnnotatedElementTestFrame.testGetDeclaredAnnotations(AnnotatedElementTestFrame.java)
	at java.lang.reflect.VMReflection.invokeMethod(VMReflection.java)
	at java.lang.reflect.Method.invoke(Method.java:382)
	at junit.framework.TestCase.runTest(TestCase.java:164)
	at junit.framework.TestCase.runBare(TestCase.java)
	at junit.framework.TestResult$1.protect(TestResult.java)
	at junit.framework.TestResult.runProtected(TestResult.java)
	at junit.framework.TestResult.run(TestResult.java)
	at junit.framework.TestCase.run(TestCase.java)
	at junit.framework.TestSuite.runTest(TestSuite.java)
	at junit.framework.TestSuite.run(TestSuite.java)
	at org.apache.tools.ant.taskdefs.optional.junit.JUnitTestRunner.run(JUnitTestRunner.java)
	at org.apache.tools.ant.taskdefs.optional.junit.JUnitTestRunner.launch(JUnitTestRunner.java:672)
	at org.apache.tools.ant.taskdefs.optional.junit.JUnitTestRunner.main(JUnitTestRunner.java:546)
Test: testGetDeclaredAnnotations2Class: java.lang.Package5Testjava.lang.ClassFormatError: java/lang/pkg2/package-info : if class is interface, no flags except ACC_ABSTRACT or ACC_PUBLIC can be set
	at java.lang.VMClassRegistry.loadBootstrapClass(VMClassRegistry.java)
	at java.lang.Class.forName(Class.java:151)
	at java.lang.Package.getDeclaredAnnotations(Package.java:52)
	at org.apache.harmony.lang.AnnotatedElementTestFrame.testGetDeclaredAnnotations2(AnnotatedElementTestFrame.java)
	at java.lang.reflect.VMReflection.invokeMethod(VMReflection.java)
	at java.lang.reflect.Method.invoke(Method.java:382)
	at junit.framework.TestCase.runTest(TestCase.java:164)
	at junit.framework.TestCase.runBare(TestCase.java)
	at junit.framework.TestResult$1.protect(TestResult.java)
	at junit.framework.TestResult.runProtected(TestResult.java)
	at junit.framework.TestResult.run(TestResult.java)
	at junit.framework.TestCase.run(TestCase.java)
	at junit.framework.TestSuite.runTest(TestSuite.java)
	at junit.framework.TestSuite.run(TestSuite.java)
	at org.apache.tools.ant.taskdefs.optional.junit.JUnitTestRunner.run(JUnitTestRunner.java)
	at org.apache.tools.ant.taskdefs.optional.junit.JUnitTestRunner.launch(JUnitTestRunner.java:672)
	at org.apache.tools.ant.taskdefs.optional.junit.JUnitTestRunner.main(JUnitTestRunner.java:546)
Test: testGetDeclaredAnnotationsImmutableClass: java.lang.Package5Testjava.lang.ClassFormatError: java/lang/pkg1/package-info : if class is interface, no flags except ACC_ABSTRACT or ACC_PUBLIC can be set
	at java.lang.VMClassRegistry.loadBootstrapClass(VMClassRegistry.java)
	at java.lang.Class.forName(Class.java:151)
	at java.lang.Package.getDeclaredAnnotations(Package.java:52)
	at org.apache.harmony.lang.AnnotatedElementTestFrame.testGetDeclaredAnnotationsImmutable(AnnotatedElementTestFrame.java)
	at java.lang.reflect.VMReflection.invokeMethod(VMReflection.java)
	at java.lang.reflect.Method.invoke(Method.java:382)
	at junit.framework.TestCase.runTest(TestCase.java:164)
	at junit.framework.TestCase.runBare(TestCase.java)
	at junit.framework.TestResult$1.protect(TestResult.java)
	at junit.framework.TestResult.runProtected(TestResult.java)
	at junit.framework.TestResult.run(TestResult.java)
	at junit.framework.TestCase.run(TestCase.java)
	at junit.framework.TestSuite.runTest(TestSuite.java)
	at junit.framework.TestSuite.run(TestSuite.java)
	at org.apache.tools.ant.taskdefs.optional.junit.JUnitTestRunner.run(JUnitTestRunner.java)
	at org.apache.tools.ant.taskdefs.optional.junit.JUnitTestRunner.launch(JUnitTestRunner.java:672)
	at org.apache.tools.ant.taskdefs.optional.junit.JUnitTestRunner.main(JUnitTestRunner.java:546)
Test: testGetAnnotationsClass: java.lang.Package5Testjava.lang.ClassFormatError: java/lang/pkg1/package-info : if class is interface, no flags except ACC_ABSTRACT or ACC_PUBLIC can be set
	at java.lang.VMClassRegistry.loadBootstrapClass(VMClassRegistry.java)
	at java.lang.Class.forName(Class.java:151)
	at java.lang.Package.getDeclaredAnnotations(Package.java:52)
	at java.lang.Package.getAnnotations(Package.java)
	at org.apache.harmony.lang.AnnotatedElementTestFrame.testGetAnnotations(AnnotatedElementTestFrame.java)
	at java.lang.reflect.VMReflection.invokeMethod(VMReflection.java)
	at java.lang.reflect.Method.invoke(Method.java:382)
	at junit.framework.TestCase.runTest(TestCase.java:164)
	at junit.framework.TestCase.runBare(TestCase.java)
	at junit.framework.TestResult$1.protect(TestResult.java)
	at junit.framework.TestResult.runProtected(TestResult.java)
	at junit.framework.TestResult.run(TestResult.java)
	at junit.framework.TestCase.run(TestCase.java)
	at junit.framework.TestSuite.runTest(TestSuite.java)
	at junit.framework.TestSuite.run(TestSuite.java)
	at org.apache.tools.ant.taskdefs.optional.junit.JUnitTestRunner.run(JUnitTestRunner.java)
	at org.apache.tools.ant.taskdefs.optional.junit.JUnitTestRunner.launch(JUnitTestRunner.java:672)
	at org.apache.tools.ant.taskdefs.optional.junit.JUnitTestRunner.main(JUnitTestRunner.java:546)
Test: testGetAnnotations2Class: java.lang.Package5Testjava.lang.ClassFormatError: java/lang/pkg2/package-info : if class is interface, no flags except ACC_ABSTRACT or ACC_PUBLIC can be set
	at java.lang.VMClassRegistry.loadBootstrapClass(VMClassRegistry.java)
	at java.lang.Class.forName(Class.java:151)
	at java.lang.Package.getDeclaredAnnotations(Package.java:52)
	at java.lang.Package.getAnnotations(Package.java)
	at org.apache.harmony.lang.AnnotatedElementTestFrame.testGetAnnotations2(AnnotatedElementTestFrame.java)
	at java.lang.reflect.VMReflection.invokeMethod(VMReflection.java)
	at java.lang.reflect.Method.invoke(Method.java:382)
	at junit.framework.TestCase.runTest(TestCase.java:164)
	at junit.framework.TestCase.runBare(TestCase.java)
	at junit.framework.TestResult$1.protect(TestResult.java)
	at junit.framework.TestResult.runProtected(TestResult.java)
	at junit.framework.TestResult.run(TestResult.java)
	at junit.framework.TestCase.run(TestCase.java)
	at junit.framework.TestSuite.runTest(TestSuite.java)
	at junit.framework.TestSuite.run(TestSuite.java)
	at org.apache.tools.ant.taskdefs.optional.junit.JUnitTestRunner.run(JUnitTestRunner.java)
	at org.apache.tools.ant.taskdefs.optional.junit.JUnitTestRunner.launch(JUnitTestRunner.java:672)
	at org.apache.tools.ant.taskdefs.optional.junit.JUnitTestRunner.main(JUnitTestRunner.java:546)
Test: testGetAnnotations4Class: java.lang.Package5Testjava.lang.ClassFormatError: java/lang/pkg4/package-info : if class is interface, no flags except ACC_ABSTRACT or ACC_PUBLIC can be set
	at java.lang.VMClassRegistry.loadBootstrapClass(VMClassRegistry.java)
	at java.lang.Class.forName(Class.java:151)
	at java.lang.Package.getDeclaredAnnotations(Package.java:52)
	at java.lang.Package.getAnnotations(Package.java)
	at org.apache.harmony.lang.AnnotatedElementTestFrame.testGetAnnotations4(AnnotatedElementTestFrame.java)
	at java.lang.reflect.VMReflection.invokeMethod(VMReflection.java)
	at java.lang.reflect.Method.invoke(Method.java:382)
	at junit.framework.TestCase.runTest(TestCase.java:164)
	at junit.framework.TestCase.runBare(TestCase.java)
	at junit.framework.TestResult$1.protect(TestResult.java)
	at junit.framework.TestResult.runProtected(TestResult.java)
	at junit.framework.TestResult.run(TestResult.java)
	at junit.framework.TestCase.run(TestCase.java)
	at junit.framework.TestSuite.runTest(TestSuite.java)
	at junit.framework.TestSuite.run(TestSuite.java)
	at org.apache.tools.ant.taskdefs.optional.junit.JUnitTestRunner.run(JUnitTestRunner.java)
	at org.apache.tools.ant.taskdefs.optional.junit.JUnitTestRunner.launch(JUnitTestRunner.java:672)
	at org.apache.tools.ant.taskdefs.optional.junit.JUnitTestRunner.main(JUnitTestRunner.java:546)
Test: testGetAnnotations5Class: java.lang.Package5Testjava.lang.ClassFormatError: java/lang/pkg5/package-info : if class is interface, no flags except ACC_ABSTRACT or ACC_PUBLIC can be set
	at java.lang.VMClassRegistry.loadBootstrapClass(VMClassRegistry.java)
	at java.lang.Class.forName(Class.java:151)
	at java.lang.Package.getDeclaredAnnotations(Package.java:52)
	at java.lang.Package.getAnnotations(Package.java)
	at org.apache.harmony.lang.AnnotatedElementTestFrame.testGetAnnotations5(AnnotatedElementTestFrame.java)
	at java.lang.reflect.VMReflection.invokeMethod(VMReflection.java)
	at java.lang.reflect.Method.invoke(Method.java:382)
	at junit.framework.TestCase.runTest(TestCase.java:164)
	at junit.framework.TestCase.runBare(TestCase.java)
	at junit.framework.TestResult$1.protect(TestResult.java)
	at junit.framework.TestResult.runProtected(TestResult.java)
	at junit.framework.TestResult.run(TestResult.java)
	at junit.framework.TestCase.run(TestCase.java)
	at junit.framework.TestSuite.runTest(TestSuite.java)
	at junit.framework.TestSuite.run(TestSuite.java)
	at org.apache.tools.ant.taskdefs.optional.junit.JUnitTestRunner.run(JUnitTestRunner.java)
	at org.apache.tools.ant.taskdefs.optional.junit.JUnitTestRunner.launch(JUnitTestRunner.java:672)
	at org.apache.tools.ant.taskdefs.optional.junit.JUnitTestRunner.main(JUnitTestRunner.java:546)
Test: testGetAnnotations6Class: java.lang.Package5Testjava.lang.ClassFormatError: java/lang/pkg6/package-info : if class is interface, no flags except ACC_ABSTRACT or ACC_PUBLIC can be set
	at java.lang.VMClassRegistry.loadBootstrapClass(VMClassRegistry.java)
	at java.lang.Class.forName(Class.java:151)
	at java.lang.Package.getDeclaredAnnotations(Package.java:52)
	at java.lang.Package.getAnnotations(Package.java)
	at org.apache.harmony.lang.AnnotatedElementTestFrame.testGetAnnotations6(AnnotatedElementTestFrame.java)
	at java.lang.reflect.VMReflection.invokeMethod(VMReflection.java)
	at java.lang.reflect.Method.invoke(Method.java:382)
	at junit.framework.TestCase.runTest(TestCase.java:164)
	at junit.framework.TestCase.runBare(TestCase.java)
	at junit.framework.TestResult$1.protect(TestResult.java)
	at junit.framework.TestResult.runProtected(TestResult.java)
	at junit.framework.TestResult.run(TestResult.java)
	at junit.framework.TestCase.run(TestCase.java)
	at junit.framework.TestSuite.runTest(TestSuite.java)
	at junit.framework.TestSuite.run(TestSuite.java)
	at org.apache.tools.ant.taskdefs.optional.junit.JUnitTestRunner.run(JUnitTestRunner.java)
	at org.apache.tools.ant.taskdefs.optional.junit.JUnitTestRunner.launch(JUnitTestRunner.java:672)
	at org.apache.tools.ant.taskdefs.optional.junit.JUnitTestRunner.main(JUnitTestRunner.java:546)
Test: testGetAnnotationsImmutableClass: java.lang.Package5Testjava.lang.ClassFormatError: java/lang/pkg1/package-info : if class is interface, no flags except ACC_ABSTRACT or ACC_PUBLIC can be set
	at java.lang.VMClassRegistry.loadBootstrapClass(VMClassRegistry.java)
	at java.lang.Class.forName(Class.java:151)
	at java.lang.Package.getDeclaredAnnotations(Package.java:52)
	at java.lang.Package.getAnnotations(Package.java)
	at org.apache.harmony.lang.AnnotatedElementTestFrame.testGetAnnotationsImmutable(AnnotatedElementTestFrame.java)
	at java.lang.reflect.VMReflection.invokeMethod(VMReflection.java)
	at java.lang.reflect.Method.invoke(Method.java:382)
	at junit.framework.TestCase.runTest(TestCase.java:164)
	at junit.framework.TestCase.runBare(TestCase.java)
	at junit.framework.TestResult$1.protect(TestResult.java)
	at junit.framework.TestResult.runProtected(TestResult.java)
	at junit.framework.TestResult.run(TestResult.java)
	at junit.framework.TestCase.run(TestCase.java)
	at junit.framework.TestSuite.runTest(TestSuite.java)
	at junit.framework.TestSuite.run(TestSuite.java)
	at org.apache.tools.ant.taskdefs.optional.junit.JUnitTestRunner.run(JUnitTestRunner.java)
	at org.apache.tools.ant.taskdefs.optional.junit.JUnitTestRunner.launch(JUnitTestRunner.java:672)
	at org.apache.tools.ant.taskdefs.optional.junit.JUnitTestRunner.main(JUnitTestRunner.java:546)
Test: testIsAnnotationPresentClass: java.lang.Package5Testjava.lang.ClassFormatError: java/lang/pkg1/package-info : if class is interface, no flags except ACC_ABSTRACT or ACC_PUBLIC can be set
	at java.lang.VMClassRegistry.loadBootstrapClass(VMClassRegistry.java)
	at java.lang.Class.forName(Class.java:151)
	at java.lang.Package.getDeclaredAnnotations(Package.java:52)
	at java.lang.Package.getAnnotations(Package.java)
	at java.lang.Package.getAnnotation(Package.java)
	at java.lang.Package.isAnnotationPresent(Package.java)
	at org.apache.harmony.lang.AnnotatedElementTestFrame.testIsAnnotationPresent(AnnotatedElementTestFrame.java)
	at java.lang.reflect.VMReflection.invokeMethod(VMReflection.java)
	at java.lang.reflect.Method.invoke(Method.java:382)
	at junit.framework.TestCase.runTest(TestCase.java:164)
	at junit.framework.TestCase.runBare(TestCase.java)
	at junit.framework.TestResult$1.protect(TestResult.java)
	at junit.framework.TestResult.runProtected(TestResult.java)
	at junit.framework.TestResult.run(TestResult.java)
	at junit.framework.TestCase.run(TestCase.java)
	at junit.framework.TestSuite.runTest(TestSuite.java)
	at junit.framework.TestSuite.run(TestSuite.java)
	at org.apache.tools.ant.taskdefs.optional.junit.JUnitTestRunner.run(JUnitTestRunner.java)
	at org.apache.tools.ant.taskdefs.optional.junit.JUnitTestRunner.launch(JUnitTestRunner.java:672)
	at org.apache.tools.ant.taskdefs.optional.junit.JUnitTestRunner.main(JUnitTestRunner.java:546)
Test: testIsAnnotationPresent_NegativeClass: java.lang.Package5Testjava.lang.ClassFormatError: java/lang/pkg1/package-info : if class is interface, no flags except ACC_ABSTRACT or ACC_PUBLIC can be set
	at java.lang.VMClassRegistry.loadBootstrapClass(VMClassRegistry.java)
	at java.lang.Class.forName(Class.java:151)
	at java.lang.Package.getDeclaredAnnotations(Package.java:52)
	at java.lang.Package.getAnnotations(Package.java)
	at java.lang.Package.getAnnotation(Package.java)
	at java.lang.Package.isAnnotationPresent(Package.java)
	at org.apache.harmony.lang.AnnotatedElementTestFrame.testIsAnnotationPresent_Negative(AnnotatedElementTestFrame.java)
	at java.lang.reflect.VMReflection.invokeMethod(VMReflection.java)
	at java.lang.reflect.Method.invoke(Method.java:382)
	at junit.framework.TestCase.runTest(TestCase.java:164)
	at junit.framework.TestCase.runBare(TestCase.java)
	at junit.framework.TestResult$1.protect(TestResult.java)
	at junit.framework.TestResult.runProtected(TestResult.java)
	at junit.framework.TestResult.run(TestResult.java)
	at junit.framework.TestCase.run(TestCase.java)
	at junit.framework.TestSuite.runTest(TestSuite.java)
	at junit.framework.TestSuite.run(TestSuite.java)
	at org.apache.tools.ant.taskdefs.optional.junit.JUnitTestRunner.run(JUnitTestRunner.java)
	at org.apache.tools.ant.taskdefs.optional.junit.JUnitTestRunner.launch(JUnitTestRunner.java:672)
	at org.apache.tools.ant.taskdefs.optional.junit.JUnitTestRunner.main(JUnitTestRunner.java:546)
Test: testPackageClass: org.apache.harmony.lang.annotation.AnnotationLoaderTestjava.lang.ClassFormatError: org/apache/harmony/lang/test/resource/package-info : if class is interface, no flags except ACC_ABSTRACT or ACC_PUBLIC can be set
	at java.lang.ClassLoader.defineClass0(ClassLoader.java)
	at java.lang.ClassLoader.defineClass(ClassLoader.java:417)
	at java.security.SecureClassLoader.defineClass(SecureClassLoader.java:70)
	at java.net.URLClassLoader.findClassImpl(URLClassLoader.java:1214)
	at java.net.URLClassLoader$4.run(URLClassLoader.java)
	at java.net.URLClassLoader$4.run(URLClassLoader.java)
	at java.security.AccessController.doPrivilegedImpl(AccessController.java)
	at java.security.AccessController.doPrivileged(AccessController.java:64)
	at java.net.URLClassLoader.findClass(URLClassLoader.java:622)
	at java.lang.ClassLoader.loadClass(ClassLoader.java)
	at java.net.URLClassLoader$SubURLClassLoader.loadClass(URLClassLoader.java:129)
	at java.lang.ClassLoader.loadClass(ClassLoader.java)
	at java.lang.Class.forName(Class.java)
	at java.lang.Package.getDeclaredAnnotations(Package.java:52)
	at java.lang.Package.getAnnotations(Package.java)
	at org.apache.harmony.lang.annotation.AnnotationLoaderTest.testPackage(AnnotationLoaderTest.java)
	at java.lang.reflect.VMReflection.invokeMethod(VMReflection.java)
	at java.lang.reflect.Method.invoke(Method.java:382)
	at junit.framework.TestCase.runTest(TestCase.java:164)
	at junit.framework.TestCase.runBare(TestCase.java)
	at junit.framework.TestResult$1.protect(TestResult.java)
	at junit.framework.TestResult.runProtected(TestResult.java)
	at junit.framework.TestResult.run(TestResult.java)
	at junit.framework.TestCase.run(TestCase.java)
	at junit.framework.TestSuite.runTest(TestSuite.java)
	at junit.framework.TestSuite.run(TestSuite.java)
	at org.apache.tools.ant.taskdefs.optional.junit.JUnitTestRunner.run(JUnitTestRunner.java)
	at org.apache.tools.ant.taskdefs.optional.junit.JUnitTestRunner.launch(JUnitTestRunner.java:672)
	at org.apache.tools.ant.taskdefs.optional.junit.JUnitTestRunner.main(JUnitTestRunner.java:546)
Test: test_exec_StrClass: java.lang.RuntimeTest2junit.framework.AssertionFailedError: check001: the date's reply has not been received
	at junit.framework.Assert.fail(Assert.java:47)
	at java.lang.RuntimeTest2.exec_StrForWindows(RuntimeTest2.java:295)
	at java.lang.RuntimeTest2.test_exec_Str(RuntimeTest2.java:362)
	at java.lang.reflect.VMReflection.invokeMethod(VMReflection.java)
	at java.lang.reflect.Method.invoke(Method.java:382)
	at junit.framework.TestCase.runTest(TestCase.java:164)
	at junit.framework.TestCase.runBare(TestCase.java:130)
	at junit.framework.TestResult$1.protect(TestResult.java:106)
	at junit.framework.TestResult.runProtected(TestResult.java:124)
	at junit.framework.TestResult.run(TestResult.java:109)
	at junit.framework.TestCase.run(TestCase.java:120)
	at junit.framework.TestSuite.runTest(TestSuite.java:230)
	at junit.framework.TestSuite.run(TestSuite.java:225)
	at org.apache.tools.ant.taskdefs.optional.junit.JUnitTestRunner.run(JUnitTestRunner.java:297)
	at org.apache.tools.ant.taskdefs.optional.junit.JUnitTestRunner.launch(JUnitTestRunner.java:672)
	at org.apache.tools.ant.taskdefs.optional.junit.JUnitTestRunner.main(JUnitTestRunner.java:546)
Test: test_exec_StrClass: java.lang.RuntimeTest2junit.framework.AssertionFailedError: check001: the date's reply has not been received
	at junit.framework.Assert.fail(Assert.java:47)
	at java.lang.RuntimeTest2.exec_StrForWindows(RuntimeTest2.java:295)
	at java.lang.RuntimeTest2.test_exec_Str(RuntimeTest2.java:362)
	at java.lang.reflect.VMReflection.invokeMethod(VMReflection.java)
	at java.lang.reflect.Method.invoke(Method.java:382)
	at junit.framework.TestCase.runTest(TestCase.java:164)
	at junit.framework.TestCase.runBare(TestCase.java:130)
	at junit.framework.TestResult$1.protect(TestResult.java:106)
	at junit.framework.TestResult.runProtected(TestResult.java:124)
	at junit.framework.TestResult.run(TestResult.java:109)
	at junit.framework.TestCase.run(TestCase.java:120)
	at junit.framework.TestSuite.runTest(TestSuite.java:230)
	at junit.framework.TestSuite.run(TestSuite.java:225)
	at org.apache.tools.ant.taskdefs.optional.junit.JUnitTestRunner.run(JUnitTestRunner.java:297)
	at org.apache.tools.ant.taskdefs.optional.junit.JUnitTestRunner.launch(JUnitTestRunner.java:672)
	at org.apache.tools.ant.taskdefs.optional.junit.JUnitTestRunner.main(JUnitTestRunner.java:546)
Test: test_exec_StrClass: java.lang.RuntimeTest2junit.framework.AssertionFailedError: check001: the date's reply has not been received
	at junit.framework.Assert.fail(Assert.java:47)
	at java.lang.RuntimeTest2.exec_StrForWindows(RuntimeTest2.java:295)
	at java.lang.RuntimeTest2.test_exec_Str(RuntimeTest2.java:362)
	at java.lang.reflect.VMReflection.invokeMethod(VMReflection.java)
	at java.lang.reflect.Method.invoke(Method.java:382)
	at junit.framework.TestCase.runTest(TestCase.java:164)
	at junit.framework.TestCase.runBare(TestCase.java)
	at junit.framework.TestResult$1.protect(TestResult.java)
	at junit.framework.TestResult.runProtected(TestResult.java)
	at junit.framework.TestResult.run(TestResult.java)
	at junit.framework.TestCase.run(TestCase.java)
	at junit.framework.TestSuite.runTest(TestSuite.java:230)
	at junit.framework.TestSuite.run(TestSuite.java)
	at org.apache.tools.ant.taskdefs.optional.junit.JUnitTestRunner.run(JUnitTestRunner.java)
	at org.apache.tools.ant.taskdefs.optional.junit.JUnitTestRunner.launch(JUnitTestRunner.java:672)
	at org.apache.tools.ant.taskdefs.optional.junit.JUnitTestRunner.main(JUnitTestRunner.java:546)
Test: test_exec_StrClass: java.lang.RuntimeTest2junit.framework.AssertionFailedError: check001: the date's reply has not been received
	at junit.framework.Assert.fail(Assert.java:47)
	at java.lang.RuntimeTest2.exec_StrForWindows(RuntimeTest2.java:295)
	at java.lang.RuntimeTest2.test_exec_Str(RuntimeTest2.java:362)
	at java.lang.reflect.VMReflection.invokeMethod(VMReflection.java)
	at java.lang.reflect.Method.invoke(Method.java:382)
	at junit.framework.TestCase.runTest(TestCase.java:164)
	at junit.framework.TestCase.runBare(TestCase.java)
	at junit.framework.TestResult$1.protect(TestResult.java)
	at junit.framework.TestResult.runProtected(TestResult.java)
	at junit.framework.TestResult.run(TestResult.java)
	at junit.framework.TestCase.run(TestCase.java)
	at junit.framework.TestSuite.runTest(TestSuite.java)
	at junit.framework.TestSuite.run(TestSuite.java)
	at org.apache.tools.ant.taskdefs.optional.junit.JUnitTestRunner.run(JUnitTestRunner.java)
	at org.apache.tools.ant.taskdefs.optional.junit.JUnitTestRunner.launch(JUnitTestRunner.java:672)
	at org.apache.tools.ant.taskdefs.optional.junit.JUnitTestRunner.main(JUnitTestRunner.java:546)

***********************************************************
Modifications since last successful build:	(161)
            
add cc-drlvm log20070518153036Lbuild.7 05/18/2007 15:30:36drlvm
modified hindessm  /harmony/enhanced/drlvm/trunk/build/make/setup.xml 05/18/2007 15:16:07 Fixing linux to unix and adding macosx.
modified hindessm  /harmony/enhanced/drlvm/trunk/build/make/targets/ehwa.test.xml 05/18/2007 15:16:07 Fixing linux to unix and adding macosx.
modified hindessm  /harmony/enhanced/drlvm/trunk/build/make/build.xml 05/18/2007 13:44:54 Fixing linux to unix.
modified gshimansky  /harmony/enhanced/drlvm/trunk/vm/vmcore/src/verifier/Verifier.cpp 05/18/2007 11:27:19 Applied HARMONY-3720 [drlvm][verifier] VerifyError: 'Data flow analysis error' is reported for class in AXIS2 server binary distribution
modified gshimansky  /harmony/enhanced/drlvm/trunk/vm/vmcore/src/verifier/ver_subroutine.cpp 05/18/2007 11:27:19 Applied HARMONY-3720 [drlvm][verifier] VerifyError: 'Data flow analysis error' is reported for class in AXIS2 server binary distribution
modified gshimansky  /harmony/enhanced/drlvm/trunk/vm/vmcore/src/verifier/ver_utils.cpp 05/18/2007 11:27:19 Applied HARMONY-3720 [drlvm][verifier] VerifyError: 'Data flow analysis error' is reported for class in AXIS2 server binary distribution
modified gshimansky  /harmony/enhanced/drlvm/trunk/vm/vmcore/src/verifier/ver_dataflow.cpp 05/18/2007 11:27:19 Applied HARMONY-3720 [drlvm][verifier] VerifyError: 'Data flow analysis error' is reported for class in AXIS2 server binary distribution
modified gshimansky  /harmony/enhanced/drlvm/trunk/vm/vmcore/src/verifier/Graph.cpp 05/18/2007 11:27:19 Applied HARMONY-3720 [drlvm][verifier] VerifyError: 'Data flow analysis error' is reported for class in AXIS2 server binary distribution
modified gshimansky  /harmony/enhanced/drlvm/trunk/vm/vmcore/src/verifier/ver_real.h 05/18/2007 11:27:19 Applied HARMONY-3720 [drlvm][verifier] VerifyError: 'Data flow analysis error' is reported for class in AXIS2 server binary distribution
add cc-drlvm log20070518095348Lbuild.6 05/18/2007 09:53:48drlvm
modified gshimansky  /harmony/enhanced/drlvm/trunk/vm/vmcore/src/class_support/classloader.cpp 05/18/2007 09:47:03 Applied HARMONY-3056 [drlvm][classloader] EUT intermittemintly fail on assertion in classloader
add cc-classlib log20070518094038Lbuild.5 05/18/2007 09:40:38classlib
modified ayza  /harmony/enhanced/classlib/trunk/modules/archive/src/main/java/java/util/zip/GZIPInputStream.java 05/18/2007 09:04:18 Applying another patch from HARMONY-3703 ( [classlib][archive][netbeans] GZIPInputStream throws IOException when feeding from the network)
modified ayza  /harmony/enhanced/classlib/trunk/modules/archive/src/test/java/org/apache/harmony/archive/tests/java/util/zip/GZIPInputStreamTest.java 05/18/2007 09:04:18 Applying another patch from HARMONY-3703 ( [classlib][archive][netbeans] GZIPInputStream throws IOException when feeding from the network)
modified ayza  /harmony/enhanced/classlib/trunk/modules/archive/src/main/java/java/util/zip/GZIPInputStream.java 05/18/2007 09:04:18 Applying another patch from HARMONY-3703 ( [classlib][archive][netbeans] GZIPInputStream throws IOException when feeding from the network)
modified ayza  /harmony/enhanced/classlib/trunk/modules/archive/src/test/java/org/apache/harmony/archive/tests/java/util/zip/GZIPInputStreamTest.java 05/18/2007 09:04:18 Applying another patch from HARMONY-3703 ( [classlib][archive][netbeans] GZIPInputStream throws IOException when feeding from the network)
modified varlax  /harmony/enhanced/drlvm/trunk/build/make/excludes/exclude.drlvm_kernel.linux.ia64.jit 05/18/2007 06:01:59 Excluded test for HARMONY-3905
add cc-drlvm log20070518040622Lbuild.5 05/18/2007 04:06:22drlvm
modified varlax  /harmony/enhanced/drlvm/trunk/build/make/excludes/exclude.drlvm_kernel.linux.ia64.int 05/18/2007 01:05:44 Unexcluded tests for HARMONY-3758
modified varlax  /harmony/enhanced/drlvm/trunk/vm/vmcore/src/jit/compile.cpp 05/18/2007 00:45:37 Applied HARMONY-3370,HARMONY-3371,HARMONY-3728 [drlvm] known thread-unsafe operations markup
modified varlax  /harmony/enhanced/drlvm/trunk/vm/jitrino/src/jet/compiler.cpp 05/18/2007 00:45:37 Applied HARMONY-3370,HARMONY-3371,HARMONY-3728 [drlvm] known thread-unsafe operations markup
modified varlax  /harmony/enhanced/drlvm/trunk/vm/jitrino/src/vm/drl/DrlJITInterface.cpp 05/18/2007 00:45:37 Applied HARMONY-3370,HARMONY-3371,HARMONY-3728 [drlvm] known thread-unsafe operations markup
add cc-drlvm log20070517222916Lbuild.4 05/17/2007 22:29:16drlvm
modified smishura  /harmony/enhanced/drlvm/trunk/vm/vmcore/src/class_support/String_Pool.cpp 05/17/2007 22:26:45 Quick fix for commit r538982 (DRLVM build fails on Windows x86):Fixed bug HARMONY-3758 [drlvm][classloader] assert fires in String_Pool::lookup()
add cc-classlib log20070517154118Lbuild.4 05/17/2007 15:41:18classlib
modified ayza  /harmony/enhanced/classlib/trunk/modules/luni/src/test/java/org/apache/harmony/luni/tests/java/lang/SecurityManagerTest.java 05/17/2007 12:57:45 Applying patch for test from HARMONY-2451 ([classlib][luni] SecurityManager.getClassContext output differs from the RI)
modified ayza  /harmony/enhanced/classlib/trunk/modules/luni/src/test/java/org/apache/harmony/luni/tests/java/lang/SecurityManagerTest.java 05/17/2007 12:57:45 Applying patch for test from HARMONY-2451 ([classlib][luni] SecurityManager.getClassContext output differs from the RI)
modified ayza  /harmony/enhanced/drlvm/trunk/vm/vmcore/src/kernel_classes/native/org_apache_harmony_vm_VMStack.cpp 05/17/2007 12:56:23 Applying patch for HARMONY-2451 ([classlib][luni] SecurityManager.getClassContext output differs from the RI)
modified ayza  /harmony/enhanced/drlvm/trunk/vm/vmcore/src/kernel_classes/javasrc/org/apache/harmony/vm/VMStack.java 05/17/2007 12:56:23 Applying patch for HARMONY-2451 ([classlib][luni] SecurityManager.getClassContext output differs from the RI)
modified gshimansky  /harmony/enhanced/drlvm/trunk/vm/vmcore/src/class_support/String_Pool.cpp 05/17/2007 10:55:47 Fixed bug HARMONY-3758 [drlvm][classloader] assert fires in String_Pool::lookup()For some reason in unaligned case when string is read byte by byte the signed char byteswere converted to POINTER_SIZE_INT with sign extend. When string contains unicodecharacters ( >= 128) this leads to incorrect results because upper bytes of thebyte are filled with 0xff bytes. The fix is to consider bytes as unsigned beforeextending them to POINTER_SIZE_INT.
modified ayza  /harmony/enhanced/classlib/trunk/modules/luni/src/test/java/tests/api/java/util/ResourceBundleTest.java 05/17/2007 10:30:55 Applying slightly modified version of the patch from HARMONY-3823 ([classlib][luni] Wrong implementation of strategy for instantiating resource bundles in java.util.ResourceBundle)
added ayza  /harmony/enhanced/classlib/trunk/modules/luni/src/test/resources/tests/api/java/util/support/B.properties 05/17/2007 10:30:55 Applying slightly modified version of the patch from HARMONY-3823 ([classlib][luni] Wrong implementation of strategy for instantiating resource bundles in java.util.ResourceBundle)
added ayza  /harmony/enhanced/classlib/trunk/modules/luni/src/test/java/tests/api/java/util/support/I.java 05/17/2007 10:30:55 Applying slightly modified version of the patch from HARMONY-3823 ([classlib][luni] Wrong implementation of strategy for instantiating resource bundles in java.util.ResourceBundle)
added ayza  /harmony/enhanced/classlib/trunk/modules/luni/src/test/resources/tests/api/java/util/support 05/17/2007 10:30:55 Applying slightly modified version of the patch from HARMONY-3823 ([classlib][luni] Wrong implementation of strategy for instantiating resource bundles in java.util.ResourceBundle)
added ayza  /harmony/enhanced/classlib/trunk/modules/luni/src/test/resources/tests/api/java/util 05/17/2007 10:30:55 Applying slightly modified version of the patch from HARMONY-3823 ([classlib][luni] Wrong implementation of strategy for instantiating resource bundles in java.util.ResourceBundle)
modified ayza  /harmony/enhanced/classlib/trunk/modules/luni/src/main/java/java/util/ResourceBundle.java 05/17/2007 10:30:55 Applying slightly modified version of the patch from HARMONY-3823 ([classlib][luni] Wrong implementation of strategy for instantiating resource bundles in java.util.ResourceBundle)
added ayza  /harmony/enhanced/classlib/trunk/modules/luni/src/test/java/tests/api/java/util/support/P.java 05/17/2007 10:30:55 Applying slightly modified version of the patch from HARMONY-3823 ([classlib][luni] Wrong implementation of strategy for instantiating resource bundles in java.util.ResourceBundle)
added ayza  /harmony/enhanced/classlib/trunk/modules/luni/src/test/java/tests/api/java/util/support 05/17/2007 10:30:55 Applying slightly modified version of the patch from HARMONY-3823 ([classlib][luni] Wrong implementation of strategy for instantiating resource bundles in java.util.ResourceBundle)
added ayza  /harmony/enhanced/classlib/trunk/modules/luni/src/test/java/tests/api/java/util/support/A.java 05/17/2007 10:30:55 Applying slightly modified version of the patch from HARMONY-3823 ([classlib][luni] Wrong implementation of strategy for instantiating resource bundles in java.util.ResourceBundle)
added ayza  /harmony/enhanced/classlib/trunk/modules/luni/src/test/java/tests/api/java/util/support/B.java 05/17/2007 10:30:55 Applying slightly modified version of the patch from HARMONY-3823 ([classlib][luni] Wrong implementation of strategy for instantiating resource bundles in java.util.ResourceBundle)
modified ayza  /harmony/enhanced/classlib/trunk/modules/luni/src/test/java/tests/api/java/util/ResourceBundleTest.java 05/17/2007 10:30:55 Applying slightly modified version of the patch from HARMONY-3823 ([classlib][luni] Wrong implementation of strategy for instantiating resource bundles in java.util.ResourceBundle)
added ayza  /harmony/enhanced/classlib/trunk/modules/luni/src/test/resources/tests/api/java/util/support/B.properties 05/17/2007 10:30:55 Applying slightly modified version of the patch from HARMONY-3823 ([classlib][luni] Wrong implementation of strategy for instantiating resource bundles in java.util.ResourceBundle)
added ayza  /harmony/enhanced/classlib/trunk/modules/luni/src/test/java/tests/api/java/util/support/I.java 05/17/2007 10:30:55 Applying slightly modified version of the patch from HARMONY-3823 ([classlib][luni] Wrong implementation of strategy for instantiating resource bundles in java.util.ResourceBundle)
added ayza  /harmony/enhanced/classlib/trunk/modules/luni/src/test/resources/tests/api/java/util/support 05/17/2007 10:30:55 Applying slightly modified version of the patch from HARMONY-3823 ([classlib][luni] Wrong implementation of strategy for instantiating resource bundles in java.util.ResourceBundle)
added ayza  /harmony/enhanced/classlib/trunk/modules/luni/src/test/resources/tests/api/java/util 05/17/2007 10:30:55 Applying slightly modified version of the patch from HARMONY-3823 ([classlib][luni] Wrong implementation of strategy for instantiating resource bundles in java.util.ResourceBundle)
modified ayza  /harmony/enhanced/classlib/trunk/modules/luni/src/main/java/java/util/ResourceBundle.java 05/17/2007 10:30:55 Applying slightly modified version of the patch from HARMONY-3823 ([classlib][luni] Wrong implementation of strategy for instantiating resource bundles in java.util.ResourceBundle)
added ayza  /harmony/enhanced/classlib/trunk/modules/luni/src/test/java/tests/api/java/util/support/P.java 05/17/2007 10:30:55 Applying slightly modified version of the patch from HARMONY-3823 ([classlib][luni] Wrong implementation of strategy for instantiating resource bundles in java.util.ResourceBundle)
added ayza  /harmony/enhanced/classlib/trunk/modules/luni/src/test/java/tests/api/java/util/support 05/17/2007 10:30:55 Applying slightly modified version of the patch from HARMONY-3823 ([classlib][luni] Wrong implementation of strategy for instantiating resource bundles in java.util.ResourceBundle)
added ayza  /harmony/enhanced/classlib/trunk/modules/luni/src/test/java/tests/api/java/util/support/A.java 05/17/2007 10:30:55 Applying slightly modified version of the patch from HARMONY-3823 ([classlib][luni] Wrong implementation of strategy for instantiating resource bundles in java.util.ResourceBundle)
added ayza  /harmony/enhanced/classlib/trunk/modules/luni/src/test/java/tests/api/java/util/support/B.java 05/17/2007 10:30:55 Applying slightly modified version of the patch from HARMONY-3823 ([classlib][luni] Wrong implementation of strategy for instantiating resource bundles in java.util.ResourceBundle)
add cc-drlvm log20070517101616Lbuild.3 05/17/2007 10:16:16drlvm
add cc-classlib log20070517100441Lbuild.3 05/17/2007 10:04:41classlib
modified xli  /harmony/enhanced/classlib/trunk/modules/luni/src/main/java/java/util/WeakHashMap.java 05/17/2007 09:06:00 HARMONY-3883 : [classlib]WeakHashMap.keySet().toArray() intermittently throws NoSuchElementException in java.lang.ThreadTest of DRLVM kernel test.
modified xli  /harmony/enhanced/classlib/trunk/modules/luni/src/main/java/java/util/WeakHashMap.java 05/17/2007 09:06:00 HARMONY-3883 : [classlib]WeakHashMap.keySet().toArray() intermittently throws NoSuchElementException in java.lang.ThreadTest of DRLVM kernel test.
modified varlax  /harmony/enhanced/drlvm/trunk/build/make/excludes/exclude.drlvm_smoke.linux.ia64.jit 05/17/2007 07:52:37 Updated x-lists for IA64
modified varlax  /harmony/enhanced/drlvm/trunk/build/make/excludes/exclude.drlvm_kernel.linux.ia64.jit 05/17/2007 07:52:37 Updated x-lists for IA64
modified varlax  /harmony/enhanced/drlvm/trunk/vm/jitrino/src/codegenerator/ipf/include/IpfCodeSelector.h 05/17/2007 07:50:46 Applied HARMONY-3872 [drlvm][jit][opt] ArrayCopy optimization does not insert pseudoThrow insts in loops
modified varlax  /harmony/enhanced/drlvm/trunk/vm/jitrino/src/translator/java/JavaByteCodeTranslator.cpp 05/17/2007 07:50:46 Applied HARMONY-3872 [drlvm][jit][opt] ArrayCopy optimization does not insert pseudoThrow insts in loops
modified varlax  /harmony/enhanced/drlvm/trunk/build/make/excludes/exclude.drlvm_smoke.windows.x86.srv 05/17/2007 07:37:43 Excluded StackTest for srv on all IA-32 platforms, there is related HARMONY-3731
modified varlax  /harmony/enhanced/drlvm/trunk/build/make/excludes/exclude.drlvm_smoke.linux.x86.srv 05/17/2007 07:37:43 Excluded StackTest for srv on all IA-32 platforms, there is related HARMONY-3731
modified varlax  /harmony/enhanced/drlvm/trunk/vm/jitrino/src/codegenerator/ia32/Ia32GCMap.cpp 05/17/2007 05:08:37 Fixed failing assertion after [r538551] HARMONY-3636
add cc-drlvm log20070517044135Lbuild.2 05/17/2007 04:41:35drlvm
add cc-classlib log20070517043018Lbuild.2 05/17/2007 04:30:18classlib
modified ayza  /harmony/enhanced/classlib/trunk/make/build-java.xml 05/17/2007 03:06:54 Correcting error message for case if ECJ compiler class is not found
modified ayza  /harmony/enhanced/classlib/trunk/make/build-java.xml 05/17/2007 03:06:54 Correcting error message for case if ECJ compiler class is not found
add cc-drlvm log20070516225808Lbuild.1 05/16/2007 22:58:08drlvm
add cc-classlib log20070516224359Lbuild.1 05/16/2007 22:43:59classlib
modified hindessm  /harmony/enhanced/classlib/trunk/modules/awt/src/main/native/oglwrapper/shared/nativelib_common.h 05/16/2007 15:36:21 Another trivial change for Mac OS/X.
modified hindessm  /harmony/enhanced/classlib/trunk/modules/awt/src/main/native/oglwrapper/shared/nativelib_common.h 05/16/2007 15:36:21 Another trivial change for Mac OS/X.
modified hindessm  /harmony/enhanced/classlib/trunk/modules/luni/src/main/native/luni/unix/procimpl.c 05/16/2007 15:27:43 Minor tweaks to get things to compile on Mac OS/X.
modified hindessm  /harmony/enhanced/classlib/trunk/modules/portlib/src/main/native/include/unix/hysock.h 05/16/2007 15:27:43 Minor tweaks to get things to compile on Mac OS/X.
modified hindessm  /harmony/enhanced/classlib/trunk/modules/portlib/src/main/native/sig/unix/hysigunix.c 05/16/2007 15:27:43 Minor tweaks to get things to compile on Mac OS/X.
modified hindessm  /harmony/enhanced/classlib/trunk/modules/portlib/src/main/native/include/shared/hycomp.h 05/16/2007 15:27:43 Minor tweaks to get things to compile on Mac OS/X.
modified hindessm  /harmony/enhanced/classlib/trunk/modules/luni/src/main/native/luni/unix/hyenv.c 05/16/2007 15:27:43 Minor tweaks to get things to compile on Mac OS/X.
modified hindessm  /harmony/enhanced/classlib/trunk/modules/luni/src/main/native/luni/unix/OSMemory.c 05/16/2007 15:27:43 Minor tweaks to get things to compile on Mac OS/X.
modified hindessm  /harmony/enhanced/classlib/trunk/modules/portlib/src/main/native/port/unix/hysysinfo.c 05/16/2007 15:27:43 Minor tweaks to get things to compile on Mac OS/X.
modified hindessm  /harmony/enhanced/classlib/trunk/make/properties.xml 05/16/2007 15:27:43 Minor tweaks to get things to compile on Mac OS/X.
modified hindessm  /harmony/enhanced/classlib/trunk/modules/awt/src/main/native/linuxfont/unix/makefile 05/16/2007 15:27:43 Minor tweaks to get things to compile on Mac OS/X.
modified hindessm  /harmony/enhanced/classlib/trunk/modules/luni/src/main/native/luni/unix/OSMemoryLinux32.c 05/16/2007 15:27:43 Minor tweaks to get things to compile on Mac OS/X.
modified hindessm  /harmony/enhanced/classlib/trunk/depends/build/platform/macosx.ppc32.mk 05/16/2007 15:27:43 Minor tweaks to get things to compile on Mac OS/X.
modified hindessm  /harmony/enhanced/classlib/trunk/modules/luni/src/main/native/luni/unix/OSNetworkSystemLinux.c 05/16/2007 15:27:43 Minor tweaks to get things to compile on Mac OS/X.
modified hindessm  /harmony/enhanced/classlib/trunk/modules/awt/src/main/native/x11wrapper/unix/nativelib_common.h 05/16/2007 15:27:43 Minor tweaks to get things to compile on Mac OS/X.
modified hindessm  /harmony/enhanced/classlib/trunk/modules/luni/src/main/native/launcher/shared/main.c 05/16/2007 15:27:43 Minor tweaks to get things to compile on Mac OS/X.
modified hindessm  /harmony/enhanced/classlib/trunk/modules/portlib/src/main/native/sig/unix/hysiglinux.c 05/16/2007 15:27:43 Minor tweaks to get things to compile on Mac OS/X.
modified hindessm  /harmony/enhanced/classlib/trunk/modules/luni/src/main/native/luni/unix/procimpl.c 05/16/2007 15:27:43 Minor tweaks to get things to compile on Mac OS/X.
modified hindessm  /harmony/enhanced/classlib/trunk/modules/portlib/src/main/native/include/unix/hysock.h 05/16/2007 15:27:43 Minor tweaks to get things to compile on Mac OS/X.
modified hindessm  /harmony/enhanced/classlib/trunk/modules/portlib/src/main/native/sig/unix/hysigunix.c 05/16/2007 15:27:43 Minor tweaks to get things to compile on Mac OS/X.
modified hindessm  /harmony/enhanced/classlib/trunk/modules/portlib/src/main/native/include/shared/hycomp.h 05/16/2007 15:27:43 Minor tweaks to get things to compile on Mac OS/X.
modified hindessm  /harmony/enhanced/classlib/trunk/modules/luni/src/main/native/luni/unix/hyenv.c 05/16/2007 15:27:43 Minor tweaks to get things to compile on Mac OS/X.
modified hindessm  /harmony/enhanced/classlib/trunk/modules/luni/src/main/native/luni/unix/OSMemory.c 05/16/2007 15:27:43 Minor tweaks to get things to compile on Mac OS/X.
modified hindessm  /harmony/enhanced/classlib/trunk/modules/portlib/src/main/native/port/unix/hysysinfo.c 05/16/2007 15:27:43 Minor tweaks to get things to compile on Mac OS/X.
modified hindessm  /harmony/enhanced/classlib/trunk/make/properties.xml 05/16/2007 15:27:43 Minor tweaks to get things to compile on Mac OS/X.
modified hindessm  /harmony/enhanced/classlib/trunk/modules/awt/src/main/native/linuxfont/unix/makefile 05/16/2007 15:27:43 Minor tweaks to get things to compile on Mac OS/X.
modified hindessm  /harmony/enhanced/classlib/trunk/modules/luni/src/main/native/luni/unix/OSMemoryLinux32.c 05/16/2007 15:27:43 Minor tweaks to get things to compile on Mac OS/X.
modified hindessm  /harmony/enhanced/classlib/trunk/depends/build/platform/macosx.ppc32.mk 05/16/2007 15:27:43 Minor tweaks to get things to compile on Mac OS/X.
modified hindessm  /harmony/enhanced/classlib/trunk/modules/luni/src/main/native/luni/unix/OSNetworkSystemLinux.c 05/16/2007 15:27:43 Minor tweaks to get things to compile on Mac OS/X.
modified hindessm  /harmony/enhanced/classlib/trunk/modules/awt/src/main/native/x11wrapper/unix/nativelib_common.h 05/16/2007 15:27:43 Minor tweaks to get things to compile on Mac OS/X.
modified hindessm  /harmony/enhanced/classlib/trunk/modules/luni/src/main/native/launcher/shared/main.c 05/16/2007 15:27:43 Minor tweaks to get things to compile on Mac OS/X.
modified hindessm  /harmony/enhanced/classlib/trunk/modules/portlib/src/main/native/sig/unix/hysiglinux.c 05/16/2007 15:27:43 Minor tweaks to get things to compile on Mac OS/X.
modified hindessm  /harmony/enhanced/classlib/trunk/modules/luni/src/main/native/launcher/unix/main_hlp.c 05/16/2007 15:18:42 Use refactored PLATFORM_DLL_EXTENSION instead of hardcoded string.
modified hindessm  /harmony/enhanced/classlib/trunk/modules/luni/src/main/native/launcher/unix/main_hlp.c 05/16/2007 15:18:42 Use refactored PLATFORM_DLL_EXTENSION instead of hardcoded string.
modified gshimansky  /harmony/enhanced/drlvm/trunk/vm/vmcore/src/jvmti/jvmti_general.cpp 05/16/2007 13:51:05 Applied HARMONY-3799 [drlvm][jvmti] compatibility: GetVersionNumber returns the value with zero micro version
modified hindessm  /harmony/enhanced/classlib/trunk/modules/portlib/src/main/native/include/shared/hycomp.h 05/16/2007 13:30:05 Refactor PLATFORM_DLL_EXTENSION define to hycomp.h
modified hindessm  /harmony/enhanced/classlib/trunk/modules/portlib/src/main/native/port/unix/hysl.c 05/16/2007 13:30:05 Refactor PLATFORM_DLL_EXTENSION define to hycomp.h
modified hindessm  /harmony/enhanced/classlib/trunk/modules/portlib/src/main/native/include/shared/hycomp.h 05/16/2007 13:30:05 Refactor PLATFORM_DLL_EXTENSION define to hycomp.h
modified hindessm  /harmony/enhanced/classlib/trunk/modules/portlib/src/main/native/port/unix/hysl.c 05/16/2007 13:30:05 Refactor PLATFORM_DLL_EXTENSION define to hycomp.h
modified hindessm  /harmony/enhanced/classlib/trunk/modules/luni/src/main/native/launcher/shared/cmain.c 05/16/2007 12:48:49 Exiting silently with 0 exit code when hyport_init_library fails isprobably not very helpful.  So now it outputs a message and exits witha non-zero return code - the return code from hyport_init_librarywhich usually means the error can be found indeploy/include/hyporterror.h.
modified hindessm  /harmony/enhanced/classlib/trunk/modules/luni/src/main/native/launcher/shared/cmain.c 05/16/2007 12:48:49 Exiting silently with 0 exit code when hyport_init_library fails isprobably not very helpful.  So now it outputs a message and exits witha non-zero return code - the return code from hyport_init_librarywhich usually means the error can be found indeploy/include/hyporterror.h.
modified smishura  /harmony/enhanced/drlvm/trunk/vm/jitrino/src/codegenerator/ia32/Ia32RegAlloc3.cpp 05/16/2007 09:19:30 Quick fix for commit r538551(DRLVM build fails on Linux):(Applied HARMONY-3636 [DRLVM][jit]Color-graph register allocator enable in server mode)
modified pyang  /harmony/enhanced/classlib/trunk/modules/luni/src/test/java/tests/api/java/util/AbstractMapTest.java 05/16/2007 08:15:42 Apply new patch for HARMONY-3865([classlib][luni] AbstractMap seems to have a flawed equals method)
modified pyang  /harmony/enhanced/classlib/trunk/modules/luni/src/main/java/java/util/AbstractMap.java 05/16/2007 08:15:42 Apply new patch for HARMONY-3865([classlib][luni] AbstractMap seems to have a flawed equals method)
modified pyang  /harmony/enhanced/classlib/trunk/modules/luni/src/test/java/tests/api/java/util/AbstractMapTest.java 05/16/2007 08:15:42 Apply new patch for HARMONY-3865([classlib][luni] AbstractMap seems to have a flawed equals method)
modified pyang  /harmony/enhanced/classlib/trunk/modules/luni/src/main/java/java/util/AbstractMap.java 05/16/2007 08:15:42 Apply new patch for HARMONY-3865([classlib][luni] AbstractMap seems to have a flawed equals method)
modified pyang  /harmony/enhanced/classlib/trunk/modules/jndi/src/test/java/org/apache/harmony/jndi/tests/javax/naming/ldap/LdapNameTest.java 05/16/2007 07:38:18 Apply patch for HARMONY-3879([classlib][jndi] Method size() of class javax.naming.ldap.LdapName return different value from RI)
modified pyang  /harmony/enhanced/classlib/trunk/modules/jndi/src/main/java/javax/naming/ldap/LdapName.java 05/16/2007 07:38:18 Apply patch for HARMONY-3879([classlib][jndi] Method size() of class javax.naming.ldap.LdapName return different value from RI)
modified pyang  /harmony/enhanced/classlib/trunk/modules/jndi/src/test/java/org/apache/harmony/jndi/tests/javax/naming/ldap/LdapNameTest.java 05/16/2007 07:38:18 Apply patch for HARMONY-3879([classlib][jndi] Method size() of class javax.naming.ldap.LdapName return different value from RI)
modified pyang  /harmony/enhanced/classlib/trunk/modules/jndi/src/main/java/javax/naming/ldap/LdapName.java 05/16/2007 07:38:18 Apply patch for HARMONY-3879([classlib][jndi] Method size() of class javax.naming.ldap.LdapName return different value from RI)
modified varlax  /harmony/enhanced/drlvm/trunk/vm/vmcore/src/class_support/java_type.cpp 05/16/2007 07:08:28 Applied HARMONY-3840 [drlvm][classloader] 'clss' field is never cached for TypeDesc struct
modified varlax  /harmony/enhanced/drlvm/trunk/vm/jitrino/src/codegenerator/ia32/Ia32Inst.h 05/16/2007 06:58:35 Applied HARMONY-3636 [DRLVM][jit]Color-graph register allocator enable in server mode
modified varlax  /harmony/enhanced/drlvm/trunk/vm/jitrino/config/ia32/server.emconf 05/16/2007 06:58:35 Applied HARMONY-3636 [DRLVM][jit]Color-graph register allocator enable in server mode
modified varlax  /harmony/enhanced/drlvm/trunk/vm/jitrino/src/codegenerator/ia32/Ia32ConstraintsResolver.cpp 05/16/2007 06:58:35 Applied HARMONY-3636 [DRLVM][jit]Color-graph register allocator enable in server mode
modified varlax  /harmony/enhanced/drlvm/trunk/vm/jitrino/config/em64t/server.emconf 05/16/2007 06:58:35 Applied HARMONY-3636 [DRLVM][jit]Color-graph register allocator enable in server mode
modified varlax  /harmony/enhanced/drlvm/trunk/vm/jitrino/src/codegenerator/ia32/Ia32RegAlloc3.cpp 05/16/2007 06:58:35 Applied HARMONY-3636 [DRLVM][jit]Color-graph register allocator enable in server mode
modified varlax  /harmony/enhanced/drlvm/trunk/vm/jitrino/src/codegenerator/ia32/Ia32Inst.cpp 05/16/2007 06:58:35 Applied HARMONY-3636 [DRLVM][jit]Color-graph register allocator enable in server mode
modified varlax  /harmony/enhanced/drlvm/trunk/vm/jitrino/src/codegenerator/ia32/Ia32SpillGen.cpp 05/16/2007 06:58:35 Applied HARMONY-3636 [DRLVM][jit]Color-graph register allocator enable in server mode
modified varlax  /harmony/enhanced/drlvm/trunk/vm/jitrino/src/codegenerator/ia32/Ia32WebMaker.cpp 05/16/2007 06:58:35 Applied HARMONY-3636 [DRLVM][jit]Color-graph register allocator enable in server mode
added varlax  /harmony/enhanced/drlvm/trunk/vm/jitrino/src/codegenerator/ia32/Ia32ConstraintsResolver.h 05/16/2007 06:58:35 Applied HARMONY-3636 [DRLVM][jit]Color-graph register allocator enable in server mode
modified apetrenko  /harmony/enhanced/classlib/trunk/modules/luni/src/main/java/java/util/Arrays.java 05/16/2007 05:29:01 Patch for HARMONY-3339 "[classlib][luni][EUT] 51 tests fail in jdtcoremodel suit with NullPointerException"
modified apetrenko  /harmony/enhanced/classlib/trunk/modules/luni/src/main/java/java/util/Arrays.java 05/16/2007 05:29:01 Patch for HARMONY-3339 "[classlib][luni][EUT] 51 tests fail in jdtcoremodel suit with NullPointerException"
added xli  /harmony/enhanced/drlvm/trunk/vm/gc_gen/src/common/hashcode.h 05/16/2007 04:24:12 HARMONY-3875 : [DRLVM][GC] object hashcode support improved in GCv5
modified xli  /harmony/enhanced/drlvm/trunk/vm/gc_gen/src/thread/collector_alloc.h 05/16/2007 04:24:12 HARMONY-3875 : [DRLVM][GC] object hashcode support improved in GCv5
modified xli  /harmony/enhanced/drlvm/trunk/vm/gc_gen/src/mark_compact/fallback_mark_scan.cpp 05/16/2007 04:24:12 HARMONY-3875 : [DRLVM][GC] object hashcode support improved in GCv5
modified xli  /harmony/enhanced/drlvm/trunk/vm/gc_gen/src/common/gc_metadata.cpp 05/16/2007 04:24:12 HARMONY-3875 : [DRLVM][GC] object hashcode support improved in GCv5
modified xli  /harmony/enhanced/drlvm/trunk/vm/gc_gen/src/utils/vector_block.h 05/16/2007 04:24:12 HARMONY-3875 : [DRLVM][GC] object hashcode support improved in GCv5
modified xli  /harmony/enhanced/drlvm/trunk/vm/gc_gen/src/gen/gen.cpp 05/16/2007 04:24:12 HARMONY-3875 : [DRLVM][GC] object hashcode support improved in GCv5
modified xli  /harmony/enhanced/drlvm/trunk/vm/gc_gen/src/trace_forward/fspace.cpp 05/16/2007 04:24:12 HARMONY-3875 : [DRLVM][GC] object hashcode support improved in GCv5
modified xli  /harmony/enhanced/drlvm/trunk/vm/gc_gen/src/mark_sweep/lspace_alloc_collect.cpp 05/16/2007 04:24:12 HARMONY-3875 : [DRLVM][GC] object hashcode support improved in GCv5
modified xli  /harmony/enhanced/drlvm/trunk/vm/gc_gen/src/mark_compact/mspace_collect_compact.cpp 05/16/2007 04:24:12 HARMONY-3875 : [DRLVM][GC] object hashcode support improved in GCv5
modified xli  /harmony/enhanced/drlvm/trunk/vm/gc_gen/src/verify/verify_live_heap.cpp 05/16/2007 04:24:12 HARMONY-3875 : [DRLVM][GC] object hashcode support improved in GCv5
modified xli  /harmony/enhanced/drlvm/trunk/vm/gc_gen/src/mark_compact/mspace_extend_compact.cpp 05/16/2007 04:24:12 HARMONY-3875 : [DRLVM][GC] object hashcode support improved in GCv5
modified xli  /harmony/enhanced/drlvm/trunk/vm/gc_gen/src/common/gc_metadata.h 05/16/2007 04:24:12 HARMONY-3875 : [DRLVM][GC] object hashcode support improved in GCv5
modified xli  /harmony/enhanced/drlvm/trunk/vm/gc_gen/src/verify/verifier_scanner.cpp 05/16/2007 04:24:12 HARMONY-3875 : [DRLVM][GC] object hashcode support improved in GCv5
added xli  /harmony/enhanced/drlvm/trunk/vm/gc_gen/src/utils/seq_list.h 05/16/2007 04:24:12 HARMONY-3875 : [DRLVM][GC] object hashcode support improved in GCv5
modified xli  /harmony/enhanced/drlvm/trunk/vm/gc_gen/src/trace_forward/fspace.h 05/16/2007 04:24:12 HARMONY-3875 : [DRLVM][GC] object hashcode support improved in GCv5
modified xli  /harmony/enhanced/drlvm/trunk/vm/gc_gen/src/mark_compact/mspace_collect_compact.h 05/16/2007 04:24:12 HARMONY-3875 : [DRLVM][GC] object hashcode support improved in GCv5
modified xli  /harmony/enhanced/drlvm/trunk/vm/gc_gen/src/common/gc_for_vm.cpp 05/16/2007 04:24:12 HARMONY-3875 : [DRLVM][GC] object hashcode support improved in GCv5
modified xli  /harmony/enhanced/drlvm/trunk/vm/gc_gen/src/thread/collector.cpp 05/16/2007 04:24:12 HARMONY-3875 : [DRLVM][GC] object hashcode support improved in GCv5
modified xli  /harmony/enhanced/drlvm/trunk/vm/gc_gen/src/common/gc_common.h 05/16/2007 04:24:12 HARMONY-3875 : [DRLVM][GC] object hashcode support improved in GCv5
modified xli  /harmony/enhanced/drlvm/trunk/vm/gc_gen/src/mark_compact/mspace_slide_compact.cpp 05/16/2007 04:24:12 HARMONY-3875 : [DRLVM][GC] object hashcode support improved in GCv5
modified xli  /harmony/enhanced/drlvm/trunk/vm/gc_gen/src/common/gc_block.h 05/16/2007 04:24:12 HARMONY-3875 : [DRLVM][GC] object hashcode support improved in GCv5
modified xli  /harmony/enhanced/drlvm/trunk/vm/gc_gen/src/common/gc_space.h 05/16/2007 04:24:12 HARMONY-3875 : [DRLVM][GC] object hashcode support improved in GCv5
modified xli  /harmony/enhanced/drlvm/trunk/vm/gc_gen/src/thread/collector.h 05/16/2007 04:24:12 HARMONY-3875 : [DRLVM][GC] object hashcode support improved in GCv5
modified xli  /harmony/enhanced/drlvm/trunk/vm/gc_gen/src/mark_compact/mspace_move_compact.cpp 05/16/2007 04:24:12 HARMONY-3875 : [DRLVM][GC] object hashcode support improved in GCv5
modified xli  /harmony/enhanced/drlvm/trunk/vm/gc_gen/src/mark_compact/los_extention_mark_scan.cpp 05/16/2007 04:24:12 HARMONY-3875 : [DRLVM][GC] object hashcode support improved in GCv5
modified xli  /harmony/enhanced/drlvm/trunk/vm/gc_gen/src/mark_compact/mspace.cpp 05/16/2007 04:24:12 HARMONY-3875 : [DRLVM][GC] object hashcode support improved in GCv5
modified xli  /harmony/enhanced/drlvm/trunk/vm/gc_gen/src/mark_sweep/lspace.h 05/16/2007 04:24:12 HARMONY-3875 : [DRLVM][GC] object hashcode support improved in GCv5
modified apetrenko  /harmony/enhanced/classlib/trunk/modules/swing/make/exclude.common 05/16/2007 04:19:29 j.s.text.html.MinimalHTMLWriterTest has been removed from exclude list after the HARMONY-2379 patch
modified apetrenko  /harmony/enhanced/classlib/trunk/modules/swing/make/exclude.common 05/16/2007 04:19:29 j.s.text.html.MinimalHTMLWriterTest has been removed from exclude list after the HARMONY-2379 patch
modified apetrenko  /harmony/enhanced/classlib/trunk/modules/swing/src/test/api/java.injected/javax/swing/text/html/MinimalHTMLWriterTest.java 05/16/2007 04:18:03 Patch for HARMONY-2379 "[classlib][swing][html] unit test fails: j.s.text.html.MinimalHTMLWriterTest"
modified apetrenko  /harmony/enhanced/classlib/trunk/modules/swing/src/test/api/java.injected/javax/swing/text/html/MinimalHTMLWriterTest.java 05/16/2007 04:18:03 Patch for HARMONY-2379 "[classlib][swing][html] unit test fails: j.s.text.html.MinimalHTMLWriterTest"


Mime
View raw message