harmony-alerts mailing list archives

Site index · List index
Message view « Date » · « Thread »
Top « Date » · « Thread »
From nom...@intel.com
Subject [build-test alert] BUILD FAILED Linux SUSE 9 64bit gcc debug: drlvm reg.test
Date Wed, 16 May 2007 14:23:44 GMT
BUILD FAILED:
	Ant Error Message:
/export/cruise/trunk/cc/projects/drlvm/trunk/build/make/build.xml:455: The following error
occurred while executing this line: /export/cruise/trunk/cc/projects/drlvm/trunk/build/make/targets/reg.test.xml:128:
The following error occurred while executing this line: /export/cruise/trunk/cc/projects/drlvm/trunk/build/make/targets/reg.test.xml:169:
gcc failed with return code 1

Date of build:	05/16/2007 21:23:29
Time to build:	8 seconds
Last changed:	05/16/2007 21:19:30
Last log entry:	Quick fix for commit r538551(DRLVM build fails on Linux):
(Applied HARMONY-3636 [DRLVM][jit]Color-graph register allocator enable in server mode)

***********************************************************
Execution log (errors/warnings messages):	
/export/cruise/trunk/cc/projects/drlvm/trunk/src/test/regression/H2151/VMInit1.cpp:2:19: jvmti.h:
No such file or directory
/export/cruise/trunk/cc/projects/drlvm/trunk/src/test/regression/H2151/VMInit1.cpp:4: error:
syntax
   error before `(' token
/export/cruise/trunk/cc/projects/drlvm/trunk/src/test/regression/H2151/VMInit1.cpp:10: error:
syntax
   error before `=' token
/export/cruise/trunk/cc/projects/drlvm/trunk/src/test/regression/H2151/VMInit1.cpp:14: error:
syntax
   error before `->' token
/export/cruise/trunk/cc/projects/drlvm/trunk/src/test/regression/H2151/VMInit1.cpp:17: error:
syntax
   error before `Agent_OnLoad'
/export/cruise/trunk/cc/projects/drlvm/trunk/src/test/regression/H2151/VMInit1.cpp:24: error:
'
   jvmtiCapabilities' is used as a type, but is not defined as a type.
/export/cruise/trunk/cc/projects/drlvm/trunk/src/test/regression/H2151/VMInit1.cpp:25: error:
syntax
   error before `=' token
/export/cruise/trunk/cc/projects/drlvm/trunk/src/test/regression/H2151/VMInit1.cpp:30: error:
ISO
   C++ forbids declaration of `result' with no type
/export/cruise/trunk/cc/projects/drlvm/trunk/src/test/regression/H2151/VMInit1.cpp:30: error:
`
   jvmti_env' was not declared in this scope
/export/cruise/trunk/cc/projects/drlvm/trunk/src/test/regression/H2151/VMInit1.cpp:30: error:
`
   capabilities' was not declared in this scope
/export/cruise/trunk/cc/projects/drlvm/trunk/src/test/regression/H2151/VMInit1.cpp:31: error:
syntax
   error before `if'
/export/cruise/trunk/cc/projects/drlvm/trunk/src/test/regression/H2151/VMInit1.cpp:34: error:
'
   jvmtiEventCallbacks' is used as a type, but is not defined as a type.
/export/cruise/trunk/cc/projects/drlvm/trunk/src/test/regression/H2151/VMInit1.cpp:35: error:
`
   callbacks' was not declared in this scope
/export/cruise/trunk/cc/projects/drlvm/trunk/src/test/regression/H2151/VMInit1.cpp:35: error:
`
   jvmtiEventCallbacks' was not declared in this scope
/export/cruise/trunk/cc/projects/drlvm/trunk/src/test/regression/H2151/VMInit1.cpp:35: error:
ISO
   C++ forbids declaration of `memset' with no type
/export/cruise/trunk/cc/projects/drlvm/trunk/src/test/regression/H2151/VMInit1.cpp:35: error:
`
   int memset' redeclared as different kind of symbol
/usr/include/string.h:58: error: previous declaration of `void* memset(void*, 
   int, long unsigned int)'
/export/cruise/trunk/cc/projects/drlvm/trunk/src/test/regression/H2151/VMInit1.cpp:35: error:
initializer
   list being treated as compound expression
/export/cruise/trunk/cc/projects/drlvm/trunk/src/test/regression/H2151/VMInit1.cpp:36: error:
syntax
   error before `.' token
/export/cruise/trunk/cc/projects/drlvm/trunk/src/test/regression/H2151/VMInit1.cpp:39: error:
ISO
   C++ forbids declaration of `result' with no type
/export/cruise/trunk/cc/projects/drlvm/trunk/src/test/regression/H2151/VMInit1.cpp:39: error:
redefinition
   of `int result'
/export/cruise/trunk/cc/projects/drlvm/trunk/src/test/regression/H2151/VMInit1.cpp:30: error:
`
   int result' previously defined here
/export/cruise/trunk/cc/projects/drlvm/trunk/src/test/regression/H2151/VMInit1.cpp:39: error:
`
   jvmti_env' was not declared in this scope
/export/cruise/trunk/cc/projects/drlvm/trunk/src/test/regression/H2151/VMInit1.cpp:39: error:
`
   callbacks' was not declared in this scope
/export/cruise/trunk/cc/projects/drlvm/trunk/src/test/regression/H2151/VMInit1.cpp:39: error:
`
   jint' was not declared in this scope
/export/cruise/trunk/cc/projects/drlvm/trunk/src/test/regression/H2151/VMInit1.cpp:39: error:
syntax
   error before `sizeof'
/export/cruise/trunk/cc/projects/drlvm/trunk/src/test/regression/H2151/VMInit1.cpp:44: error:
ISO
   C++ forbids declaration of `result' with no type
/export/cruise/trunk/cc/projects/drlvm/trunk/src/test/regression/H2151/VMInit1.cpp:44: error:
redefinition
   of `int result'
/export/cruise/trunk/cc/projects/drlvm/trunk/src/test/regression/H2151/VMInit1.cpp:39: error:
`
   int result' previously defined here
/export/cruise/trunk/cc/projects/drlvm/trunk/src/test/regression/H2151/VMInit1.cpp:44: error:
`
   jvmti_env' was not declared in this scope
/export/cruise/trunk/cc/projects/drlvm/trunk/src/test/regression/H2151/VMInit1.cpp:44: error:
`
   JVMTI_ENABLE' was not declared in this scope
/export/cruise/trunk/cc/projects/drlvm/trunk/src/test/regression/H2151/VMInit1.cpp:44: error:
`
   JVMTI_EVENT_VM_INIT' was not declared in this scope
/export/cruise/trunk/cc/projects/drlvm/trunk/src/test/regression/H2151/VMInit1.cpp:45: error:
syntax
Configuration:
     Hosting Java = 1.5.0_09 (Sun Microsystems Inc.)
    classlib root = /export/cruise/trunk/cc/projects/classlib/trunk
               os = Linux
             arch = em64t
              cxx = gcc
              cfg = debug
     svn revision = ${svn.revision}
       components = deploy

***********************************************************
Unit Tests: (0)
        
No Tests Run: This project doesn't have any tests or tests were not run

***********************************************************
Modifications since last successful build:	(1)
            
modified smishura  /harmony/enhanced/drlvm/trunk/vm/jitrino/src/codegenerator/ia32/Ia32RegAlloc3.cpp
05/16/2007 21:19:30 Quick fix for commit r538551(DRLVM build fails on Linux):(Applied HARMONY-3636
[DRLVM][jit]Color-graph register allocator enable in server mode)

Mime
View raw message