harmony-alerts mailing list archives

Site index · List index
Message view « Date » · « Thread »
Top « Date » · « Thread »
From nbe...@kc.rr.com
Subject [build-test alert] BUILD FAILED Windows XP x86: drlvm-reg-test
Date Tue, 15 May 2007 05:37:39 GMT
BUILD FAILED:
	Ant Error Message:
C:\harmony\buildtest2\scripts\cc-project.xml:44: The following error occurred while executing
this line: C:\harmony\buildtest2\adaptors\drlvm-reg-test\adaptor.xml:73: There were drlvm-reg-test
failures

Date of build:	05/15/2007 00:37:32
Time to build:	3 seconds

***********************************************************
Errors/Warnings:	(5)
            
BUILD FAILED
C:\harmony\buildtest2\build\checkouts\drlvm\build\make\build.xml:192: Source file does not
exist.
Total time: 1 second
Warning: skipping zip archive C:\harmony\buildtest2\build\results\drlvm-reg-test_20070515_0037.zip
because no files were included.

***********************************************************
Unit Tests: (0)
        
No Tests Run: This project doesn't have any tests

***********************************************************
Modifications since last successful build:	(0)
            


Mime
View raw message