harmony-alerts mailing list archives

Site index · List index
Message view « Date » · « Thread »
Top « Date » · « Thread »
From nbe...@kc.rr.com
Subject [build-test alert] BUILD FAILED Windows XP x86: classlib-test
Date Tue, 15 May 2007 05:37:27 GMT
BUILD FAILED:
	Ant Error Message:
C:\harmony\buildtest2\scripts\cc-project.xml:44: The following error occurred while executing
this line: C:\harmony\buildtest2\adaptors\classlib-test\adaptor.xml:66: C:\harmony\buildtest2\build\checkouts\classlib\build\test_report
not found.

Date of build:	05/15/2007 00:37:16
Time to build:	4 seconds

***********************************************************
Errors/Warnings:	(14)
            
BUILD FAILED
C:\harmony\buildtest2\build\checkouts\classlib\build.xml:169: The following error occurred
while executing this line:
C:\harmony\buildtest2\build\checkouts\classlib\make\build-test.xml:169: The following error
occurred while executing this line:
C:\harmony\buildtest2\build\checkouts\classlib\make\depends.xml:89: The following error occurred
while executing this line:
C:\harmony\buildtest2\build\checkouts\classlib\make\depends.xml:405: ...
Missing dependency.  The jar from:
http://people.apache.org/~geirm/harmony/swing_awt_deps_winxp_2006-09-28.tgz
should be downloaded to:
depends/libs/windows.x86/swing_awt_deps_winxp_2006-09-28.tgz
Run "ant fetch-depends" to automatically fetch dependencies.
Note: Some of Harmony's dependencies are licensed under terms other
than the Apache License v2.
Total time: 2 seconds

***********************************************************
Unit Tests: (0)
        
No Tests Run: This project doesn't have any tests

***********************************************************
Modifications since last successful build:	(0)
            


Mime
View raw message