harmony-alerts mailing list archives

Site index · List index
Message view « Date » · « Thread »
Top « Date » · « Thread »
From nom...@intel.com
Subject [build-test alert] BUILD FAILED Linux SUSE 9 gcc debug: classlib over drlvm
Date Thu, 10 May 2007 07:36:33 GMT
BUILD FAILED:
	Ant Error Message:
/export/cruise/trunk/cc/projects/classlib/trunk/build.xml:169: The following error occurred
while executing this line: /export/cruise/trunk/cc/projects/classlib/trunk/make/build-test.xml:142:
There were test crashes: /export/cruise/trunk/cc/projects/classlib/trunk/build/test_report/TEST-java.awt.AccessibleAWTContainerTest.xml

Date of build:	05/10/2007 13:56:49
Time to build:	39 minutes 18 seconds
Last changed:	05/10/2007 13:35:51
Last log entry:	Apply patch for HARMONY-3830([classlib][beans]java.beans.beancontext.BeanContextServicesSupport.addService(Class
serviceClass, BeanContextServiceProvider bcsp, boolean fireEvent) should return true even
if fireEvent = false)

***********************************************************
Execution log (errors/warnings messages):	

========================================
Testing class libraries...
========================================
Checking for depends/jars/yoko_M2-20070130/yoko.jar
Checking for depends/jars/yoko_M2-20070130/yoko-core.jar
Checking for depends/jars/yoko_M2-20070130/yoko-rmi-impl.jar
Checking for depends/jars/yoko_M2-20070130/yoko-rmi-spec.jar
Checking for depends/jars/bcel-5.2/bcel-5.2.jar
Checking for depends/jars/xalan-j_2.7.0/xalan.jar
Checking for depends/jars/xerces_2.9.0/xerces.zip
Checking for depends/jars/junit_3.8.2/junit.jar
Checking for depends/jars/bcprov-jdk15-136/bcprov.jar
Checking for depends/jars/icu4j_3.4.4/icu4j_3_4_4.jar
Checking for depends/jars/mx4j_3.0.2/mx4j.zip
Checking for depends/jars/jetty/jetty-6.0.0.jar
Checking for depends/jars/jetty/jetty-util-6.0.0.jar
Checking for depends/jars/jetty/servlet-api-2.5-6.0.0.jar
Checking for depends/libs/build/lcms/icc34.h
Checking for depends/libs/build/lcms/lcms.h
Checking for depends/libs/build/png/pngconf.h
Checking for depends/libs/build/png/png.h
Checking for depends/libs/build/jpeg/jconfig.lnx
Checking for depends/libs/build/jpeg/jpeglib.h
Checking for depends/libs/build/jpeg/jmorecfg.h
Checking for depends/libs/build/jpeg/jerror.h
Checking for depends/libs/build/lcms/liblcms.linux.x86
Checking for depends/libs/build/png/libpng.linux.x86
Checking for depends/libs/build/jpeg/libjpeg.linux.x86
hy.test.vm.name = drl
Compiling ACCESSIBILITY classes
Compiling ACCESSIBILITY tests
Since fork is false, ignoring memoryMaximumSize setting
Compiling ANNOTATION classes
Compiling ANNOTATION tests
Since fork is false, ignoring memoryMaximumSize setting
----------
1. WARNING in /export/cruise/trunk/cc/projects/classlib/trunk/modules/annotation/src/test/java/org/apache/harmony/annotation/tests/java/lang/annotation/IncompleteAnnotationExceptionTest.java
 (at line 53)
	clazz, elementName);
	^^^^^
Type safety: The expression of type Class needs unchecked conversion to conform to Class<?
extends Annotation>
----------
1 problem (1 warning)
Compiling APPLET classes
Compiling APPLET tests
Since fork is false, ignoring memoryMaximumSize setting
Compiling ARCHIVE classes
Compiling ARCHIVE tests
Since fork is false, ignoring memoryMaximumSize setting
Compiling AUTH classes
Compiling AUTH tests
Since fork is false, ignoring memoryMaximumSize setting
Compiling AWT classes
Compiling AWT tests
Since fork is false, ignoring memoryMaximumSize setting
SIGSEGV in VM code.
Stack trace:
Compiling BEANS classes
Compiling support classes for BEANS tests
Compiling internal BEANS tests
Compiling BEANS tests
Since fork is false, ignoring memoryMaximumSize setting
Running internal BEANS tests
Running BEANS tests
Compiling CRYPTO classes
Compiling CRYPTO test support files
Compiling CRYPTO api tests
Since fork is false, ignoring memoryMaximumSize setting
Compiling CRYPTO api injected tests
Since fork is false, ignoring memoryMaximumSize setting
Compiling CRYPTO impl injected tests
Since fork is false, ignoring memoryMaximumSize setting
Compiling CRYPTO impl tests
Since fork is false, ignoring memoryMaximumSize setting
Running CRYPTO api tests
Running CRYPTO api.injected tests
Running CRYPTO impl tests
Running CRYPTO impl injected tests
Compiling ImageIO classes
Compiling ImageIO tests
Since fork is false, ignoring memoryMaximumSize setting
Compiling INSTRUMENT classes
Compiling INSTRUMENT tests
Since fork is false, ignoring memoryMaximumSize setting
Compiling JNDI classes
Compiling JNDI tests
Since fork is false, ignoring memoryMaximumSize setting
Compiling LANG-MANAGEMENT classes
Compiling LANG-MANAGEMENT API tests
Since fork is false, ignoring memoryMaximumSize setting
Compiling LANG-MANAGEMENT Implementation tests
Since fork is false, ignoring memoryMaximumSize setting
Compiling LOGGING classes
Compiling LOGGING tests
Since fork is false, ignoring memoryMaximumSize setting
Compiling LUNI classes
Compiling LUNI JUnit Tests
Since fork is false, ignoring memoryMaximumSize setting
Running LUNI JUnit Tests
java.io.IOException: Stream is closed
	at java.io.BufferedInputStream.read(BufferedInputStream.java:247)
	at java.io.FilterInputStream.read(FilterInputStream.java:137)
	at tests.support.Support_Exec$1.run(Support_Exec.java:177)
	at java.lang.Thread.run(Thread.java:661)
2007-05-10 14:13:04.674::INFO:  Logging to STDERR via org.mortbay.log.StdErrLog
2007-05-10 14:13:04.930::INFO:  jetty-6.0.x
2007-05-10 14:13:05.213::INFO:  Started SocketConnector @ 0.0.0.0:36432
2007-05-10 14:13:46.484::INFO:  jetty-6.0.x
2007-05-10 14:13:46.489::INFO:  Started SocketConnector @ 0.0.0.0:36541
2007-05-10 14:13:47.016::INFO:  jetty-6.0.x
2007-05-10 14:13:47.018::INFO:  Started SocketConnector @ 0.0.0.0:36550
Compiling MATH classes
Compiling MATH tests
Since fork is false, ignoring memoryMaximumSize setting
Compiling MISC classes
Compiling MISC tests
Since fork is false, ignoring memoryMaximumSize setting
Compiling NIO classes
Compiling NIO tests
Since fork is false, ignoring memoryMaximumSize setting
Compiling NIO_CHAR classes
Compiling NIO_CHAR tests
Since fork is false, ignoring memoryMaximumSize setting
Cannot find unmappable byte array for US-ASCII
Cannot find unmappable byte array for gb18030
Cannot find unmappable byte array for ISO-8859-1
Cannot find malform byte array for ISO-8859-1
Cannot find unmappable byte array for UTF-16BE
Cannot find malform byte array for UTF-16BE
Cannot find unmappable byte array for UTF-16
Cannot find malform byte array for UTF-16
Cannot find unmappable byte array for UTF-16LE
Cannot find malform byte array for UTF-16LE
Cannot find unmappable byte array for UTF-8
Compiling PACK200 classes
Compiling PACK200 tests
Since fork is false, ignoring memoryMaximumSize setting
Running PACK200 tests
init: passed
hyerror: passed
hytime: passed
hyfile: passed
Compiling PREFS classes
Compiling PREFS tests
Since fork is false, ignoring memoryMaximumSize setting
Compiling PRINT classes
Compiling Print tests
Since fork is false, ignoring memoryMaximumSize setting
java.net.ConnectException: localhost/127.0.0.1:631 - Connection refused
	at org.apache.harmony.luni.net.PlainSocketImpl.connect(PlainSocketImpl.java:229)
	at org.apache.harmony.luni.net.PlainSocketImpl.connect(PlainSocketImpl.java:509)
	at java.net.Socket.connect(Socket.java:932)
	at org.apache.harmony.luni.internal.net.www.protocol.http.HttpURLConnection.getHTTPConnection(HttpURLConnection.java:635)
	at org.apache.harmony.luni.internal.net.www.protocol.http.HttpURLConnection.connect(HttpURLConnection.java:619)
	at org.apache.harmony.x.print.ipp.IppClient.request(IppClient.java:111)
	at org.apache.harmony.x.print.ipp.IppClient.request(IppClient.java:87)
	at org.apache.harmony.x.print.cups.CUPSPrintServiceProvider.findDefaultPrintService(CUPSPrintServiceProvider.java:471)
	at org.apache.harmony.x.print.cups.CUPSPrintServiceProvider.getDefaultPrintService(CUPSPrintServiceProvider.java:169)
	at javax.print.PrintServiceLookup.lookupDefaultPrintService(PrintServiceLookup.java:139)
	at javax.print.attribute.HashAttributeTest.testAdd2(HashAttributeTest.java:128)
	at java.lang.reflect.VMReflection.invokeMethod(VMReflection.java)
	at java.lang.reflect.Method.invoke(Method.java:382)
	at junit.framework.TestCase.runTest(TestCase.java:154)
	at junit.framework.TestCase.runBare(TestCase.java:127)
	at junit.framework.TestResult$1.protect(TestResult.java:106)
	at junit.framework.TestResult.runProtected(TestResult.java:124)
	at junit.framework.TestResult.run(TestResult.java:109)
	at junit.framework.TestCase.run(TestCase.java:118)
	at junit.framework.TestSuite.runTest(TestSuite.java:208)
	at junit.framework.TestSuite.run(TestSuite.java:203)
	at org.apache.tools.ant.taskdefs.optional.junit.JUnitTestRunner.run(JUnitTestRunner.java:297)
	at org.apache.tools.ant.taskdefs.optional.junit.JUnitTestRunner.launch(JUnitTestRunner.java:672)
	at org.apache.tools.ant.taskdefs.optional.junit.JUnitTestRunner.main(JUnitTestRunner.java:546)
java.net.ConnectException: localhost/127.0.0.1:631 - Connection refused
	at org.apache.harmony.luni.net.PlainSocketImpl.connect(PlainSocketImpl.java:229)
	at org.apache.harmony.luni.net.PlainSocketImpl.connect(PlainSocketImpl.java:509)
	at java.net.Socket.connect(Socket.java:932)
	at org.apache.harmony.luni.internal.net.www.protocol.http.HttpURLConnection.getHTTPConnection(HttpURLConnection.java:635)
	at org.apache.harmony.luni.internal.net.www.protocol.http.HttpURLConnection.connect(HttpURLConnection.java:619)
	at org.apache.harmony.x.print.ipp.IppClient.request(IppClient.java:111)
	at org.apache.harmony.x.print.ipp.IppClient.request(IppClient.java:87)
	at org.apache.harmony.x.print.cups.CUPSPrintServiceProvider.findDefaultPrintService(CUPSPrintServiceProvider.java:471)
	at org.apache.harmony.x.print.cups.CUPSPrintServiceProvider.getDefaultPrintService(CUPSPrintServiceProvider.java:169)
	at javax.print.PrintServiceLookup.lookupDefaultPrintService(PrintServiceLookup.java:139)
	at javax.print.attribute.HashAttributeTest.testEquals(HashAttributeTest.java:284)
	at java.lang.reflect.VMReflection.invokeMethod(VMReflection.java)
	at java.lang.reflect.Method.invoke(Method.java:382)
	at junit.framework.TestCase.runTest(TestCase.java:154)
	at junit.framework.TestCase.runBare(TestCase.java:127)
	at junit.framework.TestResult$1.protect(TestResult.java:106)
	at junit.framework.TestResult.runProtected(TestResult.java:124)
	at junit.framework.TestResult.run(TestResult.java:109)
	at junit.framework.TestCase.run(TestCase.java:118)
	at junit.framework.TestSuite.runTest(TestSuite.java:208)
	at junit.framework.TestSuite.run(TestSuite.java:203)
	at org.apache.tools.ant.taskdefs.optional.junit.JUnitTestRunner.run(JUnitTestRunner.java:297)
	at org.apache.tools.ant.taskdefs.optional.junit.JUnitTestRunner.launch(JUnitTestRunner.java:672)
	at org.apache.tools.ant.taskdefs.optional.junit.JUnitTestRunner.main(JUnitTestRunner.java:546)
java.net.ConnectException: localhost/127.0.0.1:631 - Connection refused
	at org.apache.harmony.luni.net.PlainSocketImpl.connect(PlainSocketImpl.java:229)
	at org.apache.harmony.luni.net.PlainSocketImpl.connect(PlainSocketImpl.java:509)
	at java.net.Socket.connect(Socket.java:932)
	at org.apache.harmony.luni.internal.net.www.protocol.http.HttpURLConnection.getHTTPConnection(HttpURLConnection.java:635)
	at org.apache.harmony.luni.internal.net.www.protocol.http.HttpURLConnection.connect(HttpURLConnection.java:619)
	at org.apache.harmony.x.print.ipp.IppClient.request(IppClient.java:111)
	at org.apache.harmony.x.print.ipp.IppClient.request(IppClient.java:87)
	at org.apache.harmony.x.print.cups.CUPSPrintServiceProvider.findDefaultPrintService(CUPSPrintServiceProvider.java:471)
	at org.apache.harmony.x.print.cups.CUPSPrintServiceProvider.getDefaultPrintService(CUPSPrintServiceProvider.java:169)
	at javax.print.PrintServiceLookup.lookupDefaultPrintService(PrintServiceLookup.java:139)
	at javax.print.attribute.HashAttributeTest.testAdd2(HashAttributeTest.java:128)
	at java.lang.reflect.VMReflection.invokeMethod(VMReflection.java)
	at java.lang.reflect.Method.invoke(Method.java:382)
	at junit.framework.TestCase.runTest(TestCase.java:154)
	at junit.framework.TestCase.runBare(TestCase.java:127)
	at junit.framework.TestResult$1.protect(TestResult.java:106)
	at junit.framework.TestResult.runProtected(TestResult.java:124)
	at junit.framework.TestResult.run(TestResult.java:109)
	at junit.framework.TestCase.run(TestCase.java:118)
	at junit.framework.TestSuite.runTest(TestSuite.java:208)
	at junit.framework.TestSuite.run(TestSuite.java:203)
	at junit.framework.TestSuite.runTest(TestSuite.java:208)
	at junit.framework.TestSuite.run(TestSuite.java:203)
	at org.apache.tools.ant.taskdefs.optional.junit.JUnitTestRunner.run(JUnitTestRunner.java:297)
	at org.apache.tools.ant.taskdefs.optional.junit.JUnitTestRunner.launch(JUnitTestRunner.java:672)
	at org.apache.tools.ant.taskdefs.optional.junit.JUnitTestRunner.main(JUnitTestRunner.java:546)
java.net.ConnectException: localhost/127.0.0.1:631 - Connection refused
	at org.apache.harmony.luni.net.PlainSocketImpl.connect(PlainSocketImpl.java:229)
	at org.apache.harmony.luni.net.PlainSocketImpl.connect(PlainSocketImpl.java:509)
	at java.net.Socket.connect(Socket.java:932)
	at org.apache.harmony.luni.internal.net.www.protocol.http.HttpURLConnection.getHTTPConnection(HttpURLConnection.java:635)
	at org.apache.harmony.luni.internal.net.www.protocol.http.HttpURLConnection.connect(HttpURLConnection.java:619)
	at org.apache.harmony.x.print.ipp.IppClient.request(IppClient.java:111)
	at org.apache.harmony.x.print.ipp.IppClient.request(IppClient.java:87)
	at org.apache.harmony.x.print.cups.CUPSPrintServiceProvider.findDefaultPrintService(CUPSPrintServiceProvider.java:471)
	at org.apache.harmony.x.print.cups.CUPSPrintServiceProvider.getDefaultPrintService(CUPSPrintServiceProvider.java:169)
	at javax.print.PrintServiceLookup.lookupDefaultPrintService(PrintServiceLookup.java:139)
	at javax.print.attribute.HashAttributeTest.testEquals(HashAttributeTest.java:284)
	at java.lang.reflect.VMReflection.invokeMethod(VMReflection.java)
	at java.lang.reflect.Method.invoke(Method.java:382)
	at junit.framework.TestCase.runTest(TestCase.java:154)
	at junit.framework.TestCase.runBare(TestCase.java:127)
	at junit.framework.TestResult$1.protect(TestResult.java:106)
	at junit.framework.TestResult.runProtected(TestResult.java:124)
	at junit.framework.TestResult.run(TestResult.java:109)
	at junit.framework.TestCase.run(TestCase.java:118)
	at junit.framework.TestSuite.runTest(TestSuite.java:208)
	at junit.framework.TestSuite.run(TestSuite.java:203)
	at junit.framework.TestSuite.runTest(TestSuite.java:208)
	at junit.framework.TestSuite.run(TestSuite.java:203)
	at org.apache.tools.ant.taskdefs.optional.junit.JUnitTestRunner.run(JUnitTestRunner.java:297)
	at org.apache.tools.ant.taskdefs.optional.junit.JUnitTestRunner.launch(JUnitTestRunner.java:672)
	at org.apache.tools.ant.taskdefs.optional.junit.JUnitTestRunner.main(JUnitTestRunner.java:546)
Compiling REGEX classes
Compiling REGEX tests
Since fork is false, ignoring memoryMaximumSize setting
Compiling RMI classes
Compiling RMI api tests
Since fork is false, ignoring memoryMaximumSize setting
Running RMI api tests
testDirectSocket_SingleVM starting
Test server started.
Object: MyRemoteObject[UnicastServerRef[endpoint:[[10.125.122.35:37197]](local), ObjID[65536,
UID[68:11274dd078a:-8000]]]] created and exported.
May 10, 2007 2:21:25 PM org.apache.harmony.rmi.server.RMIReference makeStrong
FINER: main: Strongly referenced RegistryImpl
Registry created.
Object bound in the registry.
Registry located.
May 10, 2007 2:21:27 PM org.apache.harmony.rmi.client.ClientConnection sendDGCAck
FINER: main: Sent DGC ack to [localhost:1099] for UID[68:11274dd078a:-7ffd]
Lookup object is: Proxy[interf:[org.apache.harmony.rmi.test.MyRemoteInterface, java.rmi.Remote],
RemoteObjectInvocationHandler[UnicastRef[endpoint:[[10.125.122.35:37197]](remote), ObjID[65536,
UID[68:11274dd078a:-8000]]]]]
Testing test_String_Void...
Done.
Testing test_Void_String...
Returned: MyRemoteObject.test_Void_String
Done.
Testing test_Int_Void...
Done.
Testing test_Void_Int...
Returned: 987654321
Done.
Testing test_Remote_Void...
Done.
Testing test_Remote_Void with remote object extending another remote object...
Done.
Testing test_Void_Remote...
May 10, 2007 2:21:28 PM org.apache.harmony.rmi.client.ClientConnection sendDGCAck
FINER: main: Sent DGC ack to [10.125.122.35:37197] for UID[68:11274dd078a:-7fe8]
Returned: Proxy[interf:[org.apache.harmony.rmi.test.MyRemoteInterface2, java.rmi.Remote],
RemoteObjectInvocationHandler[UnicastRef[endpoint:[[10.125.122.35:37205]](remote), ObjID[65539,
UID[68:11274dd078a:-7fe9]]]]]
Done.
Testing test_Long_Long...
Returned: 998877665544332211
Done.
Testing test_String_String...
Returned: MyRemoteObject.test_String_String
Done.
Testing test_Remote_Remote...
May 10, 2007 2:21:28 PM org.apache.harmony.rmi.client.ClientConnection sendDGCAck
FINER: main: Sent DGC ack to [10.125.122.35:37197] for UID[68:11274dd078a:-7fde]
Returned: Proxy[interf:[org.apache.harmony.rmi.test.MyRemoteInterface2, java.rmi.Remote],
RemoteObjectInvocationHandler[UnicastRef[endpoint:[[10.125.122.35:37209]](remote), ObjID[65541,
UID[68:11274dd078a:-7fdf]]]]]
Done.
Testing test_RemoteString_Void...
Done.
Testing test_RemoteRemote_Remote...
May 10, 2007 2:21:28 PM org.apache.harmony.rmi.client.ClientConnection sendDGCAck
FINER: main: Sent DGC ack to [10.125.122.35:37197] for UID[68:11274dd078a:-7fd0]
Returned: Proxy[interf:[org.apache.harmony.rmi.test.MyRemoteInterface2, java.rmi.Remote],
RemoteObjectInvocationHandler[UnicastRef[endpoint:[[10.125.122.35:37216]](remote), ObjID[65545,
UID[68:11274dd078a:-7fd1]]]]]
Done.
Testing test_BooleanStringRemote_Void...
Done.
Testing test_Proxy_Void...
Done.
Testing test_Array_Void...
Done.
Testing test_Void_Array...
Done.
Testing test_RemoteArray_Void...
Done.
Testing test_Void_RemoteArray...
May 10, 2007 2:21:29 PM org.apache.harmony.rmi.client.ClientConnection sendDGCAck
FINER: main: Sent DGC ack to [10.125.122.35:37197] for UID[68:11274dd078a:-7fbd]
Done.
Testing test_Exception...
org.apache.harmony.rmi.test.MyException: MyRemoteObject.test_Exception
Done.
Testing test_Error...
java.rmi.ServerError: Error occurred while remote method invocation; nested exception is:
	java.lang.Error: MyRemoteObject.test_Error
Done.
Testing test_RuntimeException...
java.lang.RuntimeException: MyRemoteObject.text_RuntimeException
Done.
Testing test_RemoteException...
java.rmi.ServerException: RemoteException occurred while remote method invocation; nested
exception is:
	java.rmi.RemoteException: MyRemoteObject.text_RemoteException
Done.
Test server complete.
Test server closing.
Unexporting MyRemoteObject[UnicastServerRef[endpoint:[[10.125.122.35:37197]](local), ObjID[65536,
UID[68:11274dd078a:-8000]]]] ...
Done.
Unexporting MyRemoteObject1[UnicastServerRef[endpoint:[[10.125.122.35:37201]](local), ObjID[65537,
UID[68:11274dd078a:-7ff4]]]] ...
Done.
Unexporting MyRemoteObject4[UnicastServerRef[endpoint:[[10.125.122.35:37203]](local), ObjID[65538,
UID[68:11274dd078a:-7fef]]]] ...
Done.
Unexporting MyRemoteObject1[UnicastServerRef[endpoint:[[10.125.122.35:37207]](local), ObjID[65540,
UID[68:11274dd078a:-7fe3]]]] ...
Done.
Unexporting MyRemoteObject1[UnicastServerRef[endpoint:[[10.125.122.35:37210]](local), ObjID[65542,
UID[68:11274dd078a:-7fdd]]]] ...
Done.
Unexporting MyRemoteObject1[UnicastServerRef[endpoint:[[10.125.122.35:37212]](local), ObjID[65543,
UID[68:11274dd078a:-7fd8]]]] ...
Done.
Unexporting MyRemoteObject3[UnicastServerRef[endpoint:[[10.125.122.35:37213]](local), ObjID[65544,
UID[68:11274dd078a:-7fd7]]]] ...
Done.
Unexporting MyRemoteObject1[UnicastServerRef[endpoint:[[10.125.122.35:37217]](local), ObjID[65546,
UID[68:11274dd078a:-7fcf]]]] ...
Done.
Unexporting MyRemoteObject1[UnicastServerRef[endpoint:[[10.125.122.35:37219]](local), ObjID[65547,
UID[68:11274dd078a:-7fc4]]]] ...
Done.
Unexporting MyRemoteObject1[UnicastServerRef[endpoint:[[10.125.122.35:37220]](local), ObjID[65548,
UID[68:11274dd078a:-7fc3]]]] ...
Done.
Unexporting RegistryImpl ...
Done.
Test server exiting.
testDirectHTTP_SingleVM starting
Test server started.
Object: MyRemoteObject[UnicastServerRef[endpoint:[[10.125.122.35:37225]](local), ObjID[65536,
UID[68:11274dd34ff:-8000]]]] created and exported.
May 10, 2007 2:21:37 PM org.apache.harmony.rmi.server.RMIReference makeStrong
FINER: main: Strongly referenced RegistryImpl
Registry created.
Object bound in the registry.
Registry located.
May 10, 2007 2:21:39 PM org.apache.harmony.rmi.client.ClientConnection sendDGCAck
FINER: main: Sent DGC ack to [localhost:1099] for UID[68:11274dd34ff:-7ffd]
Lookup object is: Proxy[interf:[org.apache.harmony.rmi.test.MyRemoteInterface, java.rmi.Remote],
RemoteObjectInvocationHandler[UnicastRef[endpoint:[[10.125.122.35:37225]](remote), ObjID[65536,
UID[68:11274dd34ff:-8000]]]]]
Testing test_String_Void...
Done.
Testing test_Void_String...
Returned: MyRemoteObject.test_Void_String
Done.
Testing test_Int_Void...
Done.
Testing test_Void_Int...
Returned: 987654321
Done.
Testing test_Remote_Void...
Done.
Testing test_Remote_Void with remote object extending another remote object...
Done.
Testing test_Void_Remote...
May 10, 2007 2:21:40 PM org.apache.harmony.rmi.client.ClientConnection sendDGCAck
FINER: main: Sent DGC ack to [10.125.122.35:37225] for UID[68:11274dd34ff:-7fe8]
Returned: Proxy[interf:[org.apache.harmony.rmi.test.MyRemoteInterface2, java.rmi.Remote],
RemoteObjectInvocationHandler[UnicastRef[endpoint:[[10.125.122.35:37233]](remote), ObjID[65539,
UID[68:11274dd34ff:-7fe9]]]]]
Done.
Testing test_Long_Long...
Returned: 998877665544332211
Done.
Testing test_String_String...
Returned: MyRemoteObject.test_String_String
Done.
Testing test_Remote_Remote...
May 10, 2007 2:21:40 PM org.apache.harmony.rmi.client.ClientConnection sendDGCAck
FINER: main: Sent DGC ack to [10.125.122.35:37225] for UID[68:11274dd34ff:-7fde]
Returned: Proxy[interf:[org.apache.harmony.rmi.test.MyRemoteInterface2, java.rmi.Remote],
RemoteObjectInvocationHandler[UnicastRef[endpoint:[[10.125.122.35:37237]](remote), ObjID[65541,
UID[68:11274dd34ff:-7fdf]]]]]
Done.
Testing test_RemoteString_Void...
Done.
Testing test_RemoteRemote_Remote...
May 10, 2007 2:21:40 PM org.apache.harmony.rmi.client.ClientConnection sendDGCAck
FINER: main: Sent DGC ack to [10.125.122.35:37225] for UID[68:11274dd34ff:-7fd0]
Returned: Proxy[interf:[org.apache.harmony.rmi.test.MyRemoteInterface2, java.rmi.Remote],
RemoteObjectInvocationHandler[UnicastRef[endpoint:[[10.125.122.35:37244]](remote), ObjID[65545,
UID[68:11274dd34ff:-7fd1]]]]]
Done.
Testing test_BooleanStringRemote_Void...
Done.
Testing test_Proxy_Void...
Done.
Testing test_Array_Void...
Done.
Testing test_Void_Array...
Done.
Testing test_RemoteArray_Void...
Done.
Testing test_Void_RemoteArray...
May 10, 2007 2:21:41 PM org.apache.harmony.rmi.client.ClientConnection sendDGCAck
FINER: main: Sent DGC ack to [10.125.122.35:37225] for UID[68:11274dd34ff:-7fbd]
Done.
Testing test_Exception...
org.apache.harmony.rmi.test.MyException: MyRemoteObject.test_Exception
Done.
Testing test_Error...
java.rmi.ServerError: Error occurred while remote method invocation; nested exception is:
	java.lang.Error: MyRemoteObject.test_Error
Done.
Testing test_RuntimeException...
java.lang.RuntimeException: MyRemoteObject.text_RuntimeException
Done.
Testing test_RemoteException...
java.rmi.ServerException: RemoteException occurred while remote method invocation; nested
exception is:
	java.rmi.RemoteException: MyRemoteObject.text_RemoteException
Done.
Test server complete.
Test server closing.
Unexporting MyRemoteObject[UnicastServerRef[endpoint:[[10.125.122.35:37225]](local), ObjID[65536,
UID[68:11274dd34ff:-8000]]]] ...
Done.
Unexporting MyRemoteObject1[UnicastServerRef[endpoint:[[10.125.122.35:37229]](local), ObjID[65537,
UID[68:11274dd34ff:-7ff4]]]] ...
Done.
Unexporting MyRemoteObject4[UnicastServerRef[endpoint:[[10.125.122.35:37231]](local), ObjID[65538,
UID[68:11274dd34ff:-7fef]]]] ...
Done.
Unexporting MyRemoteObject1[UnicastServerRef[endpoint:[[10.125.122.35:37235]](local), ObjID[65540,
UID[68:11274dd34ff:-7fe3]]]] ...
Done.
Unexporting MyRemoteObject1[UnicastServerRef[endpoint:[[10.125.122.35:37238]](local), ObjID[65542,
UID[68:11274dd34ff:-7fdd]]]] ...
Done.
Unexporting MyRemoteObject1[UnicastServerRef[endpoint:[[10.125.122.35:37240]](local), ObjID[65543,
UID[68:11274dd34ff:-7fd8]]]] ...
Done.
Unexporting MyRemoteObject3[UnicastServerRef[endpoint:[[10.125.122.35:37241]](local), ObjID[65544,
UID[68:11274dd34ff:-7fd7]]]] ...
Done.
Unexporting MyRemoteObject1[UnicastServerRef[endpoint:[[10.125.122.35:37245]](local), ObjID[65546,
UID[68:11274dd34ff:-7fcf]]]] ...
Done.
Unexporting MyRemoteObject1[UnicastServerRef[endpoint:[[10.125.122.35:37247]](local), ObjID[65547,
UID[68:11274dd34ff:-7fc4]]]] ...
Done.
Unexporting MyRemoteObject1[UnicastServerRef[endpoint:[[10.125.122.35:37248]](local), ObjID[65548,
UID[68:11274dd34ff:-7fc3]]]] ...
Done.
Unexporting RegistryImpl ...
Done.
Test server exiting.
Unexporting MyRemoteObject1[UnicastServerRef[endpoint:[[10.125.122.35:37253]](local), ObjID[65536,
UID[108:11274dd5fde:-7ff7]]]] ...
Done.
Unexporting MyRemoteObject1[UnicastServerRef[endpoint:[[10.125.122.35:37254]](local), ObjID[65537,
UID[108:11274dd5fde:-7ff6]]]] ...
Done.
Unexporting MyRemoteObject1[UnicastServerRef[endpoint:[[10.125.122.35:37255]](local), ObjID[65538,
UID[108:11274dd5fde:-7ff5]]]] ...
Done.
Unexporting MyRemoteObject1[UnicastServerRef[endpoint:[[10.125.122.35:37256]](local), ObjID[65539,
UID[108:11274dd5fde:-7ff4]]]] ...
Done.
Unexporting MyRemoteObject1[UnicastServerRef[endpoint:[[10.125.122.35:37257]](local), ObjID[65540,
UID[108:11274dd5fde:-7ff3]]]] ...
Done.
Unexporting MyRemoteObject1[UnicastServerRef[endpoint:[[10.125.122.35:37258]](local), ObjID[65541,
UID[108:11274dd5fde:-7ff2]]]] ...
Done.
Unexporting MyRemoteObject1[UnicastServerRef[endpoint:[[10.125.122.35:37259]](local), ObjID[65542,
UID[108:11274dd5fde:-7ff1]]]] ...
Done.
Unexporting MyRemoteObject1[UnicastServerRef[endpoint:[[10.125.122.35:37260]](local), ObjID[65543,
UID[108:11274dd5fde:-7ff0]]]] ...
Done.
LogStream[tst]:
Compiling SECURITY classes
Compiling SECURITY test support files
Since fork is false, ignoring memoryMaximumSize setting
Compiling SECURITY api tests
Since fork is false, ignoring memoryMaximumSize setting
Compiling SECURITY api injected tests
Since fork is false, ignoring memoryMaximumSize setting
Compiling SECURITY impl injected tests
Since fork is false, ignoring memoryMaximumSize setting
Compiling SECURITY impl tests
Since fork is false, ignoring memoryMaximumSize setting
Running SECURITY api tests
Running SECURITY api.injected tests
Running SECURITY impl tests
Running SECURITY impl injected tests
Compiling SOUND classes
Compiling SOUND tests
Since fork is false, ignoring memoryMaximumSize setting
Compiling SQL classes
Compiling SQL tests
Since fork is false, ignoring memoryMaximumSize setting
Compiling Sun Compat classes
Compiling SUNCOMPAT tests
Compiling TEXT classes
Compiling TEXT tests
Since fork is false, ignoring memoryMaximumSize setting
Compiling X-NET classes
Compiling X-NET test support files
Compiling X-NET api tests
Since fork is false, ignoring memoryMaximumSize setting
Compiling X-NET impl injected tests
Since fork is false, ignoring memoryMaximumSize setting
Compiling X-NET impl tests
Since fork is false, ignoring memoryMaximumSize setting
Running X-NET api tests
Running X-NET impl tests
Running X-NET impl injected tests
The test report is in /export/cruise/trunk/cc/projects/classlib/trunk/build/test_report/html/index.html

***********************************************************
Unit Tests: (14925)
        
error: java.awt.AccessibleAWTContainerTest vmcrash.CrashedTests
Unit Test Error Details:	(1)
                
Test: java.awt.AccessibleAWTContainerTestClass: vmcrash.CrashedTests

***********************************************************
Modifications since last successful build:	(2)
            
modified pyang  /harmony/enhanced/classlib/trunk/modules/beans/src/test/java/org/apache/harmony/beans/tests/java/beans/beancontext/BeanContextServicesSupportTest.java
05/10/2007 13:35:51 Apply patch for HARMONY-3830([classlib][beans]java.beans.beancontext.BeanContextServicesSupport.addService(Class
serviceClass, BeanContextServiceProvider bcsp, boolean fireEvent) should return true even
if fireEvent = false)
modified pyang  /harmony/enhanced/classlib/trunk/modules/beans/src/main/java/java/beans/beancontext/BeanContextServicesSupport.java
05/10/2007 13:35:51 Apply patch for HARMONY-3830([classlib][beans]java.beans.beancontext.BeanContextServicesSupport.addService(Class
serviceClass, BeanContextServiceProvider bcsp, boolean fireEvent) should return true even
if fireEvent = false)

Mime
View raw message