harmony-alerts mailing list archives

Site index · List index
Message view « Date » · « Thread »
Top « Date » · « Thread »
From nom...@hursley.ibm.com
Subject [continuum] BUILD FAILURE: Classlib/linux.ia32 Build/Test
Date Thu, 03 May 2007 08:18:34 GMT
Online report : http://people.apache.org/~hindessm/continuum/classlib/linux.ia32/2007/05/03/20070503-081834.failure.log.gz
Build statistics:
  State: Failed
  Previous State: Failed
  Started at: Thu, 3 May 2007 09:08:41 +0100
  Finished at: Thu, 3 May 2007 09:18:30 +0100
  Total time: 9m 49s
  Build Trigger: Schedule
  Exit code: 1
  Building machine hostname: hy2
  Operating system : Linux(unknown)
  Java version : 1.5.0_06(Sun Microsystems Inc.)

Changes
                            classlib/modules/luni/src/main/java/java/io/ObjectInputStream.java
            classlib/modules/luni/src/main/java/java/io/DataInputStream.java
            classlib/modules/luni/src/main/java/java/io/ObjectOutputStream.java
            classlib/modules/luni/src/main/java/java/io/DataOutputStream.java
            classlib/modules/luni/src/main/java/java/io/ObjectStreamClass.java
        
****************************************************************************
Output:
****************************************************************************
Buildfile: build.xml

svn-prop:

build:
   [delete] Deleting directory /home/hybld/continuum-working-directory/6/classlib/deploy
     [echo] Classlib revision is 534749
     [echo] Post process: true
     [echo] JAPI: true
     [echo] Building with reference jdk/javac
     [exec] Buildfile: build.xml

     [exec] -init-hdk-for-clean:
     [exec]     [mkdir] Created dir: /home/hybld/continuum-working-directory/6/classlib/deploy/build/ant
     [exec]      [copy] Copying 1 file to /home/hybld/continuum-working-directory/6/classlib/deploy/build/ant

     [exec] clean-java:

     [exec] -modules-clean-bin:

     [exec] clean:
     [exec]    [delete] Deleting 30 files from /home/hybld/continuum-working-directory/6/classlib/build/classes
     [exec]    [delete] Deleting 12 files from /home/hybld/continuum-working-directory/6/classlib/modules/accessibility/bin/test

     [exec] clean:
     [exec]    [delete] Deleting 13 files from /home/hybld/continuum-working-directory/6/classlib/build/classes

     [exec] clean:
     [exec]    [delete] Deleting 35 files from /home/hybld/continuum-working-directory/6/classlib/build/classes

     [exec] clean:
     [exec]    [delete] Deleting 42 files from /home/hybld/continuum-working-directory/6/classlib/build/classes

     [exec] clean-native-includes:
     [exec]    [delete] /home/hybld/continuum-working-directory/6/classlib/deploy/include
not found.

     [exec] clean:
     [exec]    [delete] Deleting 112 files from /home/hybld/continuum-working-directory/6/classlib/build/classes

     [exec] clean:
     [exec]    [delete] Deleting 909 files from /home/hybld/continuum-working-directory/6/classlib/build/classes

     [exec] clean:
     [exec]    [delete] Deleting 107 files from /home/hybld/continuum-working-directory/6/classlib/build/classes

     [exec] clean:
     [exec]    [delete] Deleting 125 files from /home/hybld/continuum-working-directory/6/classlib/build/classes
     [exec]    [delete] /home/hybld/continuum-working-directory/6/classlib/modules/concurrent/bin/test
not found.

     [exec] clean:
     [exec]    [delete] Deleting 48 files from /home/hybld/continuum-working-directory/6/classlib/build/classes

     [exec] clean:
     [exec]    [delete] Deleting 93 files from /home/hybld/continuum-working-directory/6/classlib/build/classes

     [exec] clean:
     [exec]    [delete] Deleting 9 files from /home/hybld/continuum-working-directory/6/classlib/build/classes

     [exec] clean:
     [exec]    [delete] Deleting 177 files from /home/hybld/continuum-working-directory/6/classlib/build/classes

     [exec] clean:
     [exec]    [delete] Deleting 43 files from /home/hybld/continuum-working-directory/6/classlib/build/classes

     [exec] clean:
     [exec]    [delete] Deleting 34 files from /home/hybld/continuum-working-directory/6/classlib/build/classes

     [exec] clean:
     [exec]    [delete] Deleting 969 files from /home/hybld/continuum-working-directory/6/classlib/build/classes

     [exec] clean-native-includes:
     [exec]    [delete] /home/hybld/continuum-working-directory/6/classlib/deploy/include
not found.
     [exec]    [delete] /home/hybld/continuum-working-directory/6/classlib/deploy/jdk/include
not found.

     [exec] clean:
     [exec]    [delete] Deleting 29 files from /home/hybld/continuum-working-directory/6/classlib/build/classes

     [exec] clean:
     [exec]    [delete] Deleting 14 files from /home/hybld/continuum-working-directory/6/classlib/build/classes

     [exec] clean:
     [exec]    [delete] Deleting 14 files from /home/hybld/continuum-working-directory/6/classlib/build/classes

     [exec] clean:
     [exec]    [delete] Deleting 142 files from /home/hybld/continuum-working-directory/6/classlib/build/classes
     [exec]    [delete] Deleted 5 directories from /home/hybld/continuum-working-directory/6/classlib/build/classes
     [exec]    [delete] /home/hybld/continuum-working-directory/6/classlib/modules/nio/bin/test
not found.

     [exec] clean:
     [exec]    [delete] Deleting 20 files from /home/hybld/continuum-working-directory/6/classlib/build/classes

     [exec] clean:
     [exec]    [delete] Deleting 44 files from /home/hybld/continuum-working-directory/6/classlib/build/classes

     [exec] clean-native-includes:
     [exec]    [delete] /home/hybld/continuum-working-directory/6/classlib/deploy/include
not found.

     [exec] clean:

     [exec] clean:
     [exec]    [delete] Deleting 32 files from /home/hybld/continuum-working-directory/6/classlib/build/classes

     [exec] clean:
     [exec]    [delete] Deleting 205 files from /home/hybld/continuum-working-directory/6/classlib/build/classes

     [exec] clean:
     [exec]    [delete] Deleting 177 files from /home/hybld/continuum-working-directory/6/classlib/build/classes

     [exec] clean:
     [exec]    [delete] Deleting 230 files from /home/hybld/continuum-working-directory/6/classlib/build/classes

     [exec] clean:
     [exec]    [delete] Deleting 429 files from /home/hybld/continuum-working-directory/6/classlib/build/classes

     [exec] clean:
     [exec]    [delete] Deleting 2 files from /home/hybld/continuum-working-directory/6/classlib/build/classes

     [exec] clean:
     [exec]    [delete] Deleting 74 files from /home/hybld/continuum-working-directory/6/classlib/build/classes

     [exec] clean:
     [exec]    [delete] Deleting 82 files from /home/hybld/continuum-working-directory/6/classlib/build/classes

     [exec] clean:
     [exec]    [delete] Deleting 6 files from /home/hybld/continuum-working-directory/6/classlib/build/classes

     [exec] clean:
     [exec]    [delete] Deleting 1635 files from /home/hybld/continuum-working-directory/6/classlib/build/classes
     [exec]    [delete] Deleting 4 files from /home/hybld/continuum-working-directory/6/classlib/build/classes

     [exec] clean:
     [exec]    [delete] Deleting 40 files from /home/hybld/continuum-working-directory/6/classlib/build/classes

     [exec] clean:
     [exec]    [delete] Deleting 123 files from /home/hybld/continuum-working-directory/6/classlib/build/classes

     [exec] -clean-bin-catch-all-test:

     [exec] -clean-bin-catch-all:
     [exec]    [delete] Deleted 305 directories from /home/hybld/continuum-working-directory/6/classlib/build/classes

     [exec] -clean-bin:

     [exec] -clean-layout:
     [exec]    [delete] /home/hybld/continuum-working-directory/6/classlib/deploy/jdk not
found.

     [exec] clean:

     [exec] clean-native:

     [exec] copy-makefile-includes:
     [exec]     [mkdir] Created dir: /home/hybld/continuum-working-directory/6/classlib/deploy/build/make
     [exec]      [copy] Copying 15 files to /home/hybld/continuum-working-directory/6/classlib/deploy/build/make

     [exec] -make-clean:

     [exec] -clean-native-tests:
     [exec]      [exec] rm -f ../shared/init.o  ../init  .exp \
     [exec]      [exec]        
     [exec]      [exec] rm -f ../shared/hyerror.o  ../hyerror  .exp \
     [exec]      [exec]        
     [exec]      [exec] rm -f ../shared/hytime.o  ../hytime  .exp \
     [exec]      [exec]        
     [exec]      [exec] rm -f ../shared/hyfile.o  ../hyfile  .exp \
     [exec]      [exec]        

     [exec] clean-native:
     [exec]      [exec] rm -f ../shared/hysig_copyright.o hysiglinux.o hysigunix.o ../libhysig.so
  libhysig.exp \
     [exec]      [exec]        
     [exec]      [exec] rm -f ../shared/thread_copyright.o x86/thrhelp.o x86/thrspinlock.o
../shared/hythread.o ../shared/hythreadinspect.o linuxonexit.o priority.o rasthrsup.o ../shared/rwmutex.o
thrcreate.o thrdsup.o ../shared/thrprof.o ../libhythr.so   libhythr.exp \
     [exec]      [exec]        
     [exec]      [exec] rm -f ../shared/hythread.o ../libhythr.so   libhythr.exp \
     [exec]      [exec]        
     [exec]      [exec] rm -f ../shared/port_copyright.o hycpu.o ../shared/hyerror.o hyerrorhelpers.o
../shared/hyexit.o hyfile.o hyfiletext.o ../shared/hygp.o hyipcmutex.o hymem.o linux/hymmap.o
../shared/hynls.o hynlshelpers.o hyosdump.o ../shared/hyport.o ../shared/hyportcontrol.o hyportptb.o
hysharedhelper.o hyshmem.o hyshsem.o hysl.o hysock.o ../shared/hystr.o ../shared/hystrftime.o
../shared/hystsl.o hysysinfo.o hytime.o ../shared/hytlshelpers.o hytty.o linux/hyvmem.o hysignal.o
linux.x86/hysignal_context.o ../libhyprt.so  /home/hybld/continuum-working-directory/6/classlib/deploy/lib/libhyprt.a
libhyprt.exp \
     [exec]      [exec]        
     [exec]      [exec] rm -f ../shared/libglob.o ../shared/iohelp.o ../shared/exceptions.o
../shared/strhelp.o ../shared/utf8encode.o ../shared/utf8decode.o   /home/hybld/continuum-working-directory/6/classlib/deploy/lib/libhycommon.a
.exp \
     [exec]      [exec]        
     [exec]      [exec] rm -f ../shared/pool.o ../shared/pool_cap.o   /home/hybld/continuum-working-directory/6/classlib/deploy/lib/libhypool.a
.exp \
     [exec]      [exec]        

     [exec] clean-native:
     [exec]      [exec] rm -f ../shared/auth_copyright.o authnix.o ../libhyauth.so   libhyauth.exp
\
     [exec]      [exec]        

     [exec] clean-native:
     [exec]      [exec] rm -f ../shared/zcpool.o ../shared/zipalloc.o ../shared/zipcache.o
../shared/zipsup.o   /home/hybld/continuum-working-directory/6/classlib/deploy/lib/libhyzip.a
.exp \

...

     [exec] run-tests:
     [exec]     [mkdir] Created dir: /home/hybld/continuum-working-directory/6/classlib/build/test_report
     [exec]     [junit] Running javax.accessibility.AccessibleStateTest

     [exec] BUILD FAILED
     [exec] /home/hybld/continuum-working-directory/6/classlib/build.xml:169: The following
error occurred while executing this line:
     [exec] /home/hybld/continuum-working-directory/6/classlib/make/build-test.xml:56: The
following error occurred while executing this line:
     [exec] /home/hybld/continuum-working-directory/6/classlib/make/properties.xml:421: The
following error occurred while executing this line:
     [exec] /home/hybld/continuum-working-directory/6/classlib/modules/accessibility/build.xml:183:
Process fork failed.

     [exec] Total time: 18 seconds
     [exec] Result: 1
     [echo] Tests.failed is set to true

japi:
     [exec] /home/hybld/continuum-working-directory/6/bin/japize.sh: line 4: exec: java: not
found
     [exec] Result: 127


...

update-index:

test-result:

BUILD FAILED
/home/hybld/continuum-working-directory/6/build.xml:206: There were problems running japize.

Total time: 9 minutes 48 seconds

****************************************************************************

...

Mime
View raw message