harmony-alerts mailing list archives

Site index · List index
Message view « Date » · « Thread »
Top « Date » · « Thread »
From nom...@hursley.ibm.com
Subject [continuum] BUILD FAILURE: Classlib/linux.ia32 Build/Test
Date Wed, 02 May 2007 18:52:22 GMT
Online report : http://people.apache.org/~hindessm/continuum/classlib/linux.ia32/2007/05/02/20070502-185222.failure.log.gz
Build statistics:
  State: Failed
  Previous State: Failed
  Started at: Wed, 2 May 2007 19:44:20 +0100
  Finished at: Wed, 2 May 2007 19:52:19 +0100
  Total time: 7m 59s
  Build Trigger: Forced
  Exit code: 1
  Building machine hostname: hy2
  Operating system : Linux(unknown)
  Java version : 1.5.0_06(Sun Microsystems Inc.)

Changes
      No files changed
  
****************************************************************************
Output:
****************************************************************************
Buildfile: build.xml

svn-prop:

build:
   [delete] Deleting directory /home/hybld/continuum-working-directory/6/classlib/deploy
     [echo] Classlib revision is 534587
     [echo] Post process: true
     [echo] JAPI: true
     [echo] Building with reference jdk/javac
     [exec] Buildfile: build.xml

     [exec] -init-hdk-for-clean:
     [exec]     [mkdir] Created dir: /home/hybld/continuum-working-directory/6/classlib/deploy/build/ant
     [exec]      [copy] Copying 1 file to /home/hybld/continuum-working-directory/6/classlib/deploy/build/ant

     [exec] clean-java:

     [exec] -modules-clean-bin:

     [exec] clean:
     [exec]    [delete] /home/hybld/continuum-working-directory/6/classlib/build/classes not
found.

     [exec] clean:
     [exec]    [delete] /home/hybld/continuum-working-directory/6/classlib/build/classes not
found.

     [exec] clean:
     [exec]    [delete] /home/hybld/continuum-working-directory/6/classlib/build/classes not
found.

     [exec] clean:
     [exec]    [delete] /home/hybld/continuum-working-directory/6/classlib/build/classes not
found.

     [exec] clean-native-includes:
     [exec]    [delete] /home/hybld/continuum-working-directory/6/classlib/deploy/include
not found.

     [exec] clean:
     [exec]    [delete] /home/hybld/continuum-working-directory/6/classlib/build/classes not
found.

     [exec] clean:
     [exec]    [delete] /home/hybld/continuum-working-directory/6/classlib/build/classes not
found.

     [exec] clean:
     [exec]    [delete] /home/hybld/continuum-working-directory/6/classlib/build/classes not
found.

     [exec] clean:
     [exec]    [delete] /home/hybld/continuum-working-directory/6/classlib/build/classes not
found.
     [exec]    [delete] /home/hybld/continuum-working-directory/6/classlib/modules/concurrent/bin/test
not found.

     [exec] clean:
     [exec]    [delete] /home/hybld/continuum-working-directory/6/classlib/build/classes not
found.

     [exec] clean:
     [exec]    [delete] /home/hybld/continuum-working-directory/6/classlib/build/classes not
found.

     [exec] clean:
     [exec]    [delete] /home/hybld/continuum-working-directory/6/classlib/build/classes not
found.

     [exec] clean:
     [exec]    [delete] /home/hybld/continuum-working-directory/6/classlib/build/classes not
found.

     [exec] clean:
     [exec]    [delete] /home/hybld/continuum-working-directory/6/classlib/build/classes not
found.

     [exec] clean:
     [exec]    [delete] /home/hybld/continuum-working-directory/6/classlib/build/classes not
found.

     [exec] clean:
     [exec]    [delete] /home/hybld/continuum-working-directory/6/classlib/build/classes not
found.

     [exec] clean-native-includes:
     [exec]    [delete] /home/hybld/continuum-working-directory/6/classlib/deploy/include
not found.
     [exec]    [delete] /home/hybld/continuum-working-directory/6/classlib/deploy/jdk/include
not found.

     [exec] clean:
     [exec]    [delete] /home/hybld/continuum-working-directory/6/classlib/build/classes not
found.

     [exec] clean:
     [exec]    [delete] /home/hybld/continuum-working-directory/6/classlib/build/classes not
found.

     [exec] clean:
     [exec]    [delete] /home/hybld/continuum-working-directory/6/classlib/build/classes not
found.

     [exec] clean:
     [exec]    [delete] /home/hybld/continuum-working-directory/6/classlib/build/classes not
found.
     [exec]    [delete] /home/hybld/continuum-working-directory/6/classlib/modules/nio/bin/test
not found.

     [exec] clean:
     [exec]    [delete] /home/hybld/continuum-working-directory/6/classlib/build/classes not
found.

     [exec] clean:
     [exec]    [delete] /home/hybld/continuum-working-directory/6/classlib/build/classes not
found.

     [exec] clean-native-includes:
     [exec]    [delete] /home/hybld/continuum-working-directory/6/classlib/deploy/include
not found.

     [exec] clean:

     [exec] clean:
     [exec]    [delete] /home/hybld/continuum-working-directory/6/classlib/build/classes not
found.

     [exec] clean:
     [exec]    [delete] /home/hybld/continuum-working-directory/6/classlib/build/classes not
found.

     [exec] clean:
     [exec]    [delete] /home/hybld/continuum-working-directory/6/classlib/build/classes not
found.

     [exec] clean:
     [exec]    [delete] /home/hybld/continuum-working-directory/6/classlib/build/classes not
found.

     [exec] clean:
     [exec]    [delete] /home/hybld/continuum-working-directory/6/classlib/build/classes not
found.

     [exec] clean:
     [exec]    [delete] /home/hybld/continuum-working-directory/6/classlib/build/classes not
found.

     [exec] clean:
     [exec]    [delete] /home/hybld/continuum-working-directory/6/classlib/build/classes not
found.

     [exec] clean:
     [exec]    [delete] /home/hybld/continuum-working-directory/6/classlib/build/classes not
found.

     [exec] clean:
     [exec]    [delete] /home/hybld/continuum-working-directory/6/classlib/build/classes not
found.

     [exec] clean:
     [exec]    [delete] /home/hybld/continuum-working-directory/6/classlib/build/classes not
found.
     [exec]    [delete] /home/hybld/continuum-working-directory/6/classlib/build/classes not
found.

     [exec] clean:
     [exec]    [delete] /home/hybld/continuum-working-directory/6/classlib/build/classes not
found.

     [exec] clean:
     [exec]    [delete] /home/hybld/continuum-working-directory/6/classlib/build/classes not
found.

     [exec] -clean-bin-catch-all-test:

     [exec] -clean-bin-catch-all:

     [exec] -clean-bin:

     [exec] -clean-layout:
     [exec]    [delete] /home/hybld/continuum-working-directory/6/classlib/deploy/jdk not
found.

     [exec] clean:

     [exec] clean-native:

     [exec] copy-makefile-includes:
     [exec]     [mkdir] Created dir: /home/hybld/continuum-working-directory/6/classlib/deploy/build/make
     [exec]      [copy] Copying 15 files to /home/hybld/continuum-working-directory/6/classlib/deploy/build/make

     [exec] -make-clean:

     [exec] -clean-native-tests:
     [exec]      [exec] rm -f ../shared/init.o  ../init  .exp \
     [exec]      [exec]        
     [exec]      [exec] rm -f ../shared/hyerror.o  ../hyerror  .exp \
     [exec]      [exec]        
     [exec]      [exec] rm -f ../shared/hytime.o  ../hytime  .exp \
     [exec]      [exec]        
     [exec]      [exec] rm -f ../shared/hyfile.o  ../hyfile  .exp \
     [exec]      [exec]        

     [exec] clean-native:
     [exec]      [exec] rm -f ../shared/hysig_copyright.o hysiglinux.o hysigunix.o ../libhysig.so
  libhysig.exp \
     [exec]      [exec]        
     [exec]      [exec] rm -f ../shared/thread_copyright.o x86/thrhelp.o x86/thrspinlock.o
../shared/hythread.o ../shared/hythreadinspect.o linuxonexit.o priority.o rasthrsup.o ../shared/rwmutex.o
thrcreate.o thrdsup.o ../shared/thrprof.o ../libhythr.so   libhythr.exp \
     [exec]      [exec]        
     [exec]      [exec] rm -f ../shared/hythread.o ../libhythr.so   libhythr.exp \
     [exec]      [exec]        
     [exec]      [exec] rm -f ../shared/port_copyright.o hycpu.o ../shared/hyerror.o hyerrorhelpers.o
../shared/hyexit.o hyfile.o hyfiletext.o ../shared/hygp.o hyipcmutex.o hymem.o linux/hymmap.o
../shared/hynls.o hynlshelpers.o hyosdump.o ../shared/hyport.o ../shared/hyportcontrol.o hyportptb.o
hysharedhelper.o hyshmem.o hyshsem.o hysl.o hysock.o ../shared/hystr.o ../shared/hystrftime.o
../shared/hystsl.o hysysinfo.o hytime.o ../shared/hytlshelpers.o hytty.o linux/hyvmem.o hysignal.o
linux.x86/hysignal_context.o ../libhyprt.so  /home/hybld/continuum-working-directory/6/classlib/deploy/lib/libhyprt.a
libhyprt.exp \
     [exec]      [exec]        
     [exec]      [exec] rm -f ../shared/libglob.o ../shared/iohelp.o ../shared/exceptions.o
../shared/strhelp.o ../shared/utf8encode.o ../shared/utf8decode.o   /home/hybld/continuum-working-directory/6/classlib/deploy/lib/libhycommon.a
.exp \
     [exec]      [exec]        
     [exec]      [exec] rm -f ../shared/pool.o ../shared/pool_cap.o   /home/hybld/continuum-working-directory/6/classlib/deploy/lib/libhypool.a
.exp \
     [exec]      [exec]        

     [exec] clean-native:
     [exec]      [exec] rm -f ../shared/auth_copyright.o authnix.o ../libhyauth.so   libhyauth.exp
\
     [exec]      [exec]        

     [exec] clean-native:
     [exec]      [exec] rm -f ../shared/zcpool.o ../shared/zipalloc.o ../shared/zipcache.o
../shared/zipsup.o   /home/hybld/continuum-working-directory/6/classlib/deploy/lib/libhyzip.a
.exp \
     [exec]      [exec]        
     [exec]      [exec] rm -f ../shared/zlib_copyright.o ../../zlib_dist/adler32.o ../../zlib_dist/compress.o
../../zlib_dist/crc32.o ../../zlib_dist/deflate.o ../../zlib_dist/infback.o ../../zlib_dist/inffast.o
../../zlib_dist/inflate.o ../../zlib_dist/inftrees.o ../../zlib_dist/trees.o ../../zlib_dist/uncompr.o
../../zlib_dist/zutil.o ../libhyzlib.so   libhyzlib.exp \
     [exec]      [exec]        
     [exec]      [exec] rm -f ../shared/archive_copyright.o ../shared/jclcrc32.o ../shared/zip.o
../shared/adler32.o ../shared/inflater.o ../shared/jarfile.o ../shared/deflater.o ../shared/archiveglob.o
../libhyarchive.so   libhyarchive.exp \
     [exec]      [exec]        

     [exec] clean-native:
     [exec]      [exec] rm -f ../shared/text_copyright.o ../shared/BidiWrapper.o ../libhytext.so
  libhytext.exp \
     [exec]      [exec]        

     [exec] clean-native:

     [exec] clean-native:
     [exec]      [exec] rm -f ../../fdlibm_dist/e_acos.o ../../fdlibm_dist/e_acosh.o ../../fdlibm_dist/e_asin.o
../../fdlibm_dist/e_atan2.o ../../fdlibm_dist/e_atanh.o ../../fdlibm_dist/e_cosh.o ../../fdlibm_dist/e_exp.o
../../fdlibm_dist/e_fmod.o ../../fdlibm_dist/e_gamma.o ../../fdlibm_dist/e_gamma_r.o ../../fdlibm_dist/e_hypot.o
../../fdlibm_dist/e_j0.o ../../fdlibm_dist/e_j1.o ../../fdlibm_dist/e_jn.o ../../fdlibm_dist/e_lgamma.o
../../fdlibm_dist/e_lgamma_r.o ../../fdlibm_dist/e_log.o ../../fdlibm_dist/e_log10.o ../../fdlibm_dist/e_pow.o
../../fdlibm_dist/e_rem_pio2.o ../../fdlibm_dist/e_remainder.o ../../fdlibm_dist/e_scalb.o
../../fdlibm_dist/e_sinh.o ../../fdlibm_dist/e_sqrt.o ../../fdlibm_dist/k_cos.o ../../fdlibm_dist/k_rem_pio2.o
../../fdlibm_dist/k_sin.o ../../fdlibm_dist/k_standard.o ../../fdlibm_dist/k_tan.o ../../fdlibm_dist/s_asinh.o
../../fdlibm_dist/s_atan.o ../../fdlibm_dist/s_cbrt.o ../../fdlibm_dist/s_ceil.o ../../fdlibm_dist/s_copysign.o
../../fdlibm_dis
 t/s_cos.o ../../fdlibm_dist/s_erf.o ../../fdlibm_dist/s_expm1.o ../../fdlibm_dist/s_fabs.o
../../fdlibm_dist/s_finite.o ../../fdlibm_dist/s_floor.o ../../fdlibm_dist/s_frexp.o ../../fdlibm_dist/s_ilogb.o
../../fdlibm_dist/s_isnan.o ../../fdlibm_dist/s_ldexp.o ../shared/s_lib_version.o ../../fdlibm_dist/s_log1p.o
../../fdlibm_dist/s_logb.o ../../fdlibm_dist/s_matherr.o ../../fdlibm_dist/s_modf.o ../../fdlibm_dist/s_nextafter.o
../../fdlibm_dist/s_rint.o ../../fdlibm_dist/s_scalbn.o ../../fdlibm_dist/s_signgam.o ../../fdlibm_dist/s_significand.o
../../fdlibm_dist/s_sin.o ../../fdlibm_dist/s_tan.o ../../fdlibm_dist/s_tanh.o ../../fdlibm_dist/w_acos.o
../../fdlibm_dist/w_acosh.o ../../fdlibm_dist/w_asin.o ../../fdlibm_dist/w_atan2.o ../../fdlibm_dist/w_atanh.o
../../fdlibm_dist/w_cosh.o ../../fdlibm_dist/w_exp.o ../../fdlibm_dist/w_fmod.o ../../fdlibm_dist/w_gamma.o
../../fdlibm_dist/w_gamma_r.o ../../fdlibm_dist/w_hypot.o ../../fdlibm_dist/w_j0.o ../../fdlibm_dist/w_j1.o
../../
 fdlibm_dist/w_jn.o ../../fdlibm_dist/w_lgamma.o ../../fdlibm_dist/w_lgamma_r.o ../../fdlibm_dist/w_log.o
../../fdlibm_dist/w_log10.o ../../fdlibm_dist/w_pow.o ../../fdlibm_dist/w_remainder.o ../../fdlibm_dist/w_scalb.o
../../fdlibm_dist/w_sinh.o ../../fdlibm_dist/w_sqrt.o   /home/hybld/continuum-working-directory/6/classlib/deploy/lib/libhyfdlibm.a
.exp \

...

     [exec] run-tests:
     [exec]     [mkdir] Created dir: /home/hybld/continuum-working-directory/6/classlib/build/test_report
     [exec]     [junit] Running javax.accessibility.AccessibleStateTest

     [exec] BUILD FAILED
     [exec] /home/hybld/continuum-working-directory/6/classlib/build.xml:169: The following
error occurred while executing this line:
     [exec] /home/hybld/continuum-working-directory/6/classlib/make/build-test.xml:56: The
following error occurred while executing this line:
     [exec] /home/hybld/continuum-working-directory/6/classlib/make/properties.xml:421: The
following error occurred while executing this line:
     [exec] /home/hybld/continuum-working-directory/6/classlib/modules/accessibility/build.xml:183:
Process fork failed.

     [exec] Total time: 20 seconds
     [exec] Result: 1
     [echo] Tests.failed is set to true

japi:
     [exec] /home/hybld/continuum-working-directory/6/bin/japize.sh: line 4: exec: java: not
found
     [exec] Result: 127


...

update-index:

test-result:

BUILD FAILED
/home/hybld/continuum-working-directory/6/build.xml:206: There were problems running japize.

Total time: 7 minutes 58 seconds

****************************************************************************

...

Mime
View raw message