harmony-alerts mailing list archives

Site index · List index
Message view « Date » · « Thread »
Top « Date » · « Thread »
From nom...@hursley.ibm.com
Subject [continuum] BUILD FAILURE: Classlib/linux.ia32 Build/Test
Date Wed, 02 May 2007 18:43:52 GMT
Online report : http://people.apache.org/~hindessm/continuum/classlib/linux.ia32/2007/05/02/20070502-184352.failure.log.gz
Build statistics:
  State: Failed
  Previous State: Failed
  Started at: Wed, 2 May 2007 19:43:23 +0100
  Finished at: Wed, 2 May 2007 19:43:51 +0100
  Total time: 27s
  Build Trigger: Forced
  Exit code: 1
  Building machine hostname: hy2
  Operating system : Linux(unknown)
  Java version : 1.5.0_06(Sun Microsystems Inc.)

Changes
      No files changed

****************************************************************************
Output:
****************************************************************************
Buildfile: build.xml

svn-prop:

build:
   [delete] Deleting directory /home/hybld/continuum-working-directory/6/classlib/deploy
     [echo] Classlib revision is 534586
     [echo] Post process: true
     [echo] JAPI: true
     [echo] Building with reference jdk/javac
     [exec] Buildfile: build.xml

     [exec] -init-hdk-for-clean:
     [exec]     [mkdir] Created dir: /home/hybld/continuum-working-directory/6/classlib/deploy/build/ant
     [exec]      [copy] Copying 1 file to /home/hybld/continuum-working-directory/6/classlib/deploy/build/ant

     [exec] clean-java:

     [exec] -modules-clean-bin:

     [exec] clean:

     [exec] clean:

     [exec] clean:

     [exec] clean:

     [exec] clean-native-includes:
     [exec]    [delete] /home/hybld/continuum-working-directory/6/classlib/deploy/include
not found.

     [exec] clean:

     [exec] clean:

     [exec] clean:

     [exec] clean:
     [exec]    [delete] /home/hybld/continuum-working-directory/6/classlib/modules/concurrent/bin/test
not found.

     [exec] clean:

     [exec] clean:

     [exec] clean:

     [exec] clean:

     [exec] clean:

     [exec] clean:

     [exec] clean:

     [exec] clean-native-includes:
     [exec]    [delete] /home/hybld/continuum-working-directory/6/classlib/deploy/include
not found.
     [exec]    [delete] /home/hybld/continuum-working-directory/6/classlib/deploy/jdk/include
not found.

     [exec] clean:

     [exec] clean:

     [exec] clean:

     [exec] clean:
     [exec]    [delete] /home/hybld/continuum-working-directory/6/classlib/modules/nio/bin/test
not found.

     [exec] clean:

     [exec] clean:

     [exec] clean-native-includes:
     [exec]    [delete] /home/hybld/continuum-working-directory/6/classlib/deploy/include
not found.

     [exec] clean:

     [exec] clean:

     [exec] clean:

     [exec] clean:

     [exec] clean:

     [exec] clean:

     [exec] clean:

     [exec] clean:

     [exec] clean:

     [exec] clean:

     [exec] clean:

     [exec] clean:

     [exec] clean:
     [exec]    [delete] Deleting 123 files from /home/hybld/continuum-working-directory/6/classlib/build/classes
     [exec]    [delete] Deleting 107 files from /home/hybld/continuum-working-directory/6/classlib/modules/x-net/bin/test

     [exec] -clean-bin-catch-all-test:

     [exec] -clean-bin-catch-all:
     [exec]    [delete] Deleting 36 files from /home/hybld/continuum-working-directory/6/classlib/build/classes
     [exec]    [delete] Deleted 314 directories from /home/hybld/continuum-working-directory/6/classlib/build/classes

     [exec] BUILD FAILED
     [exec] /home/hybld/continuum-working-directory/6/classlib/build.xml:123: The following
error occurred while executing this line:
     [exec] /home/hybld/continuum-working-directory/6/classlib/make/build-java.xml:100: ...

     [exec] Built files still exist after module clean targets have run.  This
     [exec] probably means that one or more patternsets are incomplete.  The
     [exec] remaining files are:

     [exec] /home/hybld/continuum-working-directory/6/classlib/build/classes/com/sun/tools/javac/Main.class
     [exec] /home/hybld/continuum-working-directory/6/classlib/build/classes/org/apache/harmony/tools/internal/nls/Messages$1.class
     [exec] /home/hybld/continuum-working-directory/6/classlib/build/classes/org/apache/harmony/tools/internal/nls/Messages.class
     [exec] /home/hybld/continuum-working-directory/6/classlib/build/classes/org/apache/harmony/tools/internal/nls/messages.properties
     [exec] /home/hybld/continuum-working-directory/6/classlib/build/classes/org/apache/harmony/tools/jarsigner/ArgParser.class
     [exec] /home/hybld/continuum-working-directory/6/classlib/build/classes/org/apache/harmony/tools/jarsigner/FileNameGenerator.class
     [exec] /home/hybld/continuum-working-directory/6/classlib/build/classes/org/apache/harmony/tools/jarsigner/JSHelper.class
     [exec] /home/hybld/continuum-working-directory/6/classlib/build/classes/org/apache/harmony/tools/jarsigner/JSLogFormatter.class
     [exec] /home/hybld/continuum-working-directory/6/classlib/build/classes/org/apache/harmony/tools/jarsigner/JSParameters.class
     [exec] /home/hybld/continuum-working-directory/6/classlib/build/classes/org/apache/harmony/tools/jarsigner/JSSigner.class
     [exec] /home/hybld/continuum-working-directory/6/classlib/build/classes/org/apache/harmony/tools/jarsigner/JSVerifier.class
     [exec] /home/hybld/continuum-working-directory/6/classlib/build/classes/org/apache/harmony/tools/jarsigner/JarSignerException.class
     [exec] /home/hybld/continuum-working-directory/6/classlib/build/classes/org/apache/harmony/tools/jarsigner/Main.class
     [exec] /home/hybld/continuum-working-directory/6/classlib/build/classes/org/apache/harmony/tools/jarsigner/TimeStampGenerator.class
     [exec] /home/hybld/continuum-working-directory/6/classlib/build/classes/org/apache/harmony/tools/jarsigner/UserInteractor.class
     [exec] /home/hybld/continuum-working-directory/6/classlib/build/classes/org/apache/harmony/tools/javac/Compiler.class
     [exec] /home/hybld/continuum-working-directory/6/classlib/build/classes/org/apache/harmony/tools/javac/Main.class
     [exec] /home/hybld/continuum-working-directory/6/classlib/build/classes/org/apache/harmony/tools/keytool/ArgumentsParser.class
     [exec] /home/hybld/continuum-working-directory/6/classlib/build/classes/org/apache/harmony/tools/keytool/CRLManager.class
     [exec] /home/hybld/continuum-working-directory/6/classlib/build/classes/org/apache/harmony/tools/keytool/CSRGenerator.class
     [exec] /home/hybld/continuum-working-directory/6/classlib/build/classes/org/apache/harmony/tools/keytool/CertChainVerifier.class
     [exec] /home/hybld/continuum-working-directory/6/classlib/build/classes/org/apache/harmony/tools/keytool/CertExporter.class
     [exec] /home/hybld/continuum-working-directory/6/classlib/build/classes/org/apache/harmony/tools/keytool/CertImporter.class
     [exec] /home/hybld/continuum-working-directory/6/classlib/build/classes/org/apache/harmony/tools/keytool/CertReader.class
     [exec] /home/hybld/continuum-working-directory/6/classlib/build/classes/org/apache/harmony/tools/keytool/Command.class
     [exec] /home/hybld/continuum-working-directory/6/classlib/build/classes/org/apache/harmony/tools/keytool/EntryManager.class
     [exec] /home/hybld/continuum-working-directory/6/classlib/build/classes/org/apache/harmony/tools/keytool/HelpPrinter.class
     [exec] /home/hybld/continuum-working-directory/6/classlib/build/classes/org/apache/harmony/tools/keytool/KeyCertGenerator.class
     [exec] /home/hybld/continuum-working-directory/6/classlib/build/classes/org/apache/harmony/tools/keytool/KeyStoreCertPrinter.class
     [exec] /home/hybld/continuum-working-directory/6/classlib/build/classes/org/apache/harmony/tools/keytool/KeyStoreConverter.class
     [exec] /home/hybld/continuum-working-directory/6/classlib/build/classes/org/apache/harmony/tools/keytool/KeytoolException.class
     [exec] /home/hybld/continuum-working-directory/6/classlib/build/classes/org/apache/harmony/tools/keytool/KeytoolKSLoaderSaver.class
     [exec] /home/hybld/continuum-working-directory/6/classlib/build/classes/org/apache/harmony/tools/keytool/KeytoolParameters.class
     [exec] /home/hybld/continuum-working-directory/6/classlib/build/classes/org/apache/harmony/tools/keytool/Main.class
     [exec] /home/hybld/continuum-working-directory/6/classlib/build/classes/org/apache/harmony/tools/toolutils/KeyStoreLoaderSaver.class
     [exec] /home/hybld/continuum-working-directory/6/classlib/build/classes/org/apache/harmony/tools/toolutils/Util.class

     [exec] Total time: 20 seconds

BUILD FAILED
/home/hybld/continuum-working-directory/6/build.xml:128: exec returned: 1

Total time: 26 seconds

****************************************************************************



...

Mime
View raw message