harmony-alerts mailing list archives

Site index · List index
Message view « Date » · « Thread »
Top « Date » · « Thread »
From nom...@hursley.ibm.com
Subject [continuum] BUILD FAILURE: Classlib/linux.ia32 Build/Test
Date Wed, 02 May 2007 17:08:34 GMT
Online report : http://people.apache.org/~hindessm/continuum/classlib/linux.ia32/2007/05/02/20070502-170834.failure.log.gz
Build statistics:
  State: Failed
  Previous State: Failed
  Started at: Wed, 2 May 2007 18:08:05 +0100
  Finished at: Wed, 2 May 2007 18:08:32 +0100
  Total time: 27s
  Build Trigger: Schedule
  Exit code: 1
  Building machine hostname: hy2
  Operating system : Linux(unknown)
  Java version : 1.5.0_06(Sun Microsystems Inc.)

Changes
                            classlib/modules/luni/build.xml

****************************************************************************
Output:
****************************************************************************
Buildfile: build.xml

svn-prop:

build:
   [delete] Deleting directory /home/hybld/continuum-working-directory/6/classlib/deploy
     [echo] Classlib revision is 534549
     [echo] Post process: true
     [echo] JAPI: true
     [echo] Building with reference jdk/javac
     [exec] Buildfile: build.xml

     [exec] -init-hdk-for-clean:
     [exec]     [mkdir] Created dir: /home/hybld/continuum-working-directory/6/classlib/deploy/build/ant
     [exec]      [copy] Copying 1 file to /home/hybld/continuum-working-directory/6/classlib/deploy/build/ant

     [exec] clean-java:

     [exec] -modules-clean-bin:

     [exec] clean:

     [exec] clean:

     [exec] clean:

     [exec] clean:

     [exec] clean-native-includes:
     [exec]    [delete] /home/hybld/continuum-working-directory/6/classlib/deploy/include
not found.

     [exec] clean:

     [exec] clean:

     [exec] clean:

     [exec] clean:
     [exec]    [delete] /home/hybld/continuum-working-directory/6/classlib/modules/concurrent/bin/test
not found.

     [exec] clean:

     [exec] clean:

     [exec] clean:

     [exec] clean:

     [exec] clean:

     [exec] clean:

     [exec] clean:

     [exec] clean-native-includes:
     [exec]    [delete] /home/hybld/continuum-working-directory/6/classlib/deploy/include
not found.
     [exec]    [delete] /home/hybld/continuum-working-directory/6/classlib/deploy/jdk/include
not found.

     [exec] clean:

     [exec] clean:

     [exec] clean:

     [exec] clean:
     [exec]    [delete] /home/hybld/continuum-working-directory/6/classlib/modules/nio/bin/test
not found.

     [exec] clean:

     [exec] clean:

     [exec] clean-native-includes:
     [exec]    [delete] /home/hybld/continuum-working-directory/6/classlib/deploy/include
not found.

     [exec] clean:

     [exec] clean:

     [exec] clean:

     [exec] clean:

     [exec] clean:

     [exec] clean:

     [exec] clean:

     [exec] clean:

     [exec] clean:

     [exec] clean:

     [exec] clean:

     [exec] clean:

     [exec] BUILD FAILED
     [exec] /home/hybld/continuum-working-directory/6/classlib/build.xml:123: The following
error occurred while executing this line:
     [exec] /home/hybld/continuum-working-directory/6/classlib/make/build-java.xml:69: The
following error occurred while executing this line:
     [exec] /home/hybld/continuum-working-directory/6/classlib/make/properties.xml:421: Invalid
file: /home/hybld/continuum-working-directory/6/classlib/modules/tools/build.xml

     [exec] Total time: 21 seconds

BUILD FAILED
/home/hybld/continuum-working-directory/6/build.xml:128: exec returned: 1

Total time: 26 seconds

****************************************************************************



...

Mime
View raw message