harmony-alerts mailing list archives: April 2007

Site index · List index
Message list« Previous · 1 · 2Thread · Author · Date
[build-test alert] BUILD SUCCEEDED Linux SUSE9 64bit gcc debug: drlvm
nom...@intel.com   [build-test alert] BUILD SUCCEEDED Linux SUSE9 64bit gcc debug: drlvm Mon, 16 Apr, 14:21
nom...@intel.com   [build-test alert] BUILD SUCCEEDED Linux SUSE9 64bit gcc debug: drlvm Tue, 17 Apr, 11:45
[build-test alert] BUILD SUCCEEDED Linux SUSE 9 x86_64: harmony HDK
nom...@intel.com   [build-test alert] BUILD SUCCEEDED Linux SUSE 9 x86_64: harmony HDK Mon, 16 Apr, 14:44
nom...@intel.com   [build-test alert] BUILD SUCCEEDED Linux SUSE 9 x86_64: harmony HDK Tue, 17 Apr, 11:59
[build-test alert] BUILD FAILED LINUX SUSE 9 x86_64: harmony_hdk
nom...@intel.com   [build-test alert] BUILD FAILED LINUX SUSE 9 x86_64: harmony_hdk Wed, 18 Apr, 07:28
nom...@intel.com   [build-test alert] BUILD FAILED LINUX SUSE 9 x86_64: harmony_hdk Wed, 18 Apr, 13:12
nom...@intel.com   [build-test alert] BUILD FAILED LINUX SUSE 9 x86_64: harmony_hdk Wed, 18 Apr, 17:04
nom...@intel.com   [build-test alert] BUILD FAILED LINUX SUSE 9 x86_64: harmony_hdk Fri, 20 Apr, 16:15
nom...@intel.com   [build-test alert] BUILD FAILED LINUX SUSE 9 x86_64: harmony_hdk Fri, 20 Apr, 23:14
nom...@intel.com   [build-test alert] BUILD FAILED LINUX SUSE 9 x86_64: harmony_hdk Tue, 24 Apr, 13:15
nom...@intel.com   [build-test alert] BUILD FAILED LINUX SUSE 9 x86_64: harmony_hdk Wed, 25 Apr, 10:05
[build-test alert] BUILD SUCCEEDED Linux SUSE 9 x86_64: harmony_hdk
nom...@intel.com   [build-test alert] BUILD SUCCEEDED Linux SUSE 9 x86_64: harmony_hdk Wed, 18 Apr, 09:07
nom...@intel.com   [build-test alert] BUILD SUCCEEDED Linux SUSE 9 x86_64: harmony_hdk Wed, 18 Apr, 14:59
nom...@intel.com   [build-test alert] BUILD SUCCEEDED Linux SUSE 9 x86_64: harmony_hdk Wed, 18 Apr, 18:30
nom...@intel.com   [build-test alert] BUILD SUCCEEDED Linux SUSE 9 x86_64: harmony_hdk Fri, 20 Apr, 17:20
nom...@intel.com   [build-test alert] BUILD SUCCEEDED Linux SUSE 9 x86_64: harmony_hdk Tue, 24 Apr, 07:24
nom...@intel.com   [build-test alert] BUILD SUCCEEDED Linux SUSE 9 x86_64: harmony_hdk Wed, 25 Apr, 03:54
nom...@intel.com   [build-test alert] BUILD SUCCEEDED Linux SUSE 9 x86_64: harmony_hdk Wed, 25 Apr, 13:51
nom...@intel.com [build-test alert] BUILD SUCCEEDED Linux SUSE 9 x86: harmony_hdk Mon, 23 Apr, 10:48
nom...@intel.com [build-test alert] BUILD FAILED Windows XP ia32 msvc debug: drlvm Mon, 23 Apr, 11:02
nom...@intel.com [build-test alert] BUILD SUCCEEDED Windows XP ia32 msvc debug: drlvm Mon, 23 Apr, 16:17
[build-test alert] BUILD SUCCEEDED lnx gcc debug: Eclipse Unit Tests
nom...@intel.com   [build-test alert] BUILD SUCCEEDED lnx gcc debug: Eclipse Unit Tests Tue, 24 Apr, 12:03
nom...@intel.com   [build-test alert] BUILD SUCCEEDED lnx gcc debug: Eclipse Unit Tests Fri, 27 Apr, 12:57
nbe...@kc.rr.com [build-test alert] BUILD FAILED Windows 2000 SP4 msvc debug: classlib tests Wed, 25 Apr, 02:16
nom...@intel.com [build-test alert] BUILD SUCCEEDED Linux SUSE 9 x86: jdktools_test Wed, 25 Apr, 03:29
nbe...@kc.rr.com [build-test alert] BUILD SUCCEEDED Windows 2000 x86 msvc debug: classlib build Wed, 25 Apr, 05:12
nbe...@kc.rr.com [build-test alert] BUILD SUCCEEDED Windows 2000 x86 msvc debug: drlvm build Wed, 25 Apr, 05:40
nbe...@kc.rr.com [build-test alert] BUILD SUCCEEDED Windows 2000 x86 msvc debug: classlib tests run Wed, 25 Apr, 05:51
nbe...@kc.rr.com [build-test alert] BUILD FAILED Windows 2000 x86 msvc debug: drlvm tests run Wed, 25 Apr, 05:56
nom...@intel.com [build-test alert] BUILD FAILED Windows XP SP2 x86: jdktools_test Wed, 25 Apr, 12:18
[build-test alert] BUILD SUCCEEDED Linux i386 gcc debug: classlib build
nbe...@kc.rr.com   [build-test alert] BUILD SUCCEEDED Linux i386 gcc debug: classlib build Thu, 26 Apr, 02:55
nbe...@kc.rr.com   [build-test alert] BUILD SUCCEEDED Linux i386 gcc debug: classlib build Fri, 27 Apr, 03:23
[build-test alert] BUILD SUCCEEDED Linux i386 gcc debug: drlvm build
nbe...@kc.rr.com   [build-test alert] BUILD SUCCEEDED Linux i386 gcc debug: drlvm build Thu, 26 Apr, 03:23
nbe...@kc.rr.com   [build-test alert] BUILD SUCCEEDED Linux i386 gcc debug: drlvm build Fri, 27 Apr, 03:51
[build-test alert] BUILD FAILED Linux i386 gcc debug: classlib tests run
nbe...@kc.rr.com   [build-test alert] BUILD FAILED Linux i386 gcc debug: classlib tests run Thu, 26 Apr, 04:13
nbe...@kc.rr.com   [build-test alert] BUILD FAILED Linux i386 gcc debug: classlib tests run Fri, 27 Apr, 04:40
nom...@intel.com [build-test alert] BUILD SUCCEEDED Windows XP SP2 x86: jdktools_test Thu, 26 Apr, 06:51
nbe...@kc.rr.com [build-test alert] BUILD FAILED Linux i386 gcc debug: drlvm tests run Fri, 27 Apr, 07:27
Message list« Previous · 1 · 2Thread · Author · Date
Box list
Jul 20113
Dec 201029
Nov 20106
Oct 201046
Sep 201035
Aug 201017
Jul 201029
Jun 201041
May 201020
Apr 201040
Mar 2010102
Feb 201043
Jan 201014
Dec 200911
Nov 20099
Oct 200912
Sep 20093
Aug 200915
Jul 200959
Jun 200916
May 200930
Apr 200960
Mar 200919
Feb 200945
Jan 200957
Dec 200827
Nov 200815
Oct 200824
Sep 200854
Aug 200834
Jul 200841
Jun 200899
May 200862
Apr 2008113
Mar 2008133
Feb 2008164
Jan 2008291
Dec 2007335
Nov 2007454
Oct 2007405
Sep 2007259
Aug 2007368
Jul 2007618
Jun 2007607
May 2007672
Apr 2007455
Mar 20071104
Feb 2007389
Jan 2007418
Dec 200692