harmony-alerts mailing list archives: April 2007

Site index · List index
Message list« Previous · 1 · 2 · 3 · 4 · 5Thread · Author · Date
nom...@intel.com [build-test alert] BUILD FAILED Linux SUSE 9 64bit gcc debug: drlvm tests Wed, 25 Apr, 22:13
nom...@hursley.ibm.com [continuum] BUILD FAILURE: Classlib/linux.ia32 Build/Test Wed, 25 Apr, 23:21
nom...@intel.com [build-test alert] BUILD FAILED Windows XP SP2 msvc debug: drlvm tests Thu, 26 Apr, 00:28
nbe...@kc.rr.com [build-test alert] BUILD SUCCEEDED Linux i386 gcc debug: classlib build Thu, 26 Apr, 02:55
nbe...@kc.rr.com [build-test alert] BUILD SUCCEEDED Linux i386 gcc debug: drlvm build Thu, 26 Apr, 03:23
nbe...@kc.rr.com [build-test alert] BUILD FAILED Linux i386 gcc debug: classlib tests run Thu, 26 Apr, 04:13
nom...@intel.com [build-test alert] BUILD FAILED Windows 2003 x86_64 msvc debug: drlvm Thu, 26 Apr, 04:41
nom...@intel.com [build-test alert] BUILD SUCCEEDED Linux SUSE 9 64bit gcc debug: drlvm tests Thu, 26 Apr, 04:53
nom...@hursley.ibm.com [continuum] BUILD SUCCESSFUL: Classlib/linux.ia32 Build/Test Thu, 26 Apr, 05:21
nom...@intel.com [build-test alert] BUILD SUCCEEDED Linux SUSE 9 64bit gcc debug: classlib over drlvm Thu, 26 Apr, 06:27
nom...@intel.com [build-test alert] BUILD SUCCEEDED Linux SUSE 9 gcc debug: classlib over drlvm Thu, 26 Apr, 06:32
nom...@intel.com [build-test alert] BUILD SUCCEEDED Windows XP SP2 x86: jdktools_test Thu, 26 Apr, 06:51
nom...@intel.com [build-test alert] BUILD SUCCEEDED Linux SUSE 9 x86_64: jdktools_test Thu, 26 Apr, 07:08
nom...@intel.com [build-test alert] BUILD SUCCEEDED Windows XP SP2 msvc debug: classlib over drlvm Thu, 26 Apr, 08:36
nom...@intel.com [build-test alert] BUILD FAILED Linux SUSE 9 64bit gcc debug: classlib over drlvm Thu, 26 Apr, 10:48
nom...@intel.com [build-test alert] BUILD SUCCEEDED Windows XP SP2 msvc debug: drlvm tests Thu, 26 Apr, 11:18
nom...@intel.com [build-test alert] BUILD FAILED Linux SUSE 9 64bit gcc debug: drlvm tests Thu, 26 Apr, 11:52
nom...@intel.com [build-test alert] BUILD FAILED Linux SUSE 9 64bit gcc debug: drlvm reg.test Thu, 26 Apr, 11:59
nom...@intel.com [build-test alert] BUILD FAILED lnx gcc debug: Eclipse Unit Tests Thu, 26 Apr, 12:37
nom...@intel.com [build-test alert] BUILD SUCCEEDED Linux SUSE 9 64bit gcc debug: classlib over drlvm Thu, 26 Apr, 12:50
nom...@intel.com [build-test alert] BUILD SUCCEEDED Linux SUSE 9 64bit gcc debug: drlvm reg.test Thu, 26 Apr, 14:33
nom...@intel.com [build-test alert] BUILD SUCCEEDED Windows 2003 x86_64 msvc debug: classlib tests Thu, 26 Apr, 14:51
nom...@intel.com [build-test alert] BUILD FAILED Windows XP SP2 msvc debug: drlvm tests Thu, 26 Apr, 14:58
nom...@intel.com [build-test alert] BUILD SUCCEEDED Linux SUSE 9 64bit gcc debug: drlvm tests Thu, 26 Apr, 15:50
nom...@intel.com [build-test alert] BUILD FAILED Linux SUSE 9 64bit gcc debug: drlvm reg.test Thu, 26 Apr, 17:59
nom...@intel.com [build-test alert] BUILD FAILED Linux SUSE 9 64bit gcc debug: drlvm tests Thu, 26 Apr, 19:55
nom...@intel.com [build-test alert] BUILD SUCCEEDED Linux SUSE 9 64bit gcc debug: drlvm tests Thu, 26 Apr, 21:28
nom...@intel.com [build-test alert] BUILD SUCCEEDED Windows XP SP2 msvc debug: drlvm tests Thu, 26 Apr, 22:43
nom...@intel.com [build-test alert] BUILD FAILED SUSEL9 IA32 gcc debug: classlib tests iterative Fri, 27 Apr, 01:30
nbe...@kc.rr.com [build-test alert] BUILD SUCCEEDED Linux i386 gcc debug: classlib build Fri, 27 Apr, 03:23
nom...@intel.com [build-test alert] BUILD FAILED Linux SUSE 9 gcc debug: drlvm reg.test Fri, 27 Apr, 03:26
nbe...@kc.rr.com [build-test alert] BUILD SUCCEEDED Linux i386 gcc debug: drlvm build Fri, 27 Apr, 03:51
nbe...@kc.rr.com [build-test alert] BUILD FAILED Linux i386 gcc debug: classlib tests run Fri, 27 Apr, 04:40
nom...@intel.com [build-test alert] BUILD FAILED Windows XP SP2 msvc debug: drlvm tests Fri, 27 Apr, 04:47
nom...@intel.com [build-test alert] BUILD FAILED Linux SUSE 9 gcc debug: drlvm test Fri, 27 Apr, 05:17
nom...@intel.com [build-test alert] BUILD SUCCEEDED Linux SUSE 9 gcc debug: drlvm reg.test Fri, 27 Apr, 07:04
nbe...@kc.rr.com [build-test alert] BUILD FAILED Linux i386 gcc debug: drlvm tests run Fri, 27 Apr, 07:27
nom...@intel.com [build-test alert] BUILD SUCCEEDED Windows XP SP2 msvc debug: drlvm tests Fri, 27 Apr, 07:56
nom...@intel.com [build-test alert] BUILD SUCCEEDED Linux SUSE 9 gcc debug: drlvm test Fri, 27 Apr, 09:36
nom...@intel.com [build-test alert] BUILD SUCCEEDED Linux SUSE 9 64bit gcc debug: drlvm reg.test Fri, 27 Apr, 11:16
nom...@intel.com [build-test alert] BUILD FAILED WIN XP msvc debug: classlib tests iterative Fri, 27 Apr, 11:28
nom...@intel.com [build-test alert] BUILD SUCCEEDED lnx gcc debug: Eclipse Unit Tests Fri, 27 Apr, 12:57
nom...@intel.com [build-test alert] BUILD FAILED Linux SUSE 9 64bit gcc debug: drlvm tests Fri, 27 Apr, 14:52
nom...@intel.com [build-test alert] BUILD FAILED Windows XP SP2 msvc debug: drlvm tests Fri, 27 Apr, 15:35
nom...@intel.com [build-test alert] BUILD SUCCEEDED Linux SUSE 9 64bit gcc debug: drlvm tests Fri, 27 Apr, 19:26
nom...@intel.com [build-test alert] BUILD SUCCEEDED Windows 2003 x86_64 msvc debug: drlvm Sat, 28 Apr, 00:16
nom...@intel.com [build-test alert] BUILD FAILED Linux SUSE 9 64bit gcc debug: drlvm tests Sat, 28 Apr, 04:26
nom...@intel.com [build-test alert] BUILD SUCCEEDED Linux SUSE 9 64bit gcc debug: drlvm tests Sat, 28 Apr, 07:35
nom...@intel.com [build-test alert] BUILD FAILED SUSEL9 IA32 gcc debug: classlib tests iterative Sat, 28 Apr, 12:59
nom...@hursley.ibm.com [continuum] BUILD FAILURE: Classlib/linux.ia32 Build/Test Sat, 28 Apr, 17:37
nom...@intel.com [build-test alert] BUILD FAILED Linux SUSE 9 64bit gcc debug: drlvm tests Sat, 28 Apr, 17:50
nom...@intel.com [build-test alert] BUILD SUCCEEDED Linux SUSE 9 64bit gcc debug: drlvm tests Sat, 28 Apr, 22:53
nom...@intel.com [build-test alert] BUILD FAILED WIN XP msvc debug: classlib tests iterative Sun, 29 Apr, 03:23
nom...@intel.com [build-test alert] BUILD FAILED SUSEL9 IA32 gcc debug: classlib tests iterative Mon, 30 Apr, 00:10
nom...@intel.com [build-test alert] BUILD FAILED WIN XP msvc debug: classlib tests iterative Mon, 30 Apr, 20:23
Message list« Previous · 1 · 2 · 3 · 4 · 5Thread · Author · Date
Box list
Jul 20113
Dec 201029
Nov 20106
Oct 201046
Sep 201035
Aug 201017
Jul 201029
Jun 201041
May 201020
Apr 201040
Mar 2010102
Feb 201043
Jan 201014
Dec 200911
Nov 20099
Oct 200912
Sep 20093
Aug 200915
Jul 200959
Jun 200916
May 200930
Apr 200960
Mar 200919
Feb 200945
Jan 200957
Dec 200827
Nov 200815
Oct 200824
Sep 200854
Aug 200834
Jul 200841
Jun 200899
May 200862
Apr 2008113
Mar 2008133
Feb 2008164
Jan 2008291
Dec 2007335
Nov 2007454
Oct 2007405
Sep 2007259
Aug 2007368
Jul 2007618
Jun 2007607
May 2007672
Apr 2007455
Mar 20071104
Feb 2007389
Jan 2007418
Dec 200692