harmony-alerts mailing list archives: April 2007

Site index · List index
Message list« Previous · 1 · 2 · 3 · 4 · 5 · Next »Thread · Author · Date
nom...@intel.com [build-test alert] BUILD SUCCEEDED Windows 2003 x86_64 msvc debug: classlib tests Wed, 18 Apr, 08:13
nom...@intel.com [build-test alert] BUILD FAILED Linux SUSE 9 64bit gcc debug: drlvm tests Wed, 18 Apr, 08:15
nom...@intel.com [build-test alert] BUILD FAILED Linux SUSE 9 64bit gcc debug: drlvm reg.test Wed, 18 Apr, 08:19
nom...@intel.com [build-test alert] BUILD FAILED Linux SUSE 9 gcc debug: classlib over drlvm Wed, 18 Apr, 08:21
nom...@intel.com [build-test alert] BUILD FAILED Windows XP SP2 msvc debug: classlib over drlvm Wed, 18 Apr, 08:23
nom...@intel.com [build-test alert] BUILD FAILED Linux SUSE 9 64bit gcc debug: classlib over drlvm Wed, 18 Apr, 08:24
nom...@intel.com [build-test alert] BUILD SUCCEEDED Linux SUSE 9 x86_64: harmony_hdk Wed, 18 Apr, 09:07
nom...@intel.com [build-test alert] BUILD FAILED Windows 2003 x86_64 msvc debug: drlvm Wed, 18 Apr, 10:49
nom...@intel.com [build-test alert] BUILD SUCCEEDED Linux SUSE 9 gcc debug: classlib over drlvm Wed, 18 Apr, 11:43
nom...@intel.com [build-test alert] BUILD SUCCEEDED Windows XP SP2 msvc debug: classlib over drlvm Wed, 18 Apr, 12:38
nom...@intel.com [build-test alert] BUILD FAILED LINUX SUSE 9 x86_64: harmony_hdk Wed, 18 Apr, 13:12
nom...@intel.com [build-test alert] BUILD SUCCEEDED Linux SUSE 9 x86_64: harmony_hdk Wed, 18 Apr, 14:59
nom...@intel.com [build-test alert] BUILD FAILED LINUX SUSE 9 x86_64: harmony_hdk Wed, 18 Apr, 17:04
nom...@intel.com [build-test alert] BUILD SUCCEEDED Windows 2003 x86_64 msvc debug: drlvm Wed, 18 Apr, 17:16
nom...@intel.com [build-test alert] BUILD SUCCEEDED Linux SUSE 9 x86_64: harmony_hdk Wed, 18 Apr, 18:30
nom...@intel.com [build-test alert] BUILD SUCCEEDED Linux SUSE 9 64bit gcc debug: drlvm reg.test Wed, 18 Apr, 23:27
nom...@intel.com [build-test alert] BUILD SUCCEEDED Linux SUSE 9 64bit gcc debug: classlib over drlvm Wed, 18 Apr, 23:56
nom...@intel.com [build-test alert] BUILD FAILED WIN XP msvc debug: classlib tests iterative Thu, 19 Apr, 00:46
nom...@intel.com [build-test alert] BUILD SUCCEEDED Linux SUSE 9 64bit gcc debug: drlvm tests Thu, 19 Apr, 01:25
nom...@intel.com [build-test alert] BUILD SUCCEEDED Linux SUSE 9 gcc debug: drlvm test Thu, 19 Apr, 05:05
nom...@intel.com [build-test alert] BUILD FAILED Windows XP SP2 msvc debug: classlib over drlvm Thu, 19 Apr, 06:56
nom...@intel.com [build-test alert] BUILD FAILED Linux SUSE 9 gcc debug: drlvm test Thu, 19 Apr, 08:08
nom...@intel.com [build-test alert] BUILD SUCCEEDED Windows XP SP2 msvc debug: classlib over drlvm Thu, 19 Apr, 09:57
nom...@intel.com [build-test alert] BUILD FAILED SUSEL9 IA32 gcc debug: classlib tests iterative Thu, 19 Apr, 17:37
nom...@intel.com [build-test alert] BUILD SUCCEEDED Linux SUSE 9 gcc debug: drlvm test Thu, 19 Apr, 17:46
nom...@intel.com [build-test alert] BUILD FAILED Windows XP SP2 msvc debug: classlib over drlvm Fri, 20 Apr, 06:18
nom...@intel.com [build-test alert] BUILD SUCCEEDED Windows XP SP2 msvc debug: classlib over drlvm Fri, 20 Apr, 06:58
nom...@intel.com [build-test alert] BUILD FAILED Windows XP SP2 msvc debug: classlib over drlvm Fri, 20 Apr, 12:48
nom...@intel.com [build-test alert] BUILD FAILED Linux SUSE 9 gcc debug: drlvm test Fri, 20 Apr, 12:51
nom...@intel.com [build-test alert] BUILD FAILED Linux SUSE 9 gcc debug: classlib over drlvm Fri, 20 Apr, 15:59
nom...@intel.com [build-test alert] BUILD FAILED LINUX SUSE 9 x86_64: harmony_hdk Fri, 20 Apr, 16:15
nom...@intel.com [build-test alert] BUILD FAILED WIN XP msvc debug: classlib tests iterative Fri, 20 Apr, 17:06
nom...@intel.com [build-test alert] BUILD SUCCEEDED Linux SUSE 9 x86_64: harmony_hdk Fri, 20 Apr, 17:20
nom...@intel.com [build-test alert] BUILD SUCCEEDED Windows XP SP2 msvc debug: classlib over drlvm Fri, 20 Apr, 18:48
nom...@intel.com [build-test alert] BUILD SUCCEEDED Linux SUSE 9 gcc debug: drlvm test Fri, 20 Apr, 23:13
nom...@intel.com [build-test alert] BUILD FAILED LINUX SUSE 9 x86_64: harmony_hdk Fri, 20 Apr, 23:14
nom...@intel.com [build-test alert] BUILD SUCCEEDED Linux SUSE 9 gcc debug: classlib over drlvm Sat, 21 Apr, 00:14
nom...@intel.com [build-test alert] BUILD FAILED Linux SUSE 9 gcc debug: drlvm test Sat, 21 Apr, 02:01
nom...@intel.com [build-test alert] BUILD FAILED SUSEL9 IA32 gcc debug: classlib tests iterative Sat, 21 Apr, 02:43
nom...@intel.com [build-test alert] BUILD SUCCEEDED Linux SUSE 9 gcc debug: drlvm test Sat, 21 Apr, 05:01
nom...@intel.com [build-test alert] BUILD FAILED WIN XP msvc debug: classlib tests iterative Sun, 22 Apr, 09:25
nom...@intel.com [build-test alert] BUILD FAILED Windows XP SP2 msvc debug: classlib over drlvm Mon, 23 Apr, 03:18
nom...@intel.com [build-test alert] BUILD FAILED Linux SUSE 9 64bit gcc debug: drlvm tests Mon, 23 Apr, 03:53
nom...@intel.com [build-test alert] BUILD FAILED Windows XP SP2 msvc debug: drlvm tests Mon, 23 Apr, 05:42
nom...@intel.com [build-test alert] BUILD FAILED Linux SUSE 9 gcc debug: classlib over drlvm Mon, 23 Apr, 05:58
nom...@intel.com [build-test alert] BUILD SUCCEEDED Windows XP SP2 msvc debug: classlib over drlvm Mon, 23 Apr, 06:14
nom...@intel.com [build-test alert] BUILD FAILED Linux SUSE 9 gcc debug: drlvm reg.test Mon, 23 Apr, 06:48
nom...@intel.com [build-test alert] BUILD FAILED Windows 2003 x86_64 msvc debug: drlvm Mon, 23 Apr, 09:51
nom...@intel.com [build-test alert] BUILD FAILED Windows XP ia32 msvc debug: classlib Mon, 23 Apr, 10:46
nom...@intel.com [build-test alert] BUILD SUCCEEDED Linux SUSE 9 x86: harmony_hdk Mon, 23 Apr, 10:48
nom...@intel.com [build-test alert] BUILD FAILED Windows XP ia32 msvc debug: drlvm Mon, 23 Apr, 11:02
nom...@intel.com [build-test alert] BUILD SUCCEEDED Linux SUSE 9 64bit gcc debug: drlvm tests Mon, 23 Apr, 11:25
nom...@intel.com [build-test alert] BUILD FAILED Linux SUSE 9 gcc debug: drlvm test Mon, 23 Apr, 12:21
nom...@intel.com [build-test alert] BUILD FAILED Linux SUSE 9 64bit gcc debug: drlvm tests Mon, 23 Apr, 13:49
nom...@intel.com [build-test alert] BUILD SUCCEEDED Linux SUSE 9 gcc debug: drlvm reg.test Mon, 23 Apr, 13:54
nom...@intel.com [build-test alert] BUILD SUCCEEDED Linux SUSE 9 gcc debug: drlvm test Mon, 23 Apr, 15:48
nom...@intel.com [build-test alert] BUILD SUCCEEDED Windows XP ia32 msvc debug: classlib Mon, 23 Apr, 15:59
nom...@intel.com [build-test alert] BUILD SUCCEEDED Windows XP ia32 msvc debug: drlvm Mon, 23 Apr, 16:17
nom...@intel.com [build-test alert] BUILD FAILED Linux SUSE 9 64bit gcc debug: classlib over drlvm Mon, 23 Apr, 16:44
nom...@intel.com [build-test alert] BUILD SUCCEEDED Linux SUSE 9 gcc debug: classlib over drlvm Mon, 23 Apr, 16:46
nom...@intel.com [build-test alert] BUILD SUCCEEDED Linux SUSE 9 64bit gcc debug: drlvm tests Mon, 23 Apr, 18:07
nom...@intel.com [build-test alert] BUILD SUCCEEDED Linux SUSE 9 64bit gcc debug: classlib over drlvm Mon, 23 Apr, 18:53
nom...@intel.com [build-test alert] BUILD FAILED Linux SUSE 9 gcc debug: drlvm test Mon, 23 Apr, 18:59
nom...@intel.com [build-test alert] BUILD SUCCEEDED Linux SUSE 9 gcc debug: drlvm test Tue, 24 Apr, 00:13
nom...@intel.com [build-test alert] BUILD FAILED WIN XP msvc debug: classlib tests iterative Tue, 24 Apr, 01:58
nom...@intel.com [build-test alert] BUILD FAILED SUSEL9 IA32 gcc debug: classlib tests iterative Tue, 24 Apr, 03:18
nom...@intel.com [build-test alert] BUILD FAILED Linux SUSE 9 64bit gcc debug: drlvm tests Tue, 24 Apr, 03:48
nom...@intel.com [build-test alert] BUILD SUCCEEDED Linux SUSE 9 x86_64: harmony_hdk Tue, 24 Apr, 07:24
nom...@intel.com [build-test alert] BUILD FAILED Linux SUSE 9 gcc debug: drlvm test Tue, 24 Apr, 11:29
nom...@intel.com [build-test alert] BUILD SUCCEEDED lnx gcc debug: Eclipse Unit Tests Tue, 24 Apr, 12:03
nom...@hursley.ibm.com [continuum] BUILD FAILURE: Classlib/linux.ia32 Build/Test Tue, 24 Apr, 12:30
nom...@intel.com [build-test alert] BUILD FAILED LINUX SUSE 9 x86_64: harmony_hdk Tue, 24 Apr, 13:15
nom...@intel.com [build-test alert] BUILD SUCCEEDED Linux SUSE 9 64bit gcc debug: drlvm tests Tue, 24 Apr, 13:37
nom...@hursley.ibm.com [continuum] BUILD SUCCESSFUL: Classlib/linux.ia32 Build/Test Tue, 24 Apr, 14:13
nom...@intel.com [build-test alert] BUILD FAILED Linux SUSE 9 64bit gcc debug: drlvm tests Tue, 24 Apr, 15:53
nom...@intel.com [build-test alert] BUILD SUCCEEDED Linux SUSE 9 gcc debug: drlvm test Tue, 24 Apr, 17:59
nom...@intel.com [build-test alert] BUILD SUCCEEDED Linux SUSE 9 64bit gcc debug: drlvm tests Tue, 24 Apr, 18:08
nom...@intel.com [build-test alert] BUILD FAILED Linux SUSE 9 64bit gcc debug: drlvm tests Tue, 24 Apr, 21:28
nom...@intel.com [build-test alert] BUILD SUCCEEDED Linux SUSE 9 64bit gcc debug: drlvm tests Tue, 24 Apr, 22:58
nbe...@kc.rr.com [build-test alert] BUILD FAILED Windows 2000 SP4 msvc debug: classlib tests Wed, 25 Apr, 02:16
nom...@intel.com [build-test alert] BUILD SUCCEEDED Linux SUSE 9 x86: jdktools_test Wed, 25 Apr, 03:29
nom...@intel.com [build-test alert] BUILD SUCCEEDED Linux SUSE 9 x86_64: harmony_hdk Wed, 25 Apr, 03:54
nom...@intel.com [build-test alert] BUILD SUCCEEDED Windows XP SP2 msvc debug: drlvm tests Wed, 25 Apr, 05:00
nbe...@kc.rr.com [build-test alert] BUILD SUCCEEDED Windows 2000 x86 msvc debug: classlib build Wed, 25 Apr, 05:12
nbe...@kc.rr.com [build-test alert] BUILD SUCCEEDED Windows 2000 x86 msvc debug: drlvm build Wed, 25 Apr, 05:40
nbe...@kc.rr.com [build-test alert] BUILD SUCCEEDED Windows 2000 x86 msvc debug: classlib tests run Wed, 25 Apr, 05:51
nbe...@kc.rr.com [build-test alert] BUILD FAILED Windows 2000 x86 msvc debug: drlvm tests run Wed, 25 Apr, 05:56
nom...@intel.com [build-test alert] BUILD FAILED LINUX SUSE 9 x86_64: harmony_hdk Wed, 25 Apr, 10:05
nom...@intel.com [build-test alert] BUILD FAILED Windows XP SP2 msvc debug: drlvm tests Wed, 25 Apr, 10:14
nom...@intel.com [build-test alert] BUILD FAILED Windows XP SP2 msvc debug: classlib over drlvm Wed, 25 Apr, 10:46
nom...@intel.com [build-test alert] BUILD FAILED Linux SUSE 9 64bit gcc debug: classlib over drlvm Wed, 25 Apr, 11:27
nom...@intel.com [build-test alert] BUILD FAILED Windows XP SP2 x86: jdktools_test Wed, 25 Apr, 12:18
nom...@intel.com [build-test alert] BUILD FAILED Windows 2003 x86_64 msvc debug: classlib tests Wed, 25 Apr, 13:01
nom...@intel.com [build-test alert] BUILD FAILED LINUX SUSE 9 x86_64: jdktools_test Wed, 25 Apr, 13:17
nom...@intel.com [build-test alert] BUILD SUCCEEDED Windows XP SP2 msvc debug: drlvm tests Wed, 25 Apr, 13:47
nom...@intel.com [build-test alert] BUILD SUCCEEDED Linux SUSE 9 x86_64: harmony_hdk Wed, 25 Apr, 13:51
nom...@intel.com [build-test alert] BUILD FAILED SUSEL9 IA32 gcc debug: classlib tests iterative Wed, 25 Apr, 14:16
nom...@intel.com [build-test alert] BUILD FAILED Linux SUSE 9 gcc debug: classlib over drlvm Wed, 25 Apr, 14:20
nom...@intel.com [build-test alert] BUILD FAILED WIN XP msvc debug: classlib tests iterative Wed, 25 Apr, 18:35
nom...@intel.com [build-test alert] BUILD SUCCEEDED Windows 2003 x86_64 msvc debug: drlvm Wed, 25 Apr, 19:47
Message list« Previous · 1 · 2 · 3 · 4 · 5 · Next »Thread · Author · Date
Box list
Jul 20113
Dec 201029
Nov 20106
Oct 201046
Sep 201035
Aug 201017
Jul 201029
Jun 201041
May 201020
Apr 201040
Mar 2010102
Feb 201043
Jan 201014
Dec 200911
Nov 20099
Oct 200912
Sep 20093
Aug 200915
Jul 200959
Jun 200916
May 200930
Apr 200960
Mar 200919
Feb 200945
Jan 200957
Dec 200827
Nov 200815
Oct 200824
Sep 200854
Aug 200834
Jul 200841
Jun 200899
May 200862
Apr 2008113
Mar 2008133
Feb 2008164
Jan 2008291
Dec 2007335
Nov 2007454
Oct 2007405
Sep 2007259
Aug 2007368
Jul 2007618
Jun 2007607
May 2007672
Apr 2007455
Mar 20071104
Feb 2007389
Jan 2007418
Dec 200692