harmony-alerts mailing list archives: April 2007

Site index · List index
Message list« Previous · 1 · 2 · 3 · 4 · 5 · Next »Thread · Author · Date
nom...@intel.com [build-test alert] BUILD SUCCEEDED Windows XP SP2 msvc debug: drlvm tests Thu, 12 Apr, 19:21
nom...@intel.com [build-test alert] BUILD FAILED SUSEL9 IA32 gcc debug: classlib tests iterative Thu, 12 Apr, 22:11
nbe...@kc.rr.com [build-test alert] BUILD SUCCEEDED Windows 2000 msvc debug: classlib Thu, 12 Apr, 22:18
nbe...@kc.rr.com [build-test alert] BUILD FAILED Windows 2000 msvc debug: classlib over ibmvm Thu, 12 Apr, 23:06
nbe...@kc.rr.com [build-test alert] BUILD FAILED Windows 2000 msvc debug: classlib over ibmvm Fri, 13 Apr, 00:00
nom...@intel.com [build-test alert] BUILD FAILED Windows XP SP2 msvc debug: drlvm tests Fri, 13 Apr, 00:08
nom...@hursley.ibm.com [continuum] BUILD FAILURE: Classlib/linux.ia32 Build/Test Fri, 13 Apr, 00:26
nbe...@kc.rr.com [build-test alert] BUILD FAILED Windows 2000 msvc debug: classlib over ibmvm Fri, 13 Apr, 00:54
nbe...@kc.rr.com [build-test alert] BUILD FAILED Windows 2000 msvc debug: classlib over ibmvm Fri, 13 Apr, 01:47
nom...@intel.com [build-test alert] BUILD SUCCEEDED Windows XP SP2 msvc debug: drlvm tests Fri, 13 Apr, 02:43
nom...@intel.com [build-test alert] BUILD FAILED Windows 2003 x86_64 msvc debug: classlib tests Fri, 13 Apr, 02:55
nom...@intel.com [build-test alert] BUILD SUCCEEDED Windows 2003 x86_64 msvc debug: classlib tests Fri, 13 Apr, 03:50
nom...@intel.com [build-test alert] BUILD SUCCEEDED SUSE Linux 64bit gcc debug: classlib EHWA Fri, 13 Apr, 04:00
nbe...@kc.rr.com [build-test alert] BUILD SUCCEEDED Windows 2000 msvc debug: classlib Fri, 13 Apr, 05:08
nom...@hursley.ibm.com [continuum] BUILD FAILURE: Classlib/linux.ia32 Build/Test Fri, 13 Apr, 05:49
nbe...@kc.rr.com [build-test alert] BUILD FAILED Windows 2000 msvc debug: classlib over ibmvm Fri, 13 Apr, 06:15
nom...@hursley.ibm.com [continuum] BUILD FAILURE: Classlib/linux.ia32 Build/Test Fri, 13 Apr, 08:41
nom...@intel.com [build-test alert] BUILD FAILED WIN XP msvc debug: classlib tests iterative Fri, 13 Apr, 10:32
nom...@hursley.ibm.com [continuum] BUILD FAILURE: Classlib/linux.ia32 Build/Test Fri, 13 Apr, 11:39
nom...@hursley.ibm.com [continuum] BUILD FAILURE: Classlib/linux.ia32 Build/Test Fri, 13 Apr, 13:19
nom...@intel.com [build-test alert] BUILD FAILED Linux SUSE 9 gcc debug: drlvm reg.test Fri, 13 Apr, 13:42
nbe...@kc.rr.com [build-test alert] BUILD FAILED Windows 2000 msvc debug: classlib Fri, 13 Apr, 13:44
nom...@hursley.ibm.com [continuum] BUILD FAILURE: Classlib/linux.ia32 Build/Test Fri, 13 Apr, 15:19
nom...@intel.com [build-test alert] BUILD FAILED Linux SUSE 9 gcc debug: drlvm test Fri, 13 Apr, 16:24
nom...@intel.com [build-test alert] BUILD SUCCEEDED Linux SUSE 9 gcc debug: drlvm reg.test Fri, 13 Apr, 16:43
nom...@intel.com [build-test alert] BUILD FAILED Windows 2003 x86_64 msvc debug: drlvm Fri, 13 Apr, 21:04
nom...@intel.com [build-test alert] BUILD FAILED Linux SUSE 9 64bit gcc debug: drlvm tests Fri, 13 Apr, 22:10
nom...@intel.com [build-test alert] BUILD SUCCEEDED Linux SUSE 9 64bit gcc debug: drlvm tests Sat, 14 Apr, 00:24
nom...@intel.com [build-test alert] BUILD SUCCEEDED Windows 2003 x86_64 msvc debug: drlvm Sat, 14 Apr, 04:18
nom...@intel.com [build-test alert] BUILD FAILED SUSEL9 IA32 gcc debug: classlib tests iterative Sat, 14 Apr, 05:44
nom...@intel.com [build-test alert] BUILD FAILED WIN XP msvc debug: classlib tests iterative Sat, 14 Apr, 17:48
nom...@intel.com [build-test alert] BUILD FAILED Windows XP ia32 msvc debug: classlib Sat, 14 Apr, 23:44
nom...@intel.com [build-test alert] BUILD FAILED lnx gcc debug: Eclipse Unit Tests Sun, 15 Apr, 00:57
nom...@intel.com [build-test alert] BUILD SUCCEEDED Linux SUSE 9 gcc debug: drlvm test Sun, 15 Apr, 01:07
nom...@hursley.ibm.com [continuum] BUILD FAILURE: Classlib/linux.ia32 Build/Test Sun, 15 Apr, 01:28
nbe...@kc.rr.com [build-test alert] BUILD SUCCEEDED Windows 2000 msvc debug: classlib Sun, 15 Apr, 05:18
nom...@intel.com [build-test alert] BUILD SUCCEEDED Windows XP ia32 msvc debug: classlib Sun, 15 Apr, 05:23
nom...@hursley.ibm.com [continuum] BUILD FAILURE: Classlib/linux.ia32 Build/Test Sun, 15 Apr, 06:27
nom...@intel.com [build-test alert] BUILD FAILED Windows XP SP2 msvc debug: drlvm tests Sun, 15 Apr, 07:26
nom...@intel.com [build-test alert] BUILD FAILED Linux SUSE 9 gcc debug: drlvm test Sun, 15 Apr, 07:38
nom...@intel.com [build-test alert] BUILD FAILED win msvc debug: Eclipse Unit Tests Sun, 15 Apr, 08:35
nom...@intel.com [build-test alert] BUILD SUCCEEDED Windows XP SP2 msvc debug: drlvm tests Sun, 15 Apr, 09:25
nom...@intel.com [build-test alert] BUILD FAILED Linux SUSE 9 64bit gcc debug: drlvm tests Sun, 15 Apr, 11:06
nom...@intel.com [build-test alert] BUILD SUCCEEDED Linux SUSE 9 gcc debug: drlvm test Sun, 15 Apr, 12:37
nom...@intel.com [build-test alert] BUILD SUCCEEDED Linux SUSE 9 64bit gcc debug: drlvm tests Sun, 15 Apr, 13:28
nom...@intel.com [build-test alert] BUILD FAILED SUSEL9 IA32 gcc debug: classlib tests iterative Sun, 15 Apr, 13:42
nom...@intel.com [build-test alert] BUILD FAILED Windows XP SP2 msvc debug: classlib over drlvm Sun, 15 Apr, 18:56
nom...@hursley.ibm.com [continuum] BUILD FAILURE: Classlib/linux.ia32 Build/Test Sun, 15 Apr, 19:28
nom...@intel.com [build-test alert] BUILD FAILED Linux SUSE 9 gcc debug: drlvm test Sun, 15 Apr, 21:09
nom...@hursley.ibm.com [continuum] BUILD SUCCESSFUL: Classlib/linux.ia32 Build/Test Sun, 15 Apr, 21:12
nom...@intel.com [build-test alert] BUILD SUCCEEDED Windows XP SP2 msvc debug: classlib over drlvm Sun, 15 Apr, 23:13
nom...@intel.com [build-test alert] BUILD FAILED WIN XP msvc debug: classlib tests iterative Mon, 16 Apr, 01:57
nom...@intel.com [build-test alert] BUILD SUCCEEDED Windows XP SP2 x86: tomcat start Mon, 16 Apr, 02:16
nom...@intel.com [build-test alert] BUILD FAILED Windows XP SP2 msvc debug: classlib over drlvm Mon, 16 Apr, 10:39
nom...@intel.com [build-test alert] BUILD FAILED Linux SUSE 9 gcc debug: drlvm reg.test Mon, 16 Apr, 11:34
nom...@intel.com [build-test alert] BUILD FAILED Linux SUSE 9 gcc debug: classlib over drlvm Mon, 16 Apr, 12:42
nom...@intel.com [build-test alert] BUILD SUCCEEDED Windows XP SP2 msvc debug: classlib over drlvm Mon, 16 Apr, 13:01
nom...@intel.com [build-test alert] BUILD FAILED SUSE Linux 64bit gcc debug: classlib EHWA Mon, 16 Apr, 13:43
nom...@intel.com [build-test alert] BUILD FAILED Linux SUSE9 64bit gcc debug: drlvm Mon, 16 Apr, 13:43
nom...@intel.com [build-test alert] BUILD FAILED LINUX SUSE 9 x86_64: harmony HDK Mon, 16 Apr, 13:54
nom...@intel.com [build-test alert] BUILD SUCCEEDED Linux SUSE9 64bit gcc debug: drlvm Mon, 16 Apr, 14:21
nom...@intel.com [build-test alert] BUILD SUCCEEDED Linux SUSE 9 x86_64: harmony HDK Mon, 16 Apr, 14:44
nom...@intel.com [build-test alert] BUILD SUCCEEDED Linux SUSE 9 gcc debug: drlvm reg.test Mon, 16 Apr, 18:35
nom...@intel.com [build-test alert] BUILD SUCCEEDED Linux SUSE 9 gcc debug: classlib over drlvm Mon, 16 Apr, 19:15
nom...@intel.com [build-test alert] BUILD FAILED SUSEL9 IA32 gcc debug: classlib tests iterative Mon, 16 Apr, 21:54
nom...@intel.com [build-test alert] BUILD FAILED Linux SUSE 9 64bit gcc debug: drlvm tests Mon, 16 Apr, 22:41
nom...@intel.com [build-test alert] BUILD SUCCEEDED Linux SUSE 9 64bit gcc debug: drlvm tests Tue, 17 Apr, 00:52
nom...@intel.com [build-test alert] BUILD SUCCEEDED SUSE Linux 64bit gcc debug: classlib EHWA Tue, 17 Apr, 01:56
nom...@intel.com [build-test alert] BUILD SUCCEEDED Linux SUSE 9 gcc debug: drlvm test Tue, 17 Apr, 02:36
nom...@intel.com [build-test alert] BUILD FAILED SUSE Linux 64bit gcc debug: classlib EHWA Tue, 17 Apr, 03:24
nom...@hursley.ibm.com [continuum] BUILD FAILURE: Classlib/linux.ia32 Build/Test Tue, 17 Apr, 04:52
nom...@intel.com [build-test alert] BUILD FAILED Linux SUSE9 64bit gcc debug: drlvm Tue, 17 Apr, 05:36
nom...@intel.com [build-test alert] BUILD FAILED Windows XP SP2 msvc debug: classlib over drlvm Tue, 17 Apr, 05:41
nom...@intel.com [build-test alert] BUILD FAILED LINUX SUSE 9 x86_64: harmony HDK Tue, 17 Apr, 05:45
nom...@intel.com [build-test alert] BUILD FAILED Linux SUSE 9 64bit gcc debug: drlvm reg.test Tue, 17 Apr, 07:37
nom...@intel.com [build-test alert] BUILD FAILED Linux SUSE 9 64bit gcc debug: classlib over drlvm Tue, 17 Apr, 07:37
nom...@intel.com [build-test alert] BUILD FAILED Linux SUSE 9 gcc debug: drlvm test Tue, 17 Apr, 08:45
nom...@intel.com [build-test alert] BUILD FAILED WIN XP msvc debug: classlib tests iterative Tue, 17 Apr, 10:12
nom...@intel.com [build-test alert] BUILD FAILED Windows 2003 x86_64 msvc debug: drlvm Tue, 17 Apr, 11:09
nom...@intel.com [build-test alert] BUILD SUCCEEDED Linux SUSE 9 gcc debug: drlvm test Tue, 17 Apr, 11:12
nom...@intel.com [build-test alert] BUILD FAILED Linux SUSE 9 64bit gcc debug: drlvm tests Tue, 17 Apr, 11:18
nom...@intel.com [build-test alert] BUILD SUCCEEDED Linux SUSE9 64bit gcc debug: drlvm Tue, 17 Apr, 11:45
nom...@intel.com [build-test alert] BUILD SUCCEEDED Linux SUSE 9 64bit gcc debug: drlvm reg.test Tue, 17 Apr, 11:48
nom...@intel.com [build-test alert] BUILD SUCCEEDED Linux SUSE 9 x86_64: harmony HDK Tue, 17 Apr, 11:59
nom...@intel.com [build-test alert] BUILD SUCCEEDED Linux SUSE 9 64bit gcc debug: classlib over drlvm Tue, 17 Apr, 12:17
nom...@intel.com [build-test alert] BUILD SUCCEEDED Windows 2003 x86_64 msvc debug: drlvm Tue, 17 Apr, 12:21
nom...@hursley.ibm.com [continuum] BUILD FAILURE: Classlib/linux.ia32 Build/Test Tue, 17 Apr, 13:39
nom...@intel.com [build-test alert] BUILD SUCCEEDED Linux SUSE 9 64bit gcc debug: drlvm tests Tue, 17 Apr, 13:42
nom...@intel.com [build-test alert] BUILD FAILED Linux SUSE 9 gcc debug: drlvm test Tue, 17 Apr, 14:05
nom...@intel.com [build-test alert] BUILD FAILED Linux SUSE 9 gcc debug: classlib over drlvm Tue, 17 Apr, 14:44
nom...@intel.com [build-test alert] BUILD SUCCEEDED Linux SUSE 9 gcc debug: drlvm test Tue, 17 Apr, 17:04
nom...@intel.com [build-test alert] BUILD SUCCEEDED Linux SUSE 9 gcc debug: classlib over drlvm Tue, 17 Apr, 17:44
nom...@intel.com [build-test alert] BUILD FAILED Windows 2003 x86_64 msvc debug: classlib tests Tue, 17 Apr, 19:37
nom...@hursley.ibm.com [continuum] BUILD SUCCESSFUL: Classlib/linux.ia32 Build/Test Wed, 18 Apr, 00:20
nom...@intel.com [build-test alert] BUILD FAILED Linux SUSE 9 gcc debug: classlib over drlvm Wed, 18 Apr, 01:50
nom...@intel.com [build-test alert] BUILD SUCCEEDED Windows XP SP2 msvc debug: classlib over drlvm Wed, 18 Apr, 02:16
nom...@intel.com [build-test alert] BUILD SUCCEEDED Linux SUSE 9 gcc debug: classlib over drlvm Wed, 18 Apr, 02:38
nom...@intel.com [build-test alert] BUILD FAILED SUSEL9 IA32 gcc debug: classlib tests iterative Wed, 18 Apr, 06:14
nom...@intel.com [build-test alert] BUILD FAILED Linux SUSE 9 gcc debug: drlvm test Wed, 18 Apr, 07:21
nom...@intel.com [build-test alert] BUILD FAILED LINUX SUSE 9 x86_64: harmony_hdk Wed, 18 Apr, 07:28
Message list« Previous · 1 · 2 · 3 · 4 · 5 · Next »Thread · Author · Date
Box list
Jul 20113
Dec 201029
Nov 20106
Oct 201046
Sep 201035
Aug 201017
Jul 201029
Jun 201041
May 201020
Apr 201040
Mar 2010102
Feb 201043
Jan 201014
Dec 200911
Nov 20099
Oct 200912
Sep 20093
Aug 200915
Jul 200959
Jun 200916
May 200930
Apr 200960
Mar 200919
Feb 200945
Jan 200957
Dec 200827
Nov 200815
Oct 200824
Sep 200854
Aug 200834
Jul 200841
Jun 200899
May 200862
Apr 2008113
Mar 2008133
Feb 2008164
Jan 2008291
Dec 2007335
Nov 2007454
Oct 2007405
Sep 2007259
Aug 2007368
Jul 2007618
Jun 2007607
May 2007672
Apr 2007455
Mar 20071104
Feb 2007389
Jan 2007418
Dec 200692