harmony-alerts mailing list archives: April 2007

Site index · List index
Message list« Previous · 1 · 2 · 3 · 4 · 5 · Next »Thread · Author · Date
nom...@hursley.ibm.com [continuum] BUILD FAILURE: Classlib/linux.ia32 Build/Test Wed, 04 Apr, 09:36
nbe...@kc.rr.com [build-test alert] BUILD SUCCEEDED Windows 2000 msvc debug: classlib Wed, 04 Apr, 09:50
nbe...@kc.rr.com [build-test alert] BUILD FAILED Windows 2000 msvc debug: classlib over ibmvm Wed, 04 Apr, 10:43
nom...@intel.com [build-test alert] BUILD SUCCEEDED Linux SUSE 9 gcc debug: drlvm test Wed, 04 Apr, 11:08
nom...@hursley.ibm.com [continuum] BUILD FAILURE: Classlib/linux.ia32 Build/Test Wed, 04 Apr, 11:34
nbe...@kc.rr.com [build-test alert] BUILD FAILED Windows 2000 msvc debug: classlib over ibmvm Wed, 04 Apr, 11:40
nbe...@kc.rr.com [build-test alert] BUILD FAILED Windows 2000 msvc debug: classlib over ibmvm Wed, 04 Apr, 12:38
nom...@intel.com [build-test alert] BUILD SUCCEEDED Linux SUSE 9 64bit gcc debug: drlvm tests Wed, 04 Apr, 13:20
nom...@intel.com [build-test alert] BUILD FAILED Linux SUSE 9 64bit gcc debug: drlvm reg.test Wed, 04 Apr, 13:34
nbe...@kc.rr.com [build-test alert] BUILD FAILED Windows 2000 msvc debug: classlib over ibmvm Wed, 04 Apr, 13:36
nom...@intel.com [build-test alert] BUILD FAILED Linux SUSE 9 gcc debug: drlvm reg.test Wed, 04 Apr, 14:04
nbe...@kc.rr.com [build-test alert] BUILD FAILED Windows 2000 msvc debug: classlib over ibmvm Wed, 04 Apr, 14:33
nom...@intel.com [build-test alert] BUILD SUCCEEDED Linux SUSE 9 gcc debug: drlvm reg.test Wed, 04 Apr, 15:01
nbe...@kc.rr.com [build-test alert] BUILD FAILED Windows 2000 msvc debug: classlib over ibmvm Wed, 04 Apr, 15:31
nbe...@kc.rr.com [build-test alert] BUILD SUCCEEDED Windows 2000 msvc debug: classlib Wed, 04 Apr, 15:48
nom...@intel.com [build-test alert] BUILD SUCCEEDED Linux SUSE 9 64bit gcc debug: drlvm reg.test Wed, 04 Apr, 15:49
nom...@intel.com [build-test alert] BUILD FAILED Linux SUSE 9 64bit gcc debug: classlib over drlvm Wed, 04 Apr, 16:33
nbe...@kc.rr.com [build-test alert] BUILD FAILED Windows 2000 msvc debug: classlib over ibmvm Wed, 04 Apr, 16:39
nbe...@kc.rr.com [build-test alert] BUILD FAILED Windows 2000 msvc debug: classlib over ibmvm Wed, 04 Apr, 17:36
nom...@intel.com [build-test alert] BUILD SUCCEEDED Linux SUSE 9 64bit gcc debug: classlib over drlvm Wed, 04 Apr, 18:17
nbe...@kc.rr.com [build-test alert] BUILD FAILED Windows 2000 msvc debug: classlib over ibmvm Wed, 04 Apr, 18:34
nom...@intel.com [build-test alert] BUILD FAILED SUSEL9 IA32 gcc debug: classlib tests iterative Wed, 04 Apr, 18:56
nom...@intel.com [build-test alert] BUILD FAILED Windows 2003 x86_64 msvc debug: classlib tests Wed, 04 Apr, 20:46
nom...@intel.com [build-test alert] BUILD FAILED LINUX SUSE 9 x86_64: jdktools_test Thu, 05 Apr, 04:08
nom...@intel.com [build-test alert] BUILD FAILED Windows 2003 x86_64 msvc debug: drlvm Thu, 05 Apr, 04:14
nom...@intel.com [build-test alert] BUILD SUCCEEDED Windows 2003 x86_64 msvc debug: classlib tests Thu, 05 Apr, 05:01
nom...@intel.com [build-test alert] BUILD FAILED Linux SUSE 9 gcc debug: classlib over drlvm Thu, 05 Apr, 05:04
nom...@intel.com [build-test alert] BUILD SUCCEEDED Linux SUSE 9 x86_64: jdktools_test Thu, 05 Apr, 05:33
nom...@intel.com [build-test alert] BUILD SUCCEEDED Linux SUSE 9 gcc debug: classlib over drlvm Thu, 05 Apr, 07:29
nom...@hursley.ibm.com [continuum] BUILD FAILURE: Classlib/linux.ia32 Build/Test Thu, 05 Apr, 10:26
nom...@intel.com [build-test alert] BUILD SUCCEEDED Windows 2003 x86_64 msvc debug: drlvm Thu, 05 Apr, 11:14
nom...@intel.com [build-test alert] BUILD FAILED Windows 2003 x86_64 msvc debug: classlib tests Thu, 05 Apr, 13:54
nom...@intel.com [build-test alert] BUILD FAILED WIN XP msvc debug: classlib tests iterative Thu, 05 Apr, 16:10
nom...@intel.com [build-test alert] BUILD FAILED Linux SUSE 9 64bit gcc debug: drlvm tests Thu, 05 Apr, 20:13
nom...@intel.com [build-test alert] BUILD SUCCEEDED Windows 2003 x86_64 msvc debug: classlib tests Thu, 05 Apr, 23:37
nom...@intel.com [build-test alert] BUILD FAILED SUSEL9 IA32 gcc debug: classlib tests iterative Fri, 06 Apr, 04:38
nom...@hursley.ibm.com [continuum] BUILD FAILURE: Classlib/linux.ia32 Build/Test Fri, 06 Apr, 04:41
nom...@intel.com [build-test alert] BUILD FAILED Windows XP SP2 msvc debug: drlvm tests Fri, 06 Apr, 05:30
nom...@intel.com [build-test alert] BUILD FAILED Linux SUSE 9 gcc debug: drlvm test Fri, 06 Apr, 05:47
nom...@hursley.ibm.com [continuum] BUILD FAILURE: Classlib/linux.ia32 Build/Test Fri, 06 Apr, 06:20
nom...@intel.com [build-test alert] BUILD FAILED Windows XP SP2 msvc debug: classlib over drlvm Fri, 06 Apr, 06:36
nom...@intel.com [build-test alert] BUILD FAILED Linux SUSE 9 gcc debug: classlib over drlvm Fri, 06 Apr, 07:01
nom...@intel.com [build-test alert] BUILD FAILED Windows 2003 x86_64 msvc debug: drlvm Fri, 06 Apr, 09:50
nom...@intel.com [build-test alert] BUILD SUCCEEDED Windows XP SP2 msvc debug: classlib over drlvm Fri, 06 Apr, 10:45
nom...@intel.com [build-test alert] BUILD SUCCEEDED Linux SUSE 9 gcc debug: classlib over drlvm Fri, 06 Apr, 15:30
nom...@intel.com [build-test alert] BUILD SUCCEEDED Windows XP SP2 msvc debug: drlvm tests Fri, 06 Apr, 16:21
nom...@intel.com [build-test alert] BUILD FAILED WIN XP msvc debug: classlib tests iterative Sat, 07 Apr, 00:05
nom...@intel.com [build-test alert] BUILD FAILED SUSEL9 IA32 gcc debug: classlib tests iterative Sat, 07 Apr, 14:05
nom...@intel.com [build-test alert] BUILD SUCCEEDED Windows 2003 x86_64 msvc debug: drlvm Sun, 08 Apr, 01:42
nom...@intel.com [build-test alert] BUILD FAILED WIN XP msvc debug: classlib tests iterative Sun, 08 Apr, 07:17
nom...@intel.com [build-test alert] BUILD FAILED SUSEL9 IA32 gcc debug: classlib tests iterative Sun, 08 Apr, 21:46
nom...@intel.com [build-test alert] BUILD FAILED Windows 2003 x86_64 msvc debug: classlib tests Mon, 09 Apr, 04:49
nom...@intel.com [build-test alert] BUILD SUCCEEDED Windows 2003 x86_64 msvc debug: classlib tests Mon, 09 Apr, 05:43
nom...@hursley.ibm.com [continuum] BUILD FAILURE: Classlib/linux.ia32 Build/Test Mon, 09 Apr, 09:34
nom...@intel.com [build-test alert] BUILD FAILED Windows 2003 x86_64 msvc debug: drlvm Mon, 09 Apr, 12:27
nom...@intel.com [build-test alert] BUILD FAILED WIN XP msvc debug: classlib tests iterative Mon, 09 Apr, 13:21
nom...@intel.com [build-test alert] BUILD SUCCEEDED Linux SUSE 9 64bit gcc debug: drlvm tests Mon, 09 Apr, 13:57
nom...@intel.com [build-test alert] BUILD SUCCEEDED Linux SUSE 9 gcc debug: drlvm test Mon, 09 Apr, 14:15
nom...@intel.com [build-test alert] BUILD FAILED Linux SUSE 9 gcc debug: classlib over drlvm Mon, 09 Apr, 15:25
nom...@intel.com [build-test alert] BUILD SUCCEEDED Linux SUSE 9 gcc debug: classlib over drlvm Mon, 09 Apr, 17:01
nom...@intel.com [build-test alert] BUILD FAILED SUSEL9 IA32 gcc debug: classlib tests iterative Tue, 10 Apr, 05:18
nom...@intel.com [build-test alert] BUILD FAILED Linux SUSE 9 gcc debug: classlib over drlvm Tue, 10 Apr, 07:37
nom...@intel.com [build-test alert] BUILD SUCCEEDED Linux SUSE 9 gcc debug: classlib over drlvm Tue, 10 Apr, 08:25
nom...@intel.com [build-test alert] BUILD SUCCEEDED Windows 2003 x86_64 msvc debug: drlvm Tue, 10 Apr, 09:18
nom...@intel.com [build-test alert] BUILD FAILED LINUX SUSE 9 x86_64: jdktools_test Tue, 10 Apr, 10:22
nom...@intel.com [build-test alert] BUILD FAILED Windows 2003 x86_64 msvc debug: drlvm Tue, 10 Apr, 10:42
nom...@intel.com [build-test alert] BUILD SUCCEEDED Linux SUSE 9 x86_64: jdktools_test Tue, 10 Apr, 11:42
nom...@intel.com [build-test alert] BUILD SUCCEEDED Windows 2003 x86_64 msvc debug: drlvm Tue, 10 Apr, 17:40
nom...@intel.com [build-test alert] BUILD FAILED WIN XP msvc debug: classlib tests iterative Tue, 10 Apr, 20:56
nom...@frigga.cs.uiuc.edu [build-test alert] BUILD SUCCEEDED lnx gcc debug: drlvm Wed, 11 Apr, 03:18
nom...@intel.com [build-test alert] BUILD FAILED SUSE Linux 64bit gcc debug: classlib EHWA Wed, 11 Apr, 12:56
nom...@intel.com [build-test alert] BUILD FAILED Windows 2003 x86_64 msvc debug: classlib tests Wed, 11 Apr, 13:06
nom...@hursley.ibm.com [continuum] BUILD FAILURE: Classlib/linux.ia32 Build/Test Wed, 11 Apr, 13:27
nom...@intel.com [build-test alert] BUILD FAILED SUSEL9 IA32 gcc debug: classlib tests iterative Wed, 11 Apr, 13:59
nom...@intel.com [build-test alert] BUILD FAILED Linux SUSE 9 64bit gcc debug: classlib over drlvm Wed, 11 Apr, 14:12
nom...@intel.com [build-test alert] BUILD FAILED Windows XP SP2 msvc debug: classlib over drlvm Wed, 11 Apr, 14:35
nom...@hursley.ibm.com [continuum] BUILD FAILURE: Classlib/linux.ia32 Build/Test Wed, 11 Apr, 15:18
nom...@intel.com [build-test alert] BUILD FAILED Windows XP SP2 msvc debug: drlvm tests Wed, 11 Apr, 16:58
nom...@hursley.ibm.com [continuum] BUILD FAILURE: Classlib/linux.ia32 Build/Test Wed, 11 Apr, 18:30
nom...@intel.com [build-test alert] BUILD SUCCEEDED Windows XP SP2 msvc debug: drlvm tests Wed, 11 Apr, 19:52
nom...@intel.com [build-test alert] BUILD FAILED Linux SUSE 9 gcc debug: classlib over drlvm Wed, 11 Apr, 19:55
nom...@hursley.ibm.com [continuum] BUILD FAILURE: Classlib/linux.ia32 Build/Test Thu, 12 Apr, 00:25
nom...@intel.com [build-test alert] BUILD FAILED WIN XP msvc debug: classlib tests iterative Thu, 12 Apr, 03:18
nom...@intel.com [build-test alert] BUILD SUCCEEDED SUSE Linux 64bit gcc debug: classlib EHWA Thu, 12 Apr, 04:10
nom...@hursley.ibm.com [continuum] BUILD FAILURE: Classlib/linux.ia32 Build/Test Thu, 12 Apr, 05:28
nom...@intel.com [build-test alert] BUILD FAILED Windows XP SP2 msvc debug: drlvm tests Thu, 12 Apr, 05:56
nom...@hursley.ibm.com [continuum] BUILD FAILURE: Classlib/linux.ia32 Build/Test Thu, 12 Apr, 07:29
nom...@intel.com [build-test alert] BUILD SUCCEEDED Windows XP SP2 msvc debug: drlvm tests Thu, 12 Apr, 08:48
nom...@intel.com [build-test alert] BUILD FAILED Windows 2003 x86_64 msvc debug: drlvm Thu, 12 Apr, 09:18
nom...@hursley.ibm.com [continuum] BUILD FAILURE: Classlib/linux.ia32 Build/Test Thu, 12 Apr, 09:25
nom...@intel.com [build-test alert] BUILD SUCCEEDED Windows XP SP2 msvc debug: classlib over drlvm Thu, 12 Apr, 09:39
nom...@intel.com [build-test alert] BUILD FAILED SUSE Linux 64bit gcc debug: classlib EHWA Thu, 12 Apr, 10:07
nom...@intel.com [build-test alert] BUILD SUCCEEDED Linux SUSE 9 gcc debug: classlib over drlvm Thu, 12 Apr, 10:28
nom...@intel.com [build-test alert] BUILD SUCCEEDED Linux SUSE 9 64bit gcc debug: classlib over drlvm Thu, 12 Apr, 10:36
nom...@intel.com [build-test alert] BUILD SUCCEEDED Windows 2003 x86_64 msvc debug: classlib tests Thu, 12 Apr, 11:24
nom...@hursley.ibm.com [continuum] BUILD FAILURE: Classlib/linux.ia32 Build/Test Thu, 12 Apr, 11:27
nom...@hursley.ibm.com [continuum] BUILD FAILURE: Classlib/linux.ia32 Build/Test Thu, 12 Apr, 15:33
nom...@intel.com [build-test alert] BUILD FAILED Windows XP SP2 msvc debug: drlvm tests Thu, 12 Apr, 16:29
nom...@hursley.ibm.com [continuum] BUILD FAILURE: Classlib/linux.ia32 Build/Test Thu, 12 Apr, 17:24
nom...@intel.com [build-test alert] BUILD SUCCEEDED Windows 2003 x86_64 msvc debug: drlvm Thu, 12 Apr, 17:30
Message list« Previous · 1 · 2 · 3 · 4 · 5 · Next »Thread · Author · Date
Box list
Jul 20113
Dec 201029
Nov 20106
Oct 201046
Sep 201035
Aug 201017
Jul 201029
Jun 201041
May 201020
Apr 201040
Mar 2010102
Feb 201043
Jan 201014
Dec 200911
Nov 20099
Oct 200912
Sep 20093
Aug 200915
Jul 200959
Jun 200916
May 200930
Apr 200960
Mar 200919
Feb 200945
Jan 200957
Dec 200827
Nov 200815
Oct 200824
Sep 200854
Aug 200834
Jul 200841
Jun 200899
May 200862
Apr 2008113
Mar 2008133
Feb 2008164
Jan 2008291
Dec 2007335
Nov 2007454
Oct 2007405
Sep 2007259
Aug 2007368
Jul 2007618
Jun 2007607
May 2007672
Apr 2007455
Mar 20071104
Feb 2007389
Jan 2007418
Dec 200692