harmony-alerts mailing list archives

Site index · List index
Message view « Date » · « Thread »
Top « Date » · « Thread »
From nbe...@kc.rr.com
Subject [build-test alert] BUILD FAILED Windows 2000 msvc debug: classlib over ibmvm
Date Fri, 13 Apr 2007 06:15:24 GMT
BUILD FAILED:
	Ant Error Message:
C:\bt-trunk\cc\projects\classlib\trunk\build.xml:169: The following error occurred while executing
this line: C:\bt-trunk\cc\projects\classlib\trunk\make\build-test.xml:147: There were test
errors.

Date of build:	04/13/2007 00:08:37
Time to build:	64 minutes 38 seconds
Last changed:	04/12/2007 23:54:30
Last log entry:	classlib

***********************************************************
Errors/Warnings:	(359)
            
Tests FAILED
Tests FAILED
Tests FAILED

========================================
Testing class libraries...
========================================

Checking for depends/jars/yoko_M2-20070130/yoko.jar
Checking for depends/jars/yoko_M2-20070130/yoko-core.jar
Checking for depends/jars/yoko_M2-20070130/yoko-rmi-impl.jar
Checking for depends/jars/yoko_M2-20070130/yoko-rmi-spec.jar
Checking for depends/jars/bcel-5.2/bcel-5.2.jar
Checking for depends/jars/xalan-j_2.7.0/xalan.jar
Checking for depends/jars/xerces_2.9.0/xerces.zip
Checking for depends/jars/junit_3.8.2/junit.jar
Checking for depends/jars/bcprov-jdk15-134/bcprov.jar
Checking for depends/jars/icu4j_3.4.4/icu4j_3_4_4.jar
Checking for depends/jars/mx4j_3.0.2/mx4j.zip
Checking for depends/jars/ecj_3.2/ecj_3.2.jar
Checking for depends/jars/jetty/jetty-6.0.0.jar
Checking for depends/jars/jetty/jetty-util-6.0.0.jar
Checking for depends/jars/jetty/servlet-api-2.5-6.0.0.jar
Checking for depends/libs/windows.x86/msvcr71.dll
Checking for depends/libs/windows.x86/swing_awt_deps_winxp_2006-09-28.tgz
hy.test.vm.name = ibm
Compiling ACCESSIBILITY classes
Compiling ACCESSIBILITY tests
Since fork is false, ignoring memoryMaximumSize setting
Compiling ANNOTATION classes
Compiling ANNOTATION tests
Since fork is false, ignoring memoryMaximumSize setting
----------
1. WARNING in C:\bt-trunk\cc\projects\classlib\trunk\modules\annotation\src\test\java\org\apache\harmony\annotation\tests\java\lang\annotation\IncompleteAnnotationExceptionTest.java
 (at line 53)
	clazz, elementName);
	^^^^^
Type safety: The expression of type Class needs unchecked conversion to conform to Class<?
extends Annotation>
----------
1 problem (1 warning)
Compiling APPLET classes
Compiling APPLET tests
Since fork is false, ignoring memoryMaximumSize setting
Compiling ARCHIVE classes
Compiling ARCHIVE tests
Since fork is false, ignoring memoryMaximumSize setting
Compiling AUTH classes
Compiling AUTH tests
Since fork is false, ignoring memoryMaximumSize setting
Compiling AWT classes
Compiling AWT tests
Since fork is false, ignoring memoryMaximumSize setting
Compiling BEANS classes
Compiling support classes for BEANS tests
Compiling internal BEANS tests
Compiling BEANS tests
Since fork is false, ignoring memoryMaximumSize setting
Running internal BEANS tests
Running BEANS tests
Compiling CRYPTO classes
Compiling CRYPTO test support files
Compiling CRYPTO api tests
Since fork is false, ignoring memoryMaximumSize setting
Compiling CRYPTO api injected tests
Since fork is false, ignoring memoryMaximumSize setting
Compiling CRYPTO impl injected tests
Since fork is false, ignoring memoryMaximumSize setting
Compiling CRYPTO impl tests
Since fork is false, ignoring memoryMaximumSize setting
Running CRYPTO api tests
Running CRYPTO api.injected tests
Running CRYPTO impl tests
Running CRYPTO impl injected tests
Compiling ImageIO classes
Compiling ImageIO tests
Since fork is false, ignoring memoryMaximumSize setting
Compiling INSTRUMENT classes
Compiling INSTRUMENT tests
Since fork is false, ignoring memoryMaximumSize setting
Compiling JNDI classes
Compiling JNDI tests
Since fork is false, ignoring memoryMaximumSize setting
Compiling LANG-MANAGEMENT classes
Compiling LANG-MANAGEMENT API tests
Since fork is false, ignoring memoryMaximumSize setting
Compiling LANG-MANAGEMENT Implementation tests
Since fork is false, ignoring memoryMaximumSize setting
Compiling LOGGING classes
Compiling LOGGING tests
Since fork is false, ignoring memoryMaximumSize setting
Compiling LUNI classes
Compiling LUNI JUnit Tests
Since fork is false, ignoring memoryMaximumSize setting
Running LUNI JUnit Tests
2007-04-13 00:27:46.619::INFO:  Logging to STDERR via org.mortbay.log.StdErrLog
2007-04-13 00:27:46.749::INFO:  jetty-6.0.x
2007-04-13 00:27:46.879::INFO:  Started SocketConnector @ 0.0.0.0:1071
2007-04-13 00:29:27.344::INFO:  jetty-6.0.x
2007-04-13 00:29:27.444::INFO:  Started SocketConnector @ 0.0.0.0:1368
2007-04-13 00:29:28.496::INFO:  jetty-6.0.x
2007-04-13 00:29:28.496::INFO:  Started SocketConnector @ 0.0.0.0:1381
Compiling MATH classes
Compiling MATH tests
Since fork is false, ignoring memoryMaximumSize setting
Compiling MISC classes
Compiling MISC tests
Since fork is false, ignoring memoryMaximumSize setting
Compiling NIO classes
Compiling NIO tests
Since fork is false, ignoring memoryMaximumSize setting
Compiling NIO_CHAR classes
Compiling NIO_CHAR tests
Since fork is false, ignoring memoryMaximumSize setting
Cannot find unmappable byte array for US-ASCII
Cannot find unmappable byte array for gb18030
Cannot find unmappable byte array for ISO-8859-1
Cannot find malform byte array for ISO-8859-1
Cannot find unmappable byte array for UTF-16BE
Cannot find malform byte array for UTF-16BE
Cannot find unmappable byte array for UTF-16
Cannot find malform byte array for UTF-16
Cannot find unmappable byte array for UTF-16LE
Cannot find malform byte array for UTF-16LE
Cannot find unmappable byte array for UTF-8
Compiling PACK200 classes
Compiling PACK200 tests
Since fork is false, ignoring memoryMaximumSize setting
Running PACK200 tests
Compiling PREFS classes
Compiling PREFS tests
Since fork is false, ignoring memoryMaximumSize setting
Compiling PRINT classes
Compiling Print tests
Since fork is false, ignoring memoryMaximumSize setting
Compiling REGEX classes
Compiling REGEX tests
Since fork is false, ignoring memoryMaximumSize setting
Compiling RMI classes
Compiling RMI api tests
Since fork is false, ignoring memoryMaximumSize setting
Running RMI api tests
testDirectSocket_SingleVM starting
Test server started.
Object: MyRemoteObject[UnicastServerRef[endpoint:[[192.168.1.150:2726]](local), ObjID[65536,
UID[2f2e2f2e:111e970a51e:-8000]]]] created and exported.
Apr 13, 2007 12:35:46 AM org.apache.harmony.rmi.server.RMIReference makeStrong
FINER: main: Strongly referenced RegistryImpl
Registry created.
Object bound in the registry.
Registry located.
Apr 13, 2007 12:35:47 AM org.apache.harmony.rmi.client.ClientConnection sendDGCAck
FINER: main: Sent DGC ack to [localhost:1099] for UID[2f2e2f2e:111e970a51e:-7ffd]
Lookup object is: Proxy[interf:[org.apache.harmony.rmi.test.MyRemoteInterface, java.rmi.Remote],
RemoteObjectInvocationHandler[UnicastRef[endpoint:[[192.168.1.150:2726]](remote), ObjID[65536,
UID[2f2e2f2e:111e970a51e:-8000]]]]]
Testing test_String_Void...
Done.
Testing test_Void_String...
Returned: MyRemoteObject.test_Void_String
Done.
Testing test_Int_Void...
Done.
Testing test_Void_Int...
Returned: 987654321
Done.
Testing test_Remote_Void...
Done.
Testing test_Remote_Void with remote object extending another remote object...
Done.
Testing test_Void_Remote...
Apr 13, 2007 12:35:47 AM org.apache.harmony.rmi.client.ClientConnection sendDGCAck
FINER: main: Sent DGC ack to [192.168.1.150:2726] for UID[2f2e2f2e:111e970a51e:-7fe8]
Returned: Proxy[interf:[org.apache.harmony.rmi.test.MyRemoteInterface2, java.rmi.Remote],
RemoteObjectInvocationHandler[UnicastRef[endpoint:[[192.168.1.150:2734]](remote), ObjID[65539,
UID[2f2e2f2e:111e970a51e:-7fe9]]]]]
Done.
Testing test_Long_Long...
Returned: 998877665544332211
Done.
Testing test_String_String...
Returned: MyRemoteObject.test_String_String
Done.
Testing test_Remote_Remote...
Apr 13, 2007 12:35:47 AM org.apache.harmony.rmi.client.ClientConnection sendDGCAck
FINER: main: Sent DGC ack to [192.168.1.150:2726] for UID[2f2e2f2e:111e970a51e:-7fde]
Returned: Proxy[interf:[org.apache.harmony.rmi.test.MyRemoteInterface2, java.rmi.Remote],
RemoteObjectInvocationHandler[UnicastRef[endpoint:[[192.168.1.150:2738]](remote), ObjID[65541,
UID[2f2e2f2e:111e970a51e:-7fdf]]]]]
Done.
Testing test_RemoteString_Void...
Done.
Testing test_RemoteRemote_Remote...
Apr 13, 2007 12:35:48 AM org.apache.harmony.rmi.client.ClientConnection sendDGCAck
FINER: main: Sent DGC ack to [192.168.1.150:2726] for UID[2f2e2f2e:111e970a51e:-7fd0]
Returned: Proxy[interf:[org.apache.harmony.rmi.test.MyRemoteInterface2, java.rmi.Remote],
RemoteObjectInvocationHandler[UnicastRef[endpoint:[[192.168.1.150:2745]](remote), ObjID[65545,
UID[2f2e2f2e:111e970a51e:-7fd1]]]]]
Done.
Testing test_BooleanStringRemote_Void...
Done.
Testing test_Proxy_Void...
Done.
Testing test_Array_Void...
Done.
Testing test_Void_Array...
Done.
Testing test_RemoteArray_Void...
Done.
Testing test_Void_RemoteArray...
Apr 13, 2007 12:35:49 AM org.apache.harmony.rmi.client.ClientConnection sendDGCAck
FINER: main: Sent DGC ack to [192.168.1.150:2726] for UID[2f2e2f2e:111e970a51e:-7fbd]
Done.
Testing test_Exception...
org.apache.harmony.rmi.test.MyException: MyRemoteObject.test_Exception
Done.
Testing test_Error...
java.rmi.ServerError: Error occurred while remote method invocation; nested exception is:
	java.lang.Error: MyRemoteObject.test_Error
Done.
Testing test_RuntimeException...
java.lang.RuntimeException: MyRemoteObject.text_RuntimeException
Done.
Testing test_RemoteException...
testDirectHTTP_SingleVM starting
java.rmi.ServerException: RemoteException occurred while remote method invocation; nested
exception is:
	java.rmi.RemoteException: MyRemoteObject.text_RemoteException
Done.
Test server complete.
Test server closing.
Unexporting MyRemoteObject[UnicastServerRef[endpoint:[[192.168.1.150:2726]](local), ObjID[65536,
UID[2f2e2f2e:111e970a51e:-8000]]]] ...
Done.
Test server started.
Object: MyRemoteObject[UnicastServerRef[endpoint:[[192.168.1.150:2754]](local), ObjID[65536,
UID[2f3c2f3c:111e970c581:-8000]]]] created and exported.
Apr 13, 2007 12:35:55 AM org.apache.harmony.rmi.server.RMIReference makeStrong
FINER: main: Strongly referenced RegistryImpl
Registry created.
Object bound in the registry.
Registry located.
Apr 13, 2007 12:35:55 AM org.apache.harmony.rmi.client.ClientConnection sendDGCAck
FINER: main: Sent DGC ack to [localhost:1099] for UID[2f3c2f3c:111e970c581:-7ffd]
Lookup object is: Proxy[interf:[org.apache.harmony.rmi.test.MyRemoteInterface, java.rmi.Remote],
RemoteObjectInvocationHandler[UnicastRef[endpoint:[[192.168.1.150:2754]](remote), ObjID[65536,
UID[2f3c2f3c:111e970c581:-8000]]]]]
Testing test_String_Void...
Done.
Testing test_Void_String...
Returned: MyRemoteObject.test_Void_String
Done.
Testing test_Int_Void...
Done.
Testing test_Void_Int...
Returned: 987654321
Done.
Testing test_Remote_Void...
Done.
Testing test_Remote_Void with remote object extending another remote object...
Done.
Testing test_Void_Remote...
Apr 13, 2007 12:35:56 AM org.apache.harmony.rmi.client.ClientConnection sendDGCAck
FINER: main: Sent DGC ack to [192.168.1.150:2754] for UID[2f3c2f3c:111e970c581:-7fe8]
Returned: Proxy[interf:[org.apache.harmony.rmi.test.MyRemoteInterface2, java.rmi.Remote],
RemoteObjectInvocationHandler[UnicastRef[endpoint:[[192.168.1.150:2762]](remote), ObjID[65539,
UID[2f3c2f3c:111e970c581:-7fe9]]]]]
Done.
Testing test_Long_Long...
Returned: 998877665544332211
Done.
Testing test_String_String...
Returned: MyRemoteObject.test_String_String
Done.
Testing test_Remote_Remote...
Apr 13, 2007 12:35:56 AM org.apache.harmony.rmi.client.ClientConnection sendDGCAck
FINER: main: Sent DGC ack to [192.168.1.150:2754] for UID[2f3c2f3c:111e970c581:-7fde]
Returned: Proxy[interf:[org.apache.harmony.rmi.test.MyRemoteInterface2, java.rmi.Remote],
RemoteObjectInvocationHandler[UnicastRef[endpoint:[[192.168.1.150:2766]](remote), ObjID[65541,
UID[2f3c2f3c:111e970c581:-7fdf]]]]]
Done.
Testing test_RemoteString_Void...
Done.
Testing test_RemoteRemote_Remote...
Apr 13, 2007 12:35:56 AM org.apache.harmony.rmi.client.ClientConnection sendDGCAck
FINER: main: Sent DGC ack to [192.168.1.150:2754] for UID[2f3c2f3c:111e970c581:-7fd0]
Returned: Proxy[interf:[org.apache.harmony.rmi.test.MyRemoteInterface2, java.rmi.Remote],
RemoteObjectInvocationHandler[UnicastRef[endpoint:[[192.168.1.150:2773]](remote), ObjID[65545,
UID[2f3c2f3c:111e970c581:-7fd1]]]]]
Done.
Testing test_BooleanStringRemote_Void...
Done.
Testing test_Proxy_Void...
Done.
Testing test_Array_Void...
Done.
Testing test_Void_Array...
Done.
Testing test_RemoteArray_Void...
Done.
Testing test_Void_RemoteArray...
Apr 13, 2007 12:35:56 AM org.apache.harmony.rmi.client.ClientConnection sendDGCAck
FINER: main: Sent DGC ack to [192.168.1.150:2754] for UID[2f3c2f3c:111e970c581:-7fbd]
Done.
Testing test_Exception...
org.apache.harmony.rmi.test.MyException: MyRemoteObject.test_Exception
Done.
Testing test_Error...
java.rmi.ServerError: Error occurred while remote method invocation; nested exception is:
	java.lang.Error: MyRemoteObject.test_Error
Done.
Testing test_RuntimeException...
java.lang.RuntimeException: MyRemoteObject.text_RuntimeException
Done.
Testing test_RemoteException...
java.rmi.ServerException: RemoteException occurred while remote method invocation; nested
exception is:
	java.rmi.RemoteException: MyRemoteObject.text_RemoteException
Done.
Test server complete.
Test server closing.
Unexporting MyRemoteObject[UnicastServerRef[endpoint:[[192.168.1.150:2754]](local), ObjID[65536,
UID[2f3c2f3c:111e970c581:-8000]]]] ...
Done.
Unexporting MyRemoteObject1[UnicastServerRef[endpoint:[[192.168.1.150:2783]](local), ObjID[65536,
UID[1c961c96:111e970de3b:-7ff7]]]] ...
Done.
Unexporting MyRemoteObject1[UnicastServerRef[endpoint:[[192.168.1.150:2784]](local), ObjID[65537,
UID[1c961c96:111e970de3b:-7ff6]]]] ...
Done.
Unexporting MyRemoteObject1[UnicastServerRef[endpoint:[[192.168.1.150:2785]](local), ObjID[65538,
UID[1c961c96:111e970de3b:-7ff5]]]] ...
Done.
Unexporting MyRemoteObject1[UnicastServerRef[endpoint:[[192.168.1.150:2786]](local), ObjID[65539,
UID[1c961c96:111e970de3b:-7ff4]]]] ...
Done.
Unexporting MyRemoteObject1[UnicastServerRef[endpoint:[[192.168.1.150:2787]](local), ObjID[65540,
UID[1c961c96:111e970de3b:-7ff3]]]] ...
Done.
Unexporting MyRemoteObject1[UnicastServerRef[endpoint:[[192.168.1.150:2788]](local), ObjID[65541,
UID[1c961c96:111e970de3b:-7ff2]]]] ...
Done.
Unexporting MyRemoteObject1[UnicastServerRef[endpoint:[[192.168.1.150:2789]](local), ObjID[65542,
UID[1c961c96:111e970de3b:-7ff1]]]] ...
Done.
Unexporting MyRemoteObject1[UnicastServerRef[endpoint:[[192.168.1.150:2790]](local), ObjID[65543,
UID[1c961c96:111e970de3b:-7ff0]]]] ...
Done.
LogStream[tst]:
Compiling SECURITY classes
Compiling SECURITY test support files
Since fork is false, ignoring memoryMaximumSize setting
Compiling SECURITY api tests
Since fork is false, ignoring memoryMaximumSize setting
Compiling SECURITY api injected tests
Since fork is false, ignoring memoryMaximumSize setting
Compiling SECURITY impl injected tests
Since fork is false, ignoring memoryMaximumSize setting
Compiling SECURITY impl tests
Since fork is false, ignoring memoryMaximumSize setting
Running SECURITY api tests
Running SECURITY api.injected tests
Running SECURITY impl tests
Running SECURITY impl injected tests
Compiling SOUND classes
Compiling SOUND tests
Since fork is false, ignoring memoryMaximumSize setting
Compiling SQL classes
Compiling SQL tests
Since fork is false, ignoring memoryMaximumSize setting
Compiling Sun Compat classes
Compiling SUNCOMPAT tests
Compiling SWING classes
Compiling SWING tests
Since fork is false, ignoring memoryMaximumSize setting
Compiling TEXT classes
Compiling TEXT tests
Since fork is false, ignoring memoryMaximumSize setting
Compiling TOOLS classes
Compiling Tools tests
Since fork is false, ignoring memoryMaximumSize setting
Compiling X-NET classes
Compiling X-NET test support files
Compiling X-NET api tests
Since fork is false, ignoring memoryMaximumSize setting
Compiling X-NET impl injected tests
Since fork is false, ignoring memoryMaximumSize setting
Compiling X-NET impl tests
Since fork is false, ignoring memoryMaximumSize setting
Running X-NET api tests
Running X-NET impl tests
Running X-NET impl injected tests
The test report is in C:\bt-trunk\cc\projects\classlib\trunk\build\test_report\html\index.html

***********************************************************
Unit Tests: (21233)
        
error: test_loadFromXMLLjava_io_InputStream tests.api.java.util.PropertiesTest
error: test_storeToXMLLjava_io_OutputStreamLjava_lang_StringLjava_lang_String tests.api.java.util.PropertiesTest
failure: testHarmony2305 java.awt.ButtonRTest
failure: testGetSystemTypeDescription javax.swing.filechooser.FileSystemViewTest
failure: testGetFiles javax.swing.filechooser.FileSystemViewTest
failure: testJFileChooser javax.swing.JFileChooserTest
failure: testSetup javax.swing.JFileChooserTest
failure: testGetSetCurrentDirectory javax.swing.JFileChooserTest
failure: testChangeToParentDirectory javax.swing.JFileChooserTest
failure: test_joinGroupLjava_net_SocketAddressLjava_net_NetworkInterface tests.api.java.net.MulticastSocketTest
Unit Test Error Details:	(10)
                
Test: test_loadFromXMLLjava_io_InputStreamClass: tests.api.java.util.PropertiesTestjava.lang.NullPointerException
	at org.apache.xerces.dom.NamedNodeMapImpl.findNamePoint(Unknown Source)
	at org.apache.xerces.dom.AttributeMap.setNamedItem(Unknown Source)
	at org.apache.xerces.dom.DeferredElementImpl.synchronizeData(Unknown Source)
	at org.apache.xerces.dom.ElementImpl.getTagName(Unknown Source)
	at org.apache.xerces.dom.DeepNodeListImpl.nextMatchingElementAfter(Unknown Source)
	at org.apache.xerces.dom.DeepNodeListImpl.item(Unknown Source)
	at org.apache.xerces.dom.DeepNodeListImpl.getLength(Unknown Source)
	at java.util.Properties.loadFromXML(Properties.java:566)
	at tests.api.java.util.PropertiesTest.test_loadFromXMLLjava_io_InputStream(PropertiesTest.java:296)
	at java.lang.reflect.AccessibleObject.invokeV(AccessibleObject.java:25)

Test: test_storeToXMLLjava_io_OutputStreamLjava_lang_StringLjava_lang_StringClass: tests.api.java.util.PropertiesTestjava.lang.NullPointerException
	at org.apache.xerces.dom.NamedNodeMapImpl.findNamePoint(Unknown Source)
	at org.apache.xerces.dom.AttributeMap.setNamedItem(Unknown Source)
	at org.apache.xerces.dom.DeferredElementImpl.synchronizeData(Unknown Source)
	at org.apache.xerces.dom.ElementImpl.getTagName(Unknown Source)
	at org.apache.xerces.dom.DeepNodeListImpl.nextMatchingElementAfter(Unknown Source)
	at org.apache.xerces.dom.DeepNodeListImpl.item(Unknown Source)
	at org.apache.xerces.dom.DeepNodeListImpl.getLength(Unknown Source)
	at java.util.Properties.loadFromXML(Properties.java:566)
	at tests.api.java.util.PropertiesTest.test_storeToXMLLjava_io_OutputStreamLjava_lang_StringLjava_lang_String(PropertiesTest.java:345)
	at java.lang.reflect.AccessibleObject.invokeV(AccessibleObject.java:25)

Test: testHarmony2305Class: java.awt.ButtonRTestjunit.framework.AssertionFailedError
	at java.awt.ButtonRTest.testHarmony2305(ButtonRTest.java:71)
	at java.lang.reflect.AccessibleObject.invokeV(AccessibleObject.java:25)

Test: testGetSystemTypeDescriptionClass: javax.swing.filechooser.FileSystemViewTestjunit.framework.AssertionFailedError:
name is empty
	at javax.swing.filechooser.FileSystemViewTest.assertNotEmpty(FileSystemViewTest.java:150)
	at javax.swing.filechooser.FileSystemViewTest.testGetSystemTypeDescription(FileSystemViewTest.java:92)
	at java.lang.reflect.AccessibleObject.invokeV(AccessibleObject.java:25)
	at javax.swing.BasicSwingTestCase.runBareSuper(BasicSwingTestCase.java:117)
	at javax.swing.SwingTestCase$1.run(SwingTestCase.java:45)
	at java.awt.event.InvocationEvent.runAndNotify(InvocationEvent.java:92)
	at java.awt.event.InvocationEvent.dispatch(InvocationEvent.java:81)
	at java.awt.EventQueueCore.dispatchEventImpl(EventQueueCore.java:140)
	at java.awt.EventQueue.dispatchEvent(EventQueue.java:144)
	at java.awt.EventDispatchThread.runModalLoop(EventDispatchThread.java:74)
	at java.awt.EventDispatchThread.run(EventDispatchThread.java:48)

Test: testGetFilesClass: javax.swing.filechooser.FileSystemViewTestjunit.framework.AssertionFailedError:
expected:<1> but was:<0>
	at javax.swing.filechooser.FileSystemViewTest.testGetFiles(FileSystemViewTest.java:139)
	at java.lang.reflect.AccessibleObject.invokeV(AccessibleObject.java:25)
	at javax.swing.BasicSwingTestCase.runBareSuper(BasicSwingTestCase.java:117)
	at javax.swing.SwingTestCase$1.run(SwingTestCase.java:45)
	at java.awt.event.InvocationEvent.runAndNotify(InvocationEvent.java:92)
	at java.awt.event.InvocationEvent.dispatch(InvocationEvent.java:81)
	at java.awt.EventQueueCore.dispatchEventImpl(EventQueueCore.java:140)
	at java.awt.EventQueue.dispatchEvent(EventQueue.java:144)
	at java.awt.EventDispatchThread.runModalLoop(EventDispatchThread.java:74)
	at java.awt.EventDispatchThread.run(EventDispatchThread.java:48)

Test: testJFileChooserClass: javax.swing.JFileChooserTestjunit.framework.AssertionFailedError:
expected:<C:\Documents and Settings\nbeyer\My Documents> but was:<::{20D04FE0-3AEA-1069-A2D8-08002B30309D}>
	at javax.swing.JFileChooserTest.testJFileChooser(JFileChooserTest.java:59)
	at java.lang.reflect.AccessibleObject.invokeV(AccessibleObject.java:25)
	at javax.swing.BasicSwingTestCase.runBareSuper(BasicSwingTestCase.java:117)
	at javax.swing.SwingTestCase$1.run(SwingTestCase.java:45)
	at java.awt.event.InvocationEvent.runAndNotify(InvocationEvent.java:92)
	at java.awt.event.InvocationEvent.dispatch(InvocationEvent.java:81)
	at java.awt.EventQueueCore.dispatchEventImpl(EventQueueCore.java:140)
	at java.awt.EventQueue.dispatchEvent(EventQueue.java:144)
	at java.awt.EventDispatchThread.runModalLoop(EventDispatchThread.java:74)
	at java.awt.EventDispatchThread.run(EventDispatchThread.java:48)

Test: testSetupClass: javax.swing.JFileChooserTestjunit.framework.AssertionFailedError: Detected
problem expected:<C:\Documents and Settings\nbeyer\My Documents> but was:<::{20D04FE0-3AEA-1069-A2D8-08002B30309D}>
	at javax.swing.JFileChooserTest.testSetup(JFileChooserTest.java:178)
	at java.lang.reflect.AccessibleObject.invokeV(AccessibleObject.java:25)
	at javax.swing.BasicSwingTestCase.runBareSuper(BasicSwingTestCase.java:117)
	at javax.swing.SwingTestCase$1.run(SwingTestCase.java:45)
	at java.awt.event.InvocationEvent.runAndNotify(InvocationEvent.java:92)
	at java.awt.event.InvocationEvent.dispatch(InvocationEvent.java:81)
	at java.awt.EventQueueCore.dispatchEventImpl(EventQueueCore.java:140)
	at java.awt.EventQueue.dispatchEvent(EventQueue.java:144)
	at java.awt.EventDispatchThread.runModalLoop(EventDispatchThread.java:74)
	at java.awt.EventDispatchThread.run(EventDispatchThread.java:48)

Test: testGetSetCurrentDirectoryClass: javax.swing.JFileChooserTestjunit.framework.AssertionFailedError:
expected:<C:\Documents and Settings\nbeyer\My Documents> but was:<::{20D04FE0-3AEA-1069-A2D8-08002B30309D}>
	at javax.swing.JFileChooserTest.testGetSetCurrentDirectory(JFileChooserTest.java:231)
	at java.lang.reflect.AccessibleObject.invokeV(AccessibleObject.java:25)
	at javax.swing.BasicSwingTestCase.runBareSuper(BasicSwingTestCase.java:117)
	at javax.swing.SwingTestCase$1.run(SwingTestCase.java:45)
	at java.awt.event.InvocationEvent.runAndNotify(InvocationEvent.java:92)
	at java.awt.event.InvocationEvent.dispatch(InvocationEvent.java:81)
	at java.awt.EventQueueCore.dispatchEventImpl(EventQueueCore.java:140)
	at java.awt.EventQueue.dispatchEvent(EventQueue.java:144)
	at java.awt.EventDispatchThread.runModalLoop(EventDispatchThread.java:74)
	at java.awt.EventDispatchThread.run(EventDispatchThread.java:48)

Test: testChangeToParentDirectoryClass: javax.swing.JFileChooserTestjunit.framework.AssertionFailedError:
expected:<C:\Documents and Settings\nbeyer> but was:<::{20D04FE0-3AEA-1069-A2D8-08002B30309D}>
	at javax.swing.JFileChooserTest.testChangeToParentDirectory(JFileChooserTest.java:258)
	at java.lang.reflect.AccessibleObject.invokeV(AccessibleObject.java:25)
	at javax.swing.BasicSwingTestCase.runBareSuper(BasicSwingTestCase.java:117)
	at javax.swing.SwingTestCase$1.run(SwingTestCase.java:45)
	at java.awt.event.InvocationEvent.runAndNotify(InvocationEvent.java:92)
	at java.awt.event.InvocationEvent.dispatch(InvocationEvent.java:81)
	at java.awt.EventQueueCore.dispatchEventImpl(EventQueueCore.java:140)
	at java.awt.EventQueue.dispatchEvent(EventQueue.java:144)
	at java.awt.EventDispatchThread.runModalLoop(EventDispatchThread.java:74)
	at java.awt.EventDispatchThread.run(EventDispatchThread.java:48)

Test: test_joinGroupLjava_net_SocketAddressLjava_net_NetworkInterfaceClass: tests.api.java.net.MulticastSocketTestjunit.framework.AssertionFailedError:
Group member received data on other interface when only asked for it on one interface: 
	at tests.api.java.net.MulticastSocketTest.test_joinGroupLjava_net_SocketAddressLjava_net_NetworkInterface(MulticastSocketTest.java:539)
	at java.lang.reflect.AccessibleObject.invokeV(AccessibleObject.java:25)


***********************************************************
Modifications since last successful build:	(43)
            
add cc-classlib log20070412235430Lbuild.1 04/12/2007 23:54:30classlib
modified ndbeyer  /harmony/enhanced/classlib/trunk/depends/manifests/xerces_2.9.0/META-INF/MANIFEST.MF
04/12/2007 23:47:16 Correct the xerces manifests for new version (2.9.0)
deleted ndbeyer  /harmony/enhanced/classlib/trunk/depends/manifests/xerces_2.8.0 04/12/2007
23:47:16 Correct the xerces manifests for new version (2.9.0)
added ndbeyer  /harmony/enhanced/classlib/trunk/depends/manifests/xerces_2.9.0 04/12/2007
23:47:16 Correct the xerces manifests for new version (2.9.0)
modified ndbeyer  /harmony/enhanced/classlib/trunk/modules/luni/src/test/java/tests/api/java/io/OutputStreamWriterTest.java
04/12/2007 23:09:21 apply patch for HARMONY-3604:[classlib][luni]Minor fix in OutputStreamWriterTest
modified ndbeyer  /harmony/enhanced/classlib/trunk/modules/awt/src/main/native/win32wrapper/windows/org_apache_harmony_awt_nativebridge_windows_Win32.cpp
04/12/2007 17:03:08 Apply patch for HARMONY-3569:[classlib][awt] gl library depends on uxtheme.dll
which is not present in Windows 2000
modified ndbeyer  /harmony/enhanced/classlib/trunk/modules/awt/src/main/native/gl/windows/WinThemeGraphics.cpp
04/12/2007 17:03:08 Apply patch for HARMONY-3569:[classlib][awt] gl library depends on uxtheme.dll
which is not present in Windows 2000
modified varlax  /harmony/enhanced/classlib/trunk/modules/nio/src/main/java/java/nio/LongToByteBufferAdapter.java
04/12/2007 10:27:49 Fixed HARMONY-3591, HARMONY-3638 [classlib][nio] Flawed JNI support for
direct buffer viewsRegression test is added to DRLVM module.
modified varlax  /harmony/enhanced/classlib/trunk/modules/nio/src/main/java/java/nio/ShortToByteBufferAdapter.java
04/12/2007 10:27:49 Fixed HARMONY-3591, HARMONY-3638 [classlib][nio] Flawed JNI support for
direct buffer viewsRegression test is added to DRLVM module.
modified varlax  /harmony/enhanced/classlib/trunk/modules/nio/src/main/java/org/apache/harmony/nio/internal/DirectBuffer.java
04/12/2007 10:27:49 Fixed HARMONY-3591, HARMONY-3638 [classlib][nio] Flawed JNI support for
direct buffer viewsRegression test is added to DRLVM module.
modified varlax  /harmony/enhanced/classlib/trunk/modules/nio/src/main/java/java/nio/MappedByteBufferAdapter.java
04/12/2007 10:27:49 Fixed HARMONY-3591, HARMONY-3638 [classlib][nio] Flawed JNI support for
direct buffer viewsRegression test is added to DRLVM module.
modified varlax  /harmony/enhanced/classlib/trunk/modules/nio/src/main/java/java/nio/FloatToByteBufferAdapter.java
04/12/2007 10:27:49 Fixed HARMONY-3591, HARMONY-3638 [classlib][nio] Flawed JNI support for
direct buffer viewsRegression test is added to DRLVM module.
modified varlax  /harmony/enhanced/classlib/trunk/modules/nio/src/main/java/java/nio/DirectByteBuffer.java
04/12/2007 10:27:49 Fixed HARMONY-3591, HARMONY-3638 [classlib][nio] Flawed JNI support for
direct buffer viewsRegression test is added to DRLVM module.
modified varlax  /harmony/enhanced/classlib/trunk/modules/nio/src/main/java/java/nio/DoubleToByteBufferAdapter.java
04/12/2007 10:27:49 Fixed HARMONY-3591, HARMONY-3638 [classlib][nio] Flawed JNI support for
direct buffer viewsRegression test is added to DRLVM module.
modified varlax  /harmony/enhanced/classlib/trunk/modules/nio/src/main/java/java/nio/IntToByteBufferAdapter.java
04/12/2007 10:27:49 Fixed HARMONY-3591, HARMONY-3638 [classlib][nio] Flawed JNI support for
direct buffer viewsRegression test is added to DRLVM module.
modified varlax  /harmony/enhanced/classlib/trunk/modules/nio/src/main/native/nio/shared/DirectBufferUtil.c
04/12/2007 10:27:49 Fixed HARMONY-3591, HARMONY-3638 [classlib][nio] Flawed JNI support for
direct buffer viewsRegression test is added to DRLVM module.
modified varlax  /harmony/enhanced/drlvm/trunk/src/test/regression/H0000/DirectByteBufferTest.java
04/12/2007 10:27:49 Fixed HARMONY-3591, HARMONY-3638 [classlib][nio] Flawed JNI support for
direct buffer viewsRegression test is added to DRLVM module.
modified varlax  /harmony/enhanced/classlib/trunk/modules/nio/src/main/java/java/nio/CharToByteBufferAdapter.java
04/12/2007 10:27:49 Fixed HARMONY-3591, HARMONY-3638 [classlib][nio] Flawed JNI support for
direct buffer viewsRegression test is added to DRLVM module.
modified varlax  /harmony/enhanced/drlvm/trunk/src/test/regression/H0000/DirectByteBufferTest.c
04/12/2007 10:27:49 Fixed HARMONY-3591, HARMONY-3638 [classlib][nio] Flawed JNI support for
direct buffer viewsRegression test is added to DRLVM module.
added hindessm  /harmony/enhanced/classlib/trunk/modules/sql/src/main/java/javax/sql/rowset/serial/SQLOutputImpl.java
04/12/2007 08:32:27 Applying patch from "[#HARMONY-3562] [classlib][sql] stubs forjavax.sql.rowset.serial.SerialArray,
SerialInputImpl, SerialOutputImpl".
added hindessm  /harmony/enhanced/classlib/trunk/modules/sql/src/test/java/org/apache/harmony/sql/tests/javax/sql/rowset/serial/SQLInputImplTest.java
04/12/2007 08:32:27 Applying patch from "[#HARMONY-3562] [classlib][sql] stubs forjavax.sql.rowset.serial.SerialArray,
SerialInputImpl, SerialOutputImpl".
added hindessm  /harmony/enhanced/classlib/trunk/modules/sql/src/test/java/org/apache/harmony/sql/tests/javax/sql/rowset/serial/SQLOutputImplTest.java
04/12/2007 08:32:27 Applying patch from "[#HARMONY-3562] [classlib][sql] stubs forjavax.sql.rowset.serial.SerialArray,
SerialInputImpl, SerialOutputImpl".
added hindessm  /harmony/enhanced/classlib/trunk/modules/sql/src/main/java/javax/sql/rowset/serial/SerialArray.java
04/12/2007 08:32:27 Applying patch from "[#HARMONY-3562] [classlib][sql] stubs forjavax.sql.rowset.serial.SerialArray,
SerialInputImpl, SerialOutputImpl".
added hindessm  /harmony/enhanced/classlib/trunk/modules/sql/src/test/java/org/apache/harmony/sql/tests/javax/sql/rowset/serial/SerialArrayTest.java
04/12/2007 08:32:27 Applying patch from "[#HARMONY-3562] [classlib][sql] stubs forjavax.sql.rowset.serial.SerialArray,
SerialInputImpl, SerialOutputImpl".
added hindessm  /harmony/enhanced/classlib/trunk/modules/sql/src/main/java/javax/sql/rowset/serial/SQLInputImpl.java
04/12/2007 08:32:27 Applying patch from "[#HARMONY-3562] [classlib][sql] stubs forjavax.sql.rowset.serial.SerialArray,
SerialInputImpl, SerialOutputImpl".
modified pyang  /harmony/enhanced/classlib/trunk/modules/luni/src/main/java/java/io/BufferedOutputStream.java
04/12/2007 04:50:40 Apply patch for HARMONY-1082([classlib][io]compatibility:java.io.BufferedOutputStream.write(byte[],
int, int) throws ArrayIndexOutOfBoundsException while RI throws NullPointerException)
modified pyang  /harmony/enhanced/classlib/trunk/modules/luni/src/test/java/tests/api/java/io/BufferedOutputStreamTest.java
04/12/2007 04:50:40 Apply patch for HARMONY-1082([classlib][io]compatibility:java.io.BufferedOutputStream.write(byte[],
int, int) throws ArrayIndexOutOfBoundsException while RI throws NullPointerException)
modified pyang  /harmony/enhanced/classlib/trunk/modules/luni/src/main/java/java/net/MulticastSocket.java
04/12/2007 04:49:20 Apply patch for HARMONY-3572([Classlib] delete some never-used private/package
methods)
modified pyang  /harmony/enhanced/classlib/trunk/modules/luni/src/main/java/java/net/DatagramSocket.java
04/12/2007 04:49:20 Apply patch for HARMONY-3572([Classlib] delete some never-used private/package
methods)
modified pyang  /harmony/enhanced/classlib/trunk/modules/luni/src/main/java/java/net/SocketImpl.java
04/12/2007 04:48:08 Apply patch for HARMONY-3603([classlib][luni]SocketImpl.write() send twice)
modified pyang  /harmony/enhanced/classlib/trunk/modules/luni/src/main/java/java/net/JarURLConnection.java
04/12/2007 04:46:16 Apply patch for HARMONY-3614( [classlib][luni]add tests for java.net.JarURLConnecttion
and HttpURLConnection)
modified pyang  /harmony/enhanced/classlib/trunk/modules/luni/src/test/java/tests/api/java/net/JarURLConnectionTest.java
04/12/2007 04:46:16 Apply patch for HARMONY-3614( [classlib][luni]add tests for java.net.JarURLConnecttion
and HttpURLConnection)
modified pyang  /harmony/enhanced/classlib/trunk/modules/luni/src/test/java/tests/api/java/net/HttpURLConnectionTest.java
04/12/2007 04:46:16 Apply patch for HARMONY-3614( [classlib][luni]add tests for java.net.JarURLConnecttion
and HttpURLConnection)
modified pyang  /harmony/enhanced/classlib/trunk/modules/luni/src/main/java/java/io/ObjectOutputStream.java
04/12/2007 04:40:36 Apply patch for HARMONY-3610([classlib][luni]java.io.ObjectOutputStream.writeObjectOverride()
throws IOException)
modified pyang  /harmony/enhanced/classlib/trunk/modules/luni/src/test/java/tests/api/java/io/ObjectOutputStreamTest.java
04/12/2007 04:40:36 Apply patch for HARMONY-3610([classlib][luni]java.io.ObjectOutputStream.writeObjectOverride()
throws IOException)
modified smishura  /harmony/enhanced/classlib/trunk/modules/luni/make/exclude.linux.x86_64.drl
04/12/2007 01:29:30 Exclude SecurityManagerTest for DRL VM. See HARMONY-3628:([drlvm][testing]
API test org.apache.harmony.luni.tests.java.lang.SecurityManagerTest failed on DRLVM)
modified smishura  /harmony/enhanced/classlib/trunk/modules/luni/make/exclude.windows.x86.drl
04/12/2007 01:29:30 Exclude SecurityManagerTest for DRL VM. See HARMONY-3628:([drlvm][testing]
API test org.apache.harmony.luni.tests.java.lang.SecurityManagerTest failed on DRLVM)
modified smishura  /harmony/enhanced/classlib/trunk/modules/luni/make/exclude.linux.x86.drl
04/12/2007 01:29:30 Exclude SecurityManagerTest for DRL VM. See HARMONY-3628:([drlvm][testing]
API test org.apache.harmony.luni.tests.java.lang.SecurityManagerTest failed on DRLVM)
modified smishura  /harmony/enhanced/classlib/trunk/modules/luni/make/exclude.windows.x86_64.drl
04/12/2007 01:29:30 Exclude SecurityManagerTest for DRL VM. See HARMONY-3628:([drlvm][testing]
API test org.apache.harmony.luni.tests.java.lang.SecurityManagerTest failed on DRLVM)
modified pyang  /harmony/enhanced/classlib/trunk/modules/archive/src/test/java/org/apache/harmony/archive/tests/java/util/jar/JarEntryTest.java
04/12/2007 00:35:34 Apply patch for HARMONY-3621( [classlib][archive] Add test for java.util.jar.Attributes.hashCode(
) and java.util.jar.JarEntry( JarEntry ))
modified pyang  /harmony/enhanced/classlib/trunk/modules/archive/src/test/java/org/apache/harmony/archive/tests/java/util/jar/AttributesTest.java
04/12/2007 00:35:34 Apply patch for HARMONY-3621( [classlib][archive] Add test for java.util.jar.Attributes.hashCode(
) and java.util.jar.JarEntry( JarEntry ))
modified pyang  /harmony/enhanced/classlib/trunk/modules/luni/src/test/java/tests/api/java/net/DatagramSocketImplTest.java
04/12/2007 00:30:55 Apply patch for HARMONY-3607([classlib][luni]add tests for java.net.DatagramSocketImpl.connect)
added pyang  /harmony/enhanced/classlib/trunk/modules/luni/src/test/java/tests/api/java/net/SecureCacheResponseTest.java
04/12/2007 00:29:17 Apply patch for HARMONY-3606( [classlib][luni]Add tests for java.net.SecureCacheResponse)

Mime
  • Unnamed multipart/mixed (inline, None, 0 bytes)
View raw message