harmony-alerts mailing list archives

Site index · List index
Message view « Date » · « Thread »
Top « Date » · « Thread »
From nbe...@kc.rr.com
Subject [build-test alert] BUILD FAILED Windows 2000 msvc debug: classlib over ibmvm
Date Fri, 13 Apr 2007 01:47:49 GMT
BUILD FAILED:
	Ant Error Message:
C:\bt-trunk\cc\projects\classlib\trunk\build.xml:167: The following error occurred while executing
this line: C:\bt-trunk\cc\projects\classlib\trunk\make\build-test.xml:133: There were test
crashes: C:\bt-trunk\cc\projects\classlib\trunk\build\test_report\TEST-java.awt.AccessibleAWTCheckboxMenuItemTest.xml;C:\bt-trunk\cc\projects\classlib\trunk\build\test_report\TEST-javax.swing.AbstractActionRTest.xml;C:\bt-trunk\cc\projects\classlib\trunk\build\test_report\TEST-org.apache.harmony.beans.tests.java.beans.SimpleBeanInfoTest.xml

Date of build:	04/12/2007 20:02:50
Time to build:	43 minutes 15 seconds
Last changed:	04/12/2007 17:04:08
Last log entry:	classlib

***********************************************************
Errors/Warnings:	(343)
            
Test org.apache.harmony.awt.HeadlessTest FAILED
Tests FAILED
Tests FAILED
Tests FAILED

========================================
Testing class libraries...
========================================

Checking for depends/jars/yoko_M2-20070130/yoko.jar
Checking for depends/jars/yoko_M2-20070130/yoko-core.jar
Checking for depends/jars/yoko_M2-20070130/yoko-rmi-impl.jar
Checking for depends/jars/yoko_M2-20070130/yoko-rmi-spec.jar
Checking for depends/jars/bcel-5.2/bcel-5.2.jar
Checking for depends/jars/xalan-j_2.7.0/xalan.jar
Checking for depends/jars/xerces_2.8.0/resolver.jar
Checking for depends/jars/xerces_2.8.0/xercesImpl.jar
Checking for depends/jars/xerces_2.8.0/xml-apis.jar
Checking for depends/jars/junit_3.8.2/junit.jar
Checking for depends/jars/bcprov-jdk15-134/bcprov.jar
Checking for depends/jars/icu4j_3.4.4/icu4j_3_4_4.jar
Checking for depends/jars/mx4j_3.0.2/mx4j.zip
Checking for depends/jars/ecj_3.2/ecj_3.2.jar
Checking for depends/jars/jetty/jetty-6.0.0.jar
Checking for depends/jars/jetty/jetty-util-6.0.0.jar
Checking for depends/jars/jetty/servlet-api-2.5-6.0.0.jar
Checking for depends/libs/windows.x86/msvcr71.dll
Checking for depends/libs/windows.x86/swing_awt_deps_winxp_2006-09-28.tgz
Since fork is false, ignoring memoryMaximumSize setting
Compiling ACCESSIBILITY classes
Compiling ACCESSIBILITY tests
Compiling ANNOTATION classes
Compiling ANNOTATION tests
Compiling APPLET classes
Compiling APPLET tests
Compiling ARCHIVE classes
Compiling ARCHIVE tests
Compiling AUTH classes
Compiling AUTH tests
Compiling AWT classes
Compiling AWT tests
Unhandled exception
Type=Segmentation error vmState=0x00040000
J9Generic_Signal_Number=00000004 ExceptionCode=c0000005 ExceptionAddress=00000000 ContextFlags=0001003f
Handler1=7FE50390 Handler2=7FD074F0 InaccessibleAddress=00000000
EDI=10D4FC70 ESI=00000020 EAX=00000000 EBX=00000000
ECX=0000007F EDX=00000002
EIP=00000000 ESP=10D4FC5C EBP=10D4FC68
Module=C:\bt-trunk\cc\projects\classlib\trunk\deploy\jdk\jre\bin\java.exe
Module_base_address=00000000 Offset_in_DLL=00000000
Target=2_30_20060727_07300_lHdSMR (Windows 2000 5.0 build 2195 Service Pack 4)
CPU=x86 (1 logical CPUs) (0x3ff4c000 RAM)
JavaVMInitArgs.nOptions=12:
    -Dcom.ibm.oti.vm.vmdir=C:\bt-trunk\cc\projects\classlib\trunk\deploy\jdk\jre\bin\default\
    -Dcom.ibm.oti.vm.exe=C:\bt-trunk\cc\projects\classlib\trunk\deploy\jdk\jre\bin\java.exe
    -Dcom.ibm.oti.vm.bootstrap.library.path=C:\bt-trunk\cc\projects\classlib\trunk\deploy\jdk\jre\bin;C:\bt-trunk\cc\projects\classlib\trunk\deploy\jdk\jre\bin\default
    -Xbootclasspath/p:C:\bt-trunk\cc\projects\classlib\trunk\deploy\jdk\jre\bin\default\luni-kernel.jar;C:\bt-trunk\cc\projects\classlib\trunk\deploy\jdk\jre\bin\default\security-kernel.jar
    -DTEST_SRC_DIR=C:\bt-trunk\cc\projects\classlib\trunk\modules\awt\bin\test
    -Xbootclasspath/a:C:\bt-trunk\cc\projects\classlib\trunk\modules\awt\bin\test;C:\bt-trunk\cc\projects\classlib\trunk\modules\awt/../../depends/jars/junit_3.8.2/junit.jar
    -Djava.class.path=C:\bt-trunk\cc\apache-ant-1.6.5\lib\junit.jar;C:\bt-trunk\cc\apache-ant-1.6.5\lib\ant-launcher.jar;C:\bt-trunk\cc\apache-ant-1.6.5\lib\ant.jar;C:\bt-trunk\cc\apache-ant-1.6.5\lib\ant-junit.jar
    -Djava.home=C:\bt-trunk\cc\projects\classlib\trunk\deploy\jdk\jre
    -Djava.library.path=C:\bt-trunk\cc\projects\classlib\trunk\deploy\jdk\jre\bin\;.;C:\bt-trunk\cc\projects\classlib\trunk\deploy\jdk\jre\bin\default;C:\bt-trunk\cc\projects\classlib\trunk\deploy\jdk\jre\bin\;C:\Program
Files\Debugging Tools for Windows;C:\Program Files\Microsoft Visual Studio .NET 2003\Common7\IDE;C:\Program
Files\Microsoft Visual Studio .NET 2003\VC7\BIN;C:\Program Files\Microsoft Visual Studio .NET
2003\Common7\Tools;C:\Program Files\Microsoft Visual Studio .NET 2003\Common7\Tools\bin\prerelease;C:\Program
Files\Microsoft Visual Studio .NET 2003\Common7\Tools\bin;C:\Program Files\Microsoft Visual
Studio .NET 2003\SDK\v1.1\bin;C:\WINNT\Microsoft.NET\Framework\v1.1.4322;C:\WINNT\system32;C:\WINNT;C:\WINNT\System32\Wbem;c:\install\bin;c:\install\svn\bin;c:\install\ant\bin
    _org.apache.harmony.vmi.portlib (extra info: 0012FBB8)
    -Xjcl:jclclear_23
    _j2se_j9=136448
Error: Dump failed - could not link MiniDumpWriteDump in DBGHELP.DLL
Thread: AWT-NativeEventThread (priority 5) (daemon) (LOCATION OF ERROR)
 NATIVE   org/apache/harmony/awt/nativebridge/windows/Win32.IsThemeActive()I
 00000018 org/apache/harmony/awt/wtk/windows/WinEventQueue$ThemeMap.<init>(Lorg/apache/harmony/awt/wtk/windows/WinEventQueue;)V
 0000000a org/apache/harmony/awt/wtk/windows/WinEventQueue.<init>(Lorg/apache/harmony/awt/wtk/windows/WinSystemProperties;)V
 00000018 org/apache/harmony/awt/wtk/windows/WinWTK.<init>()V
 NATIVE   java/lang/Class.newInstanceImpl()Ljava/lang/Object;
 00000006 java/lang/Class.newInstance()Ljava/lang/Object;
 00000006 java/awt/Toolkit.createWTK(Ljava/lang/String;)Lorg/apache/harmony/awt/wtk/WTK;
 00000002 java/awt/Toolkit.access$1(Ljava/awt/Toolkit;Ljava/lang/String;)Lorg/apache/harmony/awt/wtk/WTK;
 0000000c java/awt/Toolkit$1.init()Lorg/apache/harmony/awt/wtk/WTK;
 0000000b org/apache/harmony/awt/wtk/NativeEventThread.run()V
Thread: main (priority 5)
 NATIVE   java/lang/Object.wait(JI)V
 00000003 java/lang/Object.wait()V
 0000000e org/apache/harmony/awt/wtk/NativeEventThread.start(Lorg/apache/harmony/awt/wtk/NativeEventThread$Init;)V
 0000007a java/awt/Toolkit.init()V
 00000092 java/awt/Toolkit.<init>()V
 00000033 java/awt/Toolkit.getDefaultToolkit()Ljava/awt/Toolkit;
 0000000a java/awt/MenuComponent.<init>()V
 00000001 java/awt/MenuItem.<init>(Ljava/lang/String;Ljava/awt/MenuShortcut;)V
 00000004 java/awt/MenuItem.<init>()V
 00000001 java/awt/CheckboxMenuItem.<init>()V
 00000009 java/awt/AccessibleAWTCheckboxMenuItemTest.setUp()V
 00000003 junit/framework/TestCase.runBare()V
 00000004 junit/framework/TestResult$1.protect()V
 00000003 junit/framework/TestResult.runProtected(Ljunit/framework/Test;Ljunit/framework/Protectable;)V
 00000012 junit/framework/TestResult.run(Ljunit/framework/TestCase;)V
 00000002 junit/framework/TestCase.run(Ljunit/framework/TestResult;)V
 00000004 junit/framework/TestSuite.runTest(Ljunit/framework/Test;Ljunit/framework/TestResult;)V
 00000025 junit/framework/TestSuite.run(Ljunit/framework/TestResult;)V
 000001a2 org/apache/tools/ant/taskdefs/optional/junit/JUnitTestRunner.run()V
 00000023 org/apache/tools/ant/taskdefs/optional/junit/JUnitTestRunner.launch(Lorg/apache/tools/ant/taskdefs/optional/junit/JUnitTest;ZZZZLjava/util/Properties;)I
 000001b9 org/apache/tools/ant/taskdefs/optional/junit/JUnitTestRunner.main([Ljava/lang/String;)V
Thread: JIT Compilation Thread (priority 10) (daemon)
Thread: Finalizer thread (priority 5) (daemon)
Thread: AWT-DataTransferThread (priority 5) (daemon)
 NATIVE   org/apache/harmony/awt/nativebridge/windows/Win32.GetMessageW(JJII)I
 00000016 org/apache/harmony/awt/nativebridge/windows/Win32.GetMessageW(Lorg/apache/harmony/awt/nativebridge/windows/Win32$MSG;JII)I
 0000001a org/apache/harmony/awt/datatransfer/windows/WinDTK.runEventLoop()V
 00000025 org/apache/harmony/awt/datatransfer/DataTransferThread.run()V
Compiling BEANS classes
Compiling support classes for BEANS tests
Compiling internal BEANS tests
Compiling BEANS tests
Running internal BEANS tests
Running BEANS tests
Unhandled exception
Type=Segmentation error vmState=0x00040000
J9Generic_Signal_Number=00000004 ExceptionCode=c0000005 ExceptionAddress=00000000 ContextFlags=0001003f
Handler1=7FE50390 Handler2=7FD074F0 InaccessibleAddress=00000000
EDI=0140FC70 ESI=00000020 EAX=00000000 EBX=00000000
ECX=0000007F EDX=00000002
EIP=00000000 ESP=0140FC5C EBP=0140FC68
Module=C:\bt-trunk\cc\projects\classlib\trunk\deploy\jdk\jre\bin\java.exe
Module_base_address=00000000 Offset_in_DLL=00000000
Target=2_30_20060727_07300_lHdSMR (Windows 2000 5.0 build 2195 Service Pack 4)
CPU=x86 (1 logical CPUs) (0x3ff4c000 RAM)
JavaVMInitArgs.nOptions=10:
    -Dcom.ibm.oti.vm.vmdir=C:\bt-trunk\cc\projects\classlib\trunk\deploy\jdk\jre\bin\default\
    -Dcom.ibm.oti.vm.exe=C:\bt-trunk\cc\projects\classlib\trunk\deploy\jdk\jre\bin\java.exe
    -Dcom.ibm.oti.vm.bootstrap.library.path=C:\bt-trunk\cc\projects\classlib\trunk\deploy\jdk\jre\bin;C:\bt-trunk\cc\projects\classlib\trunk\deploy\jdk\jre\bin\default
    -Xbootclasspath/p:C:\bt-trunk\cc\projects\classlib\trunk\deploy\jdk\jre\bin\default\luni-kernel.jar;C:\bt-trunk\cc\projects\classlib\trunk\deploy\jdk\jre\bin\default\security-kernel.jar
    -Djava.class.path=C:\bt-trunk\cc\projects\classlib\trunk\modules\beans\bin\test;C:\bt-trunk\cc\projects\classlib\trunk\modules\beans\bin\test_support;C:\bt-trunk\cc\projects\classlib\trunk\modules\beans\src\test\resources;C:\bt-trunk\cc\projects\classlib\trunk\deploy\build\test\support.jar;C:\bt-trunk\cc\apache-ant-1.6.5\lib\junit.jar;C:\bt-trunk\cc\apache-ant-1.6.5\lib\ant-launcher.jar;C:\bt-trunk\cc\apache-ant-1.6.5\lib\ant.jar;C:\bt-trunk\cc\apache-ant-1.6.5\lib\ant-junit.jar
    -Djava.home=C:\bt-trunk\cc\projects\classlib\trunk\deploy\jdk\jre
    -Djava.library.path=C:\bt-trunk\cc\projects\classlib\trunk\deploy\jdk\jre\bin\;.;C:\bt-trunk\cc\projects\classlib\trunk\deploy\jdk\jre\bin\default;C:\bt-trunk\cc\projects\classlib\trunk\deploy\jdk\jre\bin\;C:\Program
Files\Debugging Tools for Windows;C:\Program Files\Microsoft Visual Studio .NET 2003\Common7\IDE;C:\Program
Files\Microsoft Visual Studio .NET 2003\VC7\BIN;C:\Program Files\Microsoft Visual Studio .NET
2003\Common7\Tools;C:\Program Files\Microsoft Visual Studio .NET 2003\Common7\Tools\bin\prerelease;C:\Program
Files\Microsoft Visual Studio .NET 2003\Common7\Tools\bin;C:\Program Files\Microsoft Visual
Studio .NET 2003\SDK\v1.1\bin;C:\WINNT\Microsoft.NET\Framework\v1.1.4322;C:\WINNT\system32;C:\WINNT;C:\WINNT\System32\Wbem;c:\install\bin;c:\install\svn\bin;c:\install\ant\bin
    _org.apache.harmony.vmi.portlib (extra info: 0012FBB8)
    -Xjcl:jclclear_23
    _j2se_j9=136448
Error: Dump failed - could not link MiniDumpWriteDump in DBGHELP.DLL
Thread: AWT-NativeEventThread (priority 5) (daemon) (LOCATION OF ERROR)
 NATIVE   org/apache/harmony/awt/nativebridge/windows/Win32.IsThemeActive()I
 00000018 org/apache/harmony/awt/wtk/windows/WinEventQueue$ThemeMap.<init>(Lorg/apache/harmony/awt/wtk/windows/WinEventQueue;)V
 0000000a org/apache/harmony/awt/wtk/windows/WinEventQueue.<init>(Lorg/apache/harmony/awt/wtk/windows/WinSystemProperties;)V
 00000018 org/apache/harmony/awt/wtk/windows/WinWTK.<init>()V
 NATIVE   java/lang/Class.newInstanceImpl()Ljava/lang/Object;
 00000006 java/lang/Class.newInstance()Ljava/lang/Object;
 00000006 java/awt/Toolkit.createWTK(Ljava/lang/String;)Lorg/apache/harmony/awt/wtk/WTK;
 00000002 java/awt/Toolkit.access$1(Ljava/awt/Toolkit;Ljava/lang/String;)Lorg/apache/harmony/awt/wtk/WTK;
 0000000c java/awt/Toolkit$1.init()Lorg/apache/harmony/awt/wtk/WTK;
 0000000b org/apache/harmony/awt/wtk/NativeEventThread.run()V
Thread: main (priority 5)
 NATIVE   java/lang/Object.wait(JI)V
 00000003 java/lang/Object.wait()V
 0000000e org/apache/harmony/awt/wtk/NativeEventThread.start(Lorg/apache/harmony/awt/wtk/NativeEventThread$Init;)V
 0000007a java/awt/Toolkit.init()V
 00000092 java/awt/Toolkit.<init>()V
 00000033 java/awt/Toolkit.getDefaultToolkit()Ljava/awt/Toolkit;
 0000000d java/beans/SimpleBeanInfo.loadImage(Ljava/lang/String;)Ljava/awt/Image;
 0000000b org/apache/harmony/beans/tests/java/beans/SimpleBeanInfoTest.testLoadImage()V
 00000004 java/lang/reflect/AccessibleObject.invokeV(Ljava/lang/Object;[Ljava/lang/Object;)V
 0000043a java/lang/reflect/Method.invoke(Ljava/lang/Object;[Ljava/lang/Object;)Ljava/lang/Object;
 (@31E31436)
 00000060 junit/framework/TestCase.runTest()V
 00000005 junit/framework/TestCase.runBare()V
 00000004 junit/framework/TestResult$1.protect()V
 00000003 junit/framework/TestResult.runProtected(Ljunit/framework/Test;Ljunit/framework/Protectable;)V
 00000011 junit/framework/TestResult.run(Ljunit/framework/TestCase;)V
 00000002 junit/framework/TestCase.run(Ljunit/framework/TestResult;)V
 00000004 junit/framework/TestSuite.runTest(Ljunit/framework/Test;Ljunit/framework/TestResult;)V
 0000001f junit/framework/TestSuite.run(Ljunit/framework/TestResult;)V
 00000a38 org/apache/tools/ant/taskdefs/optional/junit/JUnitTestRunner.run()V  (@31E302D4)
 00000023 org/apache/tools/ant/taskdefs/optional/junit/JUnitTestRunner.launch(Lorg/apache/tools/ant/taskdefs/optional/junit/JUnitTest;ZZZZLjava/util/Properties;)I
 000001b9 org/apache/tools/ant/taskdefs/optional/junit/JUnitTestRunner.main([Ljava/lang/String;)V
Thread: JIT Compilation Thread (priority 10) (daemon)
Thread: Finalizer thread (priority 5) (daemon)
Thread: AWT-DataTransferThread (priority 5) (daemon)
 NATIVE   org/apache/harmony/awt/nativebridge/windows/Win32.GetMessageW(JJII)I
 00000016 org/apache/harmony/awt/nativebridge/windows/Win32.GetMessageW(Lorg/apache/harmony/awt/nativebridge/windows/Win32$MSG;JII)I
 0000001a org/apache/harmony/awt/datatransfer/windows/WinDTK.runEventLoop()V
 00000025 org/apache/harmony/awt/datatransfer/DataTransferThread.run()V
Compiling CRYPTO classes
Compiling CRYPTO test support files
Since fork is false, ignoring memoryMaximumSize setting
Compiling CRYPTO api tests
Compiling CRYPTO api injected tests
Compiling CRYPTO impl injected tests
Compiling CRYPTO impl tests
Running CRYPTO api tests
Running CRYPTO api.injected tests
Running CRYPTO impl tests
Running CRYPTO impl injected tests
Compiling ImageIO classes
Compiling ImageIO tests
Compiling INSTRUMENT classes
Compiling INSTRUMENT tests
Compiling JNDI classes
Compiling JNDI tests
Compiling LANG-MANAGEMENT classes
Compiling LANG-MANAGEMENT API tests
Compiling LANG-MANAGEMENT Implementation tests
Compiling LOGGING classes
Compiling LOGGING tests
Compiling LUNI classes
Compiling LUNI JUnit Tests
Running LUNI JUnit Tests
Compiling MATH classes
Compiling MATH tests
Compiling MISC classes
Compiling MISC tests
Compiling NIO classes
Compiling NIO tests
Compiling NIO_CHAR classes
Compiling NIO_CHAR tests
Cannot find unmappable byte array for US-ASCII
Cannot find unmappable byte array for gb18030
Cannot find unmappable byte array for ISO-8859-1
Cannot find malform byte array for ISO-8859-1
Cannot find unmappable byte array for UTF-16BE
Cannot find malform byte array for UTF-16BE
Cannot find unmappable byte array for UTF-16LE
Cannot find malform byte array for UTF-16LE
Cannot find unmappable byte array for UTF-8
Compiling PACK200 classes
Compiling PACK200 tests
Running PACK200 tests
Compiling PREFS classes
Compiling PREFS tests
Compiling PRINT classes
Compiling Print tests
Compiling REGEX classes
Compiling REGEX tests
Compiling RMI classes
Compiling RMI api tests
Running RMI api tests
Unexporting MyRemoteObject1[UnicastServerRef[endpoint:[[192.168.1.150:4571]](local), ObjID[65536,
UID[4b364b36:111e88c8227:-7ff7]]]] ...
Done.
Unexporting MyRemoteObject1[UnicastServerRef[endpoint:[[192.168.1.150:4572]](local), ObjID[65537,
UID[4b364b36:111e88c8227:-7ff6]]]] ...
Done.
Unexporting MyRemoteObject1[UnicastServerRef[endpoint:[[192.168.1.150:4573]](local), ObjID[65538,
UID[4b364b36:111e88c8227:-7ff5]]]] ...
Done.
Unexporting MyRemoteObject1[UnicastServerRef[endpoint:[[192.168.1.150:4574]](local), ObjID[65539,
UID[4b364b36:111e88c8227:-7ff4]]]] ...
Done.
Unexporting MyRemoteObject1[UnicastServerRef[endpoint:[[192.168.1.150:4575]](local), ObjID[65540,
UID[4b364b36:111e88c8227:-7ff3]]]] ...
Done.
Unexporting MyRemoteObject1[UnicastServerRef[endpoint:[[192.168.1.150:4576]](local), ObjID[65541,
UID[4b364b36:111e88c8227:-7ff2]]]] ...
Done.
Unexporting MyRemoteObject1[UnicastServerRef[endpoint:[[192.168.1.150:4577]](local), ObjID[65542,
UID[4b364b36:111e88c8227:-7ff1]]]] ...
Done.
Unexporting MyRemoteObject1[UnicastServerRef[endpoint:[[192.168.1.150:4578]](local), ObjID[65543,
UID[4b364b36:111e88c8227:-7ff0]]]] ...
Done.
LogStream[tst]:
Compiling SECURITY classes
Compiling SECURITY test support files
Compiling SECURITY api tests
Compiling SECURITY api injected tests
Compiling SECURITY impl injected tests
Compiling SECURITY impl tests
Running SECURITY api tests
Running SECURITY api.injected tests
Running SECURITY impl tests
Running SECURITY impl injected tests
Compiling SOUND classes
Compiling SOUND tests
Compiling SQL classes
Compiling SQL tests
Compiling Sun Compat classes
Compiling SUNCOMPAT tests
Compiling SWING classes
Compiling SWING tests
Unhandled exception
Type=Segmentation error vmState=0x00040000
J9Generic_Signal_Number=00000004 ExceptionCode=c0000005 ExceptionAddress=00000000 ContextFlags=0001003f
Handler1=7FE50390 Handler2=7FD074F0 InaccessibleAddress=00000000
EDI=00FBFC70 ESI=00000020 EAX=00000000 EBX=00000000
ECX=0000007F EDX=00000002
EIP=00000000 ESP=00FBFC5C EBP=00FBFC68
Module=C:\bt-trunk\cc\projects\classlib\trunk\deploy\jdk\jre\bin\java.exe
Module_base_address=00000000 Offset_in_DLL=00000000
Target=2_30_20060727_07300_lHdSMR (Windows 2000 5.0 build 2195 Service Pack 4)
CPU=x86 (1 logical CPUs) (0x3ff4c000 RAM)
JavaVMInitArgs.nOptions=11:
    -Dcom.ibm.oti.vm.vmdir=C:\bt-trunk\cc\projects\classlib\trunk\deploy\jdk\jre\bin\default\
    -Dcom.ibm.oti.vm.exe=C:\bt-trunk\cc\projects\classlib\trunk\deploy\jdk\jre\bin\java.exe
    -Dcom.ibm.oti.vm.bootstrap.library.path=C:\bt-trunk\cc\projects\classlib\trunk\deploy\jdk\jre\bin;C:\bt-trunk\cc\projects\classlib\trunk\deploy\jdk\jre\bin\default
    -Xbootclasspath/p:C:\bt-trunk\cc\projects\classlib\trunk\deploy\jdk\jre\bin\default\luni-kernel.jar;C:\bt-trunk\cc\projects\classlib\trunk\deploy\jdk\jre\bin\default\security-kernel.jar
    -Xbootclasspath/a:C:\bt-trunk\cc\projects\classlib\trunk\modules\swing\bin\test;../../depends/jars/junit_3.8.2/junit.jar;C:\bt-trunk\cc\projects\classlib\trunk\deploy/build/test/support.jar
    -Djava.class.path=C:\bt-trunk\cc\apache-ant-1.6.5\lib\junit.jar;C:\bt-trunk\cc\apache-ant-1.6.5\lib\ant-launcher.jar;C:\bt-trunk\cc\apache-ant-1.6.5\lib\ant.jar;C:\bt-trunk\cc\apache-ant-1.6.5\lib\ant-junit.jar
    -Djava.home=C:\bt-trunk\cc\projects\classlib\trunk\deploy\jdk\jre
    -Djava.library.path=C:\bt-trunk\cc\projects\classlib\trunk\deploy\jdk\jre\bin\;.;C:\bt-trunk\cc\projects\classlib\trunk\deploy\jdk\jre\bin\default;C:\bt-trunk\cc\projects\classlib\trunk\deploy\jdk\jre\bin\;C:\Program
Files\Debugging Tools for Windows;C:\Program Files\Microsoft Visual Studio .NET 2003\Common7\IDE;C:\Program
Files\Microsoft Visual Studio .NET 2003\VC7\BIN;C:\Program Files\Microsoft Visual Studio .NET
2003\Common7\Tools;C:\Program Files\Microsoft Visual Studio .NET 2003\Common7\Tools\bin\prerelease;C:\Program
Files\Microsoft Visual Studio .NET 2003\Common7\Tools\bin;C:\Program Files\Microsoft Visual
Studio .NET 2003\SDK\v1.1\bin;C:\WINNT\Microsoft.NET\Framework\v1.1.4322;C:\WINNT\system32;C:\WINNT;C:\WINNT\System32\Wbem;c:\install\bin;c:\install\svn\bin;c:\install\ant\bin
    _org.apache.harmony.vmi.portlib (extra info: 0012FBB8)
    -Xjcl:jclclear_23
    _j2se_j9=136448
Error: Dump failed - could not link MiniDumpWriteDump in DBGHELP.DLL
Thread: AWT-NativeEventThread (priority 5) (daemon) (LOCATION OF ERROR)
 NATIVE   org/apache/harmony/awt/nativebridge/windows/Win32.IsThemeActive()I
 00000018 org/apache/harmony/awt/wtk/windows/WinEventQueue$ThemeMap.<init>(Lorg/apache/harmony/awt/wtk/windows/WinEventQueue;)V
 0000000a org/apache/harmony/awt/wtk/windows/WinEventQueue.<init>(Lorg/apache/harmony/awt/wtk/windows/WinSystemProperties;)V
 00000018 org/apache/harmony/awt/wtk/windows/WinWTK.<init>()V
 NATIVE   java/lang/Class.newInstanceImpl()Ljava/lang/Object;
 00000006 java/lang/Class.newInstance()Ljava/lang/Object;
 00000006 java/awt/Toolkit.createWTK(Ljava/lang/String;)Lorg/apache/harmony/awt/wtk/WTK;
 00000002 java/awt/Toolkit.access$1(Ljava/awt/Toolkit;Ljava/lang/String;)Lorg/apache/harmony/awt/wtk/WTK;
 0000000c java/awt/Toolkit$1.init()Lorg/apache/harmony/awt/wtk/WTK;
 0000000b org/apache/harmony/awt/wtk/NativeEventThread.run()V
Thread: main (priority 5)
 NATIVE   java/lang/Object.wait(JI)V
 00000003 java/lang/Object.wait(J)V
 00000063 java/lang/Thread.join(JI)V
 00000003 java/lang/Thread.join(J)V
 0000001e javax/swing/BasicSwingTestCase.runBare()V
 00000004 junit/framework/TestResult$1.protect()V
 00000003 junit/framework/TestResult.runProtected(Ljunit/framework/Test;Ljunit/framework/Protectable;)V
 00000012 junit/framework/TestResult.run(Ljunit/framework/TestCase;)V
 00000002 junit/framework/TestCase.run(Ljunit/framework/TestResult;)V
 00000004 junit/framework/TestSuite.runTest(Ljunit/framework/Test;Ljunit/framework/TestResult;)V
 00000025 junit/framework/TestSuite.run(Ljunit/framework/TestResult;)V
 000001a2 org/apache/tools/ant/taskdefs/optional/junit/JUnitTestRunner.run()V
 00000023 org/apache/tools/ant/taskdefs/optional/junit/JUnitTestRunner.launch(Lorg/apache/tools/ant/taskdefs/optional/junit/JUnitTest;ZZZZLjava/util/Properties;)I
 000001b9 org/apache/tools/ant/taskdefs/optional/junit/JUnitTestRunner.main([Ljava/lang/String;)V
Thread: JIT Compilation Thread (priority 10) (daemon)
Thread: Thread-0 (priority 5)
 NATIVE   java/lang/Object.wait(JI)V
 00000003 java/lang/Object.wait()V
 0000000e org/apache/harmony/awt/wtk/NativeEventThread.start(Lorg/apache/harmony/awt/wtk/NativeEventThread$Init;)V
 0000007a java/awt/Toolkit.init()V
 00000092 java/awt/Toolkit.<init>()V
 00000033 java/awt/Toolkit.getDefaultToolkit()Ljava/awt/Toolkit;
 0000000e java/awt/EventQueue.invokeAndWait(Ljava/lang/Runnable;)V
 0000000e javax/swing/SwingTestCase.runBareImpl()Ljava/lang/Throwable;
 00000009 javax/swing/BasicSwingTestCase$1.run()V
 0000000d java/lang/Thread.run()V
Thread: Finalizer thread (priority 5) (daemon)
Thread: AWT-DataTransferThread (priority 5) (daemon)
 NATIVE   org/apache/harmony/awt/nativebridge/windows/Win32.GetMessageW(JJII)I
 00000016 org/apache/harmony/awt/nativebridge/windows/Win32.GetMessageW(Lorg/apache/harmony/awt/nativebridge/windows/Win32$MSG;JII)I
 0000001a org/apache/harmony/awt/datatransfer/windows/WinDTK.runEventLoop()V
 00000025 org/apache/harmony/awt/datatransfer/DataTransferThread.run()V
Compiling TEXT classes
Compiling TEXT tests
Compiling TOOLS classes
Compiling Tools tests
Compiling X-NET classes
Compiling X-NET test support files
Since fork is false, ignoring memoryMaximumSize setting
Compiling X-NET api tests
Compiling X-NET impl injected tests
Compiling X-NET impl tests
Running X-NET api tests
Running X-NET impl tests
Running X-NET impl injected tests
The test report is in C:\bt-trunk\cc\projects\classlib\trunk\build\test_report\html\index.html

***********************************************************
Unit Tests: (14371)
        
error: java.awt.AccessibleAWTCheckboxMenuItemTest vmcrash.CrashedTests
error: javax.swing.AbstractActionRTest vmcrash.CrashedTests
error: org.apache.harmony.beans.tests.java.beans.SimpleBeanInfoTest vmcrash.CrashedTests
error: testBufferedImage org.apache.harmony.awt.HeadlessTest
failure: test_getI tests.api.java.util.GregorianCalendarTest
Unit Test Error Details:	(5)
                
Test: java.awt.AccessibleAWTCheckboxMenuItemTestClass: vmcrash.CrashedTests
Test: javax.swing.AbstractActionRTestClass: vmcrash.CrashedTests
Test: org.apache.harmony.beans.tests.java.beans.SimpleBeanInfoTestClass: vmcrash.CrashedTests
Test: testBufferedImageClass: org.apache.harmony.awt.HeadlessTestjava.lang.UnsatisfiedLinkError:
gl (JVMPORT015E Unable to resolve DLL references - a prerequisite DLL may be missing)
	at java.lang.ClassLoader.loadLibraryWithPath(ClassLoader.java:113)
	at java.lang.ClassLoader.loadLibraryWithClassLoader(ClassLoader.java:977)
	at java.lang.System.loadLibrary(System.java:758)
	at org.apache.harmony.awt.gl.Surface.<clinit>(Surface.java:84)
	at java.lang.J9VMInternals.initializeImpl(Native Method)
	at java.lang.J9VMInternals.initialize(J9VMInternals.java:177)
	at java.lang.J9VMInternals.initialize(J9VMInternals.java:144)
	at java.awt.image.BufferedImage.createImageSurface(BufferedImage.java:675)
	at java.awt.image.BufferedImage.<init>(BufferedImage.java:356)
	at org.apache.harmony.awt.HeadlessTest.testBufferedImage(HeadlessTest.java:58)
	at java.lang.reflect.AccessibleObject.invokeV(AccessibleObject.java:25)

Test: test_getIClass: tests.api.java.util.GregorianCalendarTestjunit.framework.AssertionFailedError:
expected:<346> but was:<345>
	at tests.api.java.util.GregorianCalendarTest.test_getI(GregorianCalendarTest.java:664)
	at java.lang.reflect.AccessibleObject.invokeV(AccessibleObject.java:25)


***********************************************************
Modifications since last successful build:	(39)
            
add cc-classlib log20070412170408Lbuild.1 04/12/2007 17:04:08classlib
modified ndbeyer  /harmony/enhanced/classlib/trunk/modules/awt/src/main/native/win32wrapper/windows/org_apache_harmony_awt_nativebridge_windows_Win32.cpp
04/12/2007 17:03:08 Apply patch for HARMONY-3569:[classlib][awt] gl library depends on uxtheme.dll
which is not present in Windows 2000
modified ndbeyer  /harmony/enhanced/classlib/trunk/modules/awt/src/main/native/gl/windows/WinThemeGraphics.cpp
04/12/2007 17:03:08 Apply patch for HARMONY-3569:[classlib][awt] gl library depends on uxtheme.dll
which is not present in Windows 2000
modified varlax  /harmony/enhanced/classlib/trunk/modules/nio/src/main/java/java/nio/LongToByteBufferAdapter.java
04/12/2007 10:27:49 Fixed HARMONY-3591, HARMONY-3638 [classlib][nio] Flawed JNI support for
direct buffer viewsRegression test is added to DRLVM module.
modified varlax  /harmony/enhanced/classlib/trunk/modules/nio/src/main/java/java/nio/ShortToByteBufferAdapter.java
04/12/2007 10:27:49 Fixed HARMONY-3591, HARMONY-3638 [classlib][nio] Flawed JNI support for
direct buffer viewsRegression test is added to DRLVM module.
modified varlax  /harmony/enhanced/classlib/trunk/modules/nio/src/main/java/org/apache/harmony/nio/internal/DirectBuffer.java
04/12/2007 10:27:49 Fixed HARMONY-3591, HARMONY-3638 [classlib][nio] Flawed JNI support for
direct buffer viewsRegression test is added to DRLVM module.
modified varlax  /harmony/enhanced/classlib/trunk/modules/nio/src/main/java/java/nio/MappedByteBufferAdapter.java
04/12/2007 10:27:49 Fixed HARMONY-3591, HARMONY-3638 [classlib][nio] Flawed JNI support for
direct buffer viewsRegression test is added to DRLVM module.
modified varlax  /harmony/enhanced/classlib/trunk/modules/nio/src/main/java/java/nio/FloatToByteBufferAdapter.java
04/12/2007 10:27:49 Fixed HARMONY-3591, HARMONY-3638 [classlib][nio] Flawed JNI support for
direct buffer viewsRegression test is added to DRLVM module.
modified varlax  /harmony/enhanced/classlib/trunk/modules/nio/src/main/java/java/nio/DirectByteBuffer.java
04/12/2007 10:27:49 Fixed HARMONY-3591, HARMONY-3638 [classlib][nio] Flawed JNI support for
direct buffer viewsRegression test is added to DRLVM module.
modified varlax  /harmony/enhanced/classlib/trunk/modules/nio/src/main/java/java/nio/DoubleToByteBufferAdapter.java
04/12/2007 10:27:49 Fixed HARMONY-3591, HARMONY-3638 [classlib][nio] Flawed JNI support for
direct buffer viewsRegression test is added to DRLVM module.
modified varlax  /harmony/enhanced/classlib/trunk/modules/nio/src/main/java/java/nio/IntToByteBufferAdapter.java
04/12/2007 10:27:49 Fixed HARMONY-3591, HARMONY-3638 [classlib][nio] Flawed JNI support for
direct buffer viewsRegression test is added to DRLVM module.
modified varlax  /harmony/enhanced/classlib/trunk/modules/nio/src/main/native/nio/shared/DirectBufferUtil.c
04/12/2007 10:27:49 Fixed HARMONY-3591, HARMONY-3638 [classlib][nio] Flawed JNI support for
direct buffer viewsRegression test is added to DRLVM module.
modified varlax  /harmony/enhanced/drlvm/trunk/src/test/regression/H0000/DirectByteBufferTest.java
04/12/2007 10:27:49 Fixed HARMONY-3591, HARMONY-3638 [classlib][nio] Flawed JNI support for
direct buffer viewsRegression test is added to DRLVM module.
modified varlax  /harmony/enhanced/classlib/trunk/modules/nio/src/main/java/java/nio/CharToByteBufferAdapter.java
04/12/2007 10:27:49 Fixed HARMONY-3591, HARMONY-3638 [classlib][nio] Flawed JNI support for
direct buffer viewsRegression test is added to DRLVM module.
modified varlax  /harmony/enhanced/drlvm/trunk/src/test/regression/H0000/DirectByteBufferTest.c
04/12/2007 10:27:49 Fixed HARMONY-3591, HARMONY-3638 [classlib][nio] Flawed JNI support for
direct buffer viewsRegression test is added to DRLVM module.
added hindessm  /harmony/enhanced/classlib/trunk/modules/sql/src/main/java/javax/sql/rowset/serial/SQLOutputImpl.java
04/12/2007 08:32:27 Applying patch from "[#HARMONY-3562] [classlib][sql] stubs forjavax.sql.rowset.serial.SerialArray,
SerialInputImpl, SerialOutputImpl".
added hindessm  /harmony/enhanced/classlib/trunk/modules/sql/src/test/java/org/apache/harmony/sql/tests/javax/sql/rowset/serial/SQLInputImplTest.java
04/12/2007 08:32:27 Applying patch from "[#HARMONY-3562] [classlib][sql] stubs forjavax.sql.rowset.serial.SerialArray,
SerialInputImpl, SerialOutputImpl".
added hindessm  /harmony/enhanced/classlib/trunk/modules/sql/src/test/java/org/apache/harmony/sql/tests/javax/sql/rowset/serial/SQLOutputImplTest.java
04/12/2007 08:32:27 Applying patch from "[#HARMONY-3562] [classlib][sql] stubs forjavax.sql.rowset.serial.SerialArray,
SerialInputImpl, SerialOutputImpl".
added hindessm  /harmony/enhanced/classlib/trunk/modules/sql/src/main/java/javax/sql/rowset/serial/SerialArray.java
04/12/2007 08:32:27 Applying patch from "[#HARMONY-3562] [classlib][sql] stubs forjavax.sql.rowset.serial.SerialArray,
SerialInputImpl, SerialOutputImpl".
added hindessm  /harmony/enhanced/classlib/trunk/modules/sql/src/test/java/org/apache/harmony/sql/tests/javax/sql/rowset/serial/SerialArrayTest.java
04/12/2007 08:32:27 Applying patch from "[#HARMONY-3562] [classlib][sql] stubs forjavax.sql.rowset.serial.SerialArray,
SerialInputImpl, SerialOutputImpl".
added hindessm  /harmony/enhanced/classlib/trunk/modules/sql/src/main/java/javax/sql/rowset/serial/SQLInputImpl.java
04/12/2007 08:32:27 Applying patch from "[#HARMONY-3562] [classlib][sql] stubs forjavax.sql.rowset.serial.SerialArray,
SerialInputImpl, SerialOutputImpl".
modified pyang  /harmony/enhanced/classlib/trunk/modules/luni/src/main/java/java/io/BufferedOutputStream.java
04/12/2007 04:50:40 Apply patch for HARMONY-1082([classlib][io]compatibility:java.io.BufferedOutputStream.write(byte[],
int, int) throws ArrayIndexOutOfBoundsException while RI throws NullPointerException)
modified pyang  /harmony/enhanced/classlib/trunk/modules/luni/src/test/java/tests/api/java/io/BufferedOutputStreamTest.java
04/12/2007 04:50:40 Apply patch for HARMONY-1082([classlib][io]compatibility:java.io.BufferedOutputStream.write(byte[],
int, int) throws ArrayIndexOutOfBoundsException while RI throws NullPointerException)
modified pyang  /harmony/enhanced/classlib/trunk/modules/luni/src/main/java/java/net/MulticastSocket.java
04/12/2007 04:49:20 Apply patch for HARMONY-3572([Classlib] delete some never-used private/package
methods)
modified pyang  /harmony/enhanced/classlib/trunk/modules/luni/src/main/java/java/net/DatagramSocket.java
04/12/2007 04:49:20 Apply patch for HARMONY-3572([Classlib] delete some never-used private/package
methods)
modified pyang  /harmony/enhanced/classlib/trunk/modules/luni/src/main/java/java/net/SocketImpl.java
04/12/2007 04:48:08 Apply patch for HARMONY-3603([classlib][luni]SocketImpl.write() send twice)
modified pyang  /harmony/enhanced/classlib/trunk/modules/luni/src/main/java/java/net/JarURLConnection.java
04/12/2007 04:46:16 Apply patch for HARMONY-3614( [classlib][luni]add tests for java.net.JarURLConnecttion
and HttpURLConnection)
modified pyang  /harmony/enhanced/classlib/trunk/modules/luni/src/test/java/tests/api/java/net/JarURLConnectionTest.java
04/12/2007 04:46:16 Apply patch for HARMONY-3614( [classlib][luni]add tests for java.net.JarURLConnecttion
and HttpURLConnection)
modified pyang  /harmony/enhanced/classlib/trunk/modules/luni/src/test/java/tests/api/java/net/HttpURLConnectionTest.java
04/12/2007 04:46:16 Apply patch for HARMONY-3614( [classlib][luni]add tests for java.net.JarURLConnecttion
and HttpURLConnection)
modified pyang  /harmony/enhanced/classlib/trunk/modules/luni/src/main/java/java/io/ObjectOutputStream.java
04/12/2007 04:40:36 Apply patch for HARMONY-3610([classlib][luni]java.io.ObjectOutputStream.writeObjectOverride()
throws IOException)
modified pyang  /harmony/enhanced/classlib/trunk/modules/luni/src/test/java/tests/api/java/io/ObjectOutputStreamTest.java
04/12/2007 04:40:36 Apply patch for HARMONY-3610([classlib][luni]java.io.ObjectOutputStream.writeObjectOverride()
throws IOException)
modified smishura  /harmony/enhanced/classlib/trunk/modules/luni/make/exclude.linux.x86_64.drl
04/12/2007 01:29:30 Exclude SecurityManagerTest for DRL VM. See HARMONY-3628:([drlvm][testing]
API test org.apache.harmony.luni.tests.java.lang.SecurityManagerTest failed on DRLVM)
modified smishura  /harmony/enhanced/classlib/trunk/modules/luni/make/exclude.windows.x86.drl
04/12/2007 01:29:30 Exclude SecurityManagerTest for DRL VM. See HARMONY-3628:([drlvm][testing]
API test org.apache.harmony.luni.tests.java.lang.SecurityManagerTest failed on DRLVM)
modified smishura  /harmony/enhanced/classlib/trunk/modules/luni/make/exclude.linux.x86.drl
04/12/2007 01:29:30 Exclude SecurityManagerTest for DRL VM. See HARMONY-3628:([drlvm][testing]
API test org.apache.harmony.luni.tests.java.lang.SecurityManagerTest failed on DRLVM)
modified smishura  /harmony/enhanced/classlib/trunk/modules/luni/make/exclude.windows.x86_64.drl
04/12/2007 01:29:30 Exclude SecurityManagerTest for DRL VM. See HARMONY-3628:([drlvm][testing]
API test org.apache.harmony.luni.tests.java.lang.SecurityManagerTest failed on DRLVM)
modified pyang  /harmony/enhanced/classlib/trunk/modules/archive/src/test/java/org/apache/harmony/archive/tests/java/util/jar/JarEntryTest.java
04/12/2007 00:35:34 Apply patch for HARMONY-3621( [classlib][archive] Add test for java.util.jar.Attributes.hashCode(
) and java.util.jar.JarEntry( JarEntry ))
modified pyang  /harmony/enhanced/classlib/trunk/modules/archive/src/test/java/org/apache/harmony/archive/tests/java/util/jar/AttributesTest.java
04/12/2007 00:35:34 Apply patch for HARMONY-3621( [classlib][archive] Add test for java.util.jar.Attributes.hashCode(
) and java.util.jar.JarEntry( JarEntry ))
modified pyang  /harmony/enhanced/classlib/trunk/modules/luni/src/test/java/tests/api/java/net/DatagramSocketImplTest.java
04/12/2007 00:30:55 Apply patch for HARMONY-3607([classlib][luni]add tests for java.net.DatagramSocketImpl.connect)
added pyang  /harmony/enhanced/classlib/trunk/modules/luni/src/test/java/tests/api/java/net/SecureCacheResponseTest.java
04/12/2007 00:29:17 Apply patch for HARMONY-3606( [classlib][luni]Add tests for java.net.SecureCacheResponse)

Mime
  • Unnamed multipart/mixed (inline, None, 0 bytes)
View raw message