harmony-alerts mailing list archives

Site index · List index
Message view « Date » · « Thread »
Top « Date » · « Thread »
From nom...@hursley.ibm.com
Subject [continuum] BUILD FAILURE: Classlib/linux.ia32 Build/Test
Date Sat, 28 Apr 2007 17:37:37 GMT
Online report : http://people.apache.org/~hindessm/continuum/classlib/linux.ia32/2007/04/28/20070428-173737.failure.log.gz
Build statistics:
  State: Failed
  Previous State: Ok
  Started at: Sat, 28 Apr 2007 17:09:17 +0100
  Finished at: Sat, 28 Apr 2007 18:37:33 +0100
  Total time: 1h 28m 16s
  Build Trigger: Schedule
  Exit code: 1
  Building machine hostname: hy2
  Operating system : Linux(unknown)
  Java version : 1.5.0_06(Sun Microsystems Inc.)

Changes
                            classlib/make/properties.xml
        
****************************************************************************
Output:
****************************************************************************
Buildfile: build.xml

svn-prop:

build:
   [delete] Deleting directory /home/hybld/continuum-working-directory/6/classlib/deploy
     [echo] Classlib revision is 533378
     [echo] Post process: true
     [echo] JAPI: true
     [echo] Building with reference jdk/javac
     [exec] Buildfile: build.xml

     [exec] -init-hdk-for-clean:
     [exec]     [mkdir] Created dir: /home/hybld/continuum-working-directory/6/classlib/deploy/build/ant
     [exec]      [copy] Copying 1 file to /home/hybld/continuum-working-directory/6/classlib/deploy/build/ant

     [exec] clean-java:

     [exec] -modules-clean-bin:

     [exec] clean:
     [exec]    [delete] Deleting 30 files from /home/hybld/continuum-working-directory/6/classlib/build/classes
     [exec]    [delete] Deleting 12 files from /home/hybld/continuum-working-directory/6/classlib/modules/accessibility/bin/test

     [exec] clean:
     [exec]    [delete] Deleting 13 files from /home/hybld/continuum-working-directory/6/classlib/build/classes
     [exec]    [delete] Deleting 5 files from /home/hybld/continuum-working-directory/6/classlib/modules/annotation/bin/test

     [exec] clean:
     [exec]    [delete] Deleting 35 files from /home/hybld/continuum-working-directory/6/classlib/build/classes
     [exec]    [delete] Deleting 1 files from /home/hybld/continuum-working-directory/6/classlib/modules/applet/bin/test

     [exec] clean:
     [exec]    [delete] Deleting 42 files from /home/hybld/continuum-working-directory/6/classlib/build/classes
     [exec]    [delete] Deleting 36 files from /home/hybld/continuum-working-directory/6/classlib/modules/archive/bin/test

     [exec] clean-native-includes:
     [exec]    [delete] /home/hybld/continuum-working-directory/6/classlib/deploy/include
not found.

     [exec] clean:
     [exec]    [delete] Deleting 112 files from /home/hybld/continuum-working-directory/6/classlib/build/classes
     [exec]    [delete] Deleting 226 files from /home/hybld/continuum-working-directory/6/classlib/modules/auth/bin/test

     [exec] clean:
     [exec]    [delete] Deleting 909 files from /home/hybld/continuum-working-directory/6/classlib/build/classes
     [exec]    [delete] Deleting 537 files from /home/hybld/continuum-working-directory/6/classlib/modules/awt/bin/test

     [exec] clean:
     [exec]    [delete] Deleting 107 files from /home/hybld/continuum-working-directory/6/classlib/build/classes
     [exec]    [delete] Deleting 239 files from /home/hybld/continuum-working-directory/6/classlib/modules/beans/bin/test

     [exec] clean:
     [exec]    [delete] Deleting 125 files from /home/hybld/continuum-working-directory/6/classlib/build/classes
     [exec]    [delete] /home/hybld/continuum-working-directory/6/classlib/modules/concurrent/bin/test
not found.

     [exec] clean:
     [exec]    [delete] Deleting 48 files from /home/hybld/continuum-working-directory/6/classlib/build/classes
     [exec]    [delete] Deleting 90 files from /home/hybld/continuum-working-directory/6/classlib/modules/crypto/bin/test

     [exec] clean:
     [exec]    [delete] Deleting 93 files from /home/hybld/continuum-working-directory/6/classlib/build/classes
     [exec]    [delete] Deleting 3 files from /home/hybld/continuum-working-directory/6/classlib/modules/imageio/bin/test

     [exec] clean:
     [exec]    [delete] Deleting 9 files from /home/hybld/continuum-working-directory/6/classlib/build/classes
     [exec]    [delete] Deleting 20 files from /home/hybld/continuum-working-directory/6/classlib/modules/instrument/bin/test

     [exec] clean:
     [exec]    [delete] Deleting 177 files from /home/hybld/continuum-working-directory/6/classlib/build/classes
     [exec]    [delete] Deleting 192 files from /home/hybld/continuum-working-directory/6/classlib/modules/jndi/bin/test

     [exec] clean:
     [exec]    [delete] Deleting 43 files from /home/hybld/continuum-working-directory/6/classlib/build/classes
     [exec]    [delete] Deleting 18 files from /home/hybld/continuum-working-directory/6/classlib/modules/lang-management/bin/api
     [exec]    [delete] Deleting 16 files from /home/hybld/continuum-working-directory/6/classlib/modules/lang-management/bin/impl

     [exec] clean:
     [exec]    [delete] Deleting 34 files from /home/hybld/continuum-working-directory/6/classlib/build/classes
     [exec]    [delete] Deleting 100 files from /home/hybld/continuum-working-directory/6/classlib/modules/logging/bin/test

     [exec] clean:
     [exec]    [delete] Deleting 969 files from /home/hybld/continuum-working-directory/6/classlib/build/classes
     [exec]    [delete] Deleting 939 files from /home/hybld/continuum-working-directory/6/classlib/modules/luni/bin/test

     [exec] clean-native-includes:
     [exec]    [delete] /home/hybld/continuum-working-directory/6/classlib/deploy/include
not found.
     [exec]    [delete] /home/hybld/continuum-working-directory/6/classlib/deploy/jdk/include
not found.

     [exec] clean:
     [exec]    [delete] Deleting 29 files from /home/hybld/continuum-working-directory/6/classlib/build/classes

     [exec] clean:
     [exec]    [delete] Deleting 14 files from /home/hybld/continuum-working-directory/6/classlib/build/classes
     [exec]    [delete] Deleting 25 files from /home/hybld/continuum-working-directory/6/classlib/modules/math/bin/test

     [exec] clean:
     [exec]    [delete] Deleting 14 files from /home/hybld/continuum-working-directory/6/classlib/build/classes
     [exec]    [delete] Deleting 1 files from /home/hybld/continuum-working-directory/6/classlib/modules/misc/bin/test

     [exec] clean:
     [exec]    [delete] Deleting 142 files from /home/hybld/continuum-working-directory/6/classlib/build/classes
     [exec]    [delete] Deleted 5 directories from /home/hybld/continuum-working-directory/6/classlib/build/classes
     [exec]    [delete] Deleting 157 files from /home/hybld/continuum-working-directory/6/classlib/modules/nio/bin/test
     [exec]    [delete] Deleted 19 directories from /home/hybld/continuum-working-directory/6/classlib/modules/nio/bin/test

     [exec] clean:
     [exec]    [delete] Deleting 20 files from /home/hybld/continuum-working-directory/6/classlib/build/classes
     [exec]    [delete] Deleting 79 files from /home/hybld/continuum-working-directory/6/classlib/modules/nio_char/bin/test

     [exec] clean:
     [exec]    [delete] Deleting 44 files from /home/hybld/continuum-working-directory/6/classlib/build/classes
     [exec]    [delete] Deleting 19 files from /home/hybld/continuum-working-directory/6/classlib/modules/pack200/bin/test

     [exec] clean-native-includes:
     [exec]    [delete] /home/hybld/continuum-working-directory/6/classlib/deploy/include
not found.

     [exec] clean:

     [exec] clean:
     [exec]    [delete] Deleting 32 files from /home/hybld/continuum-working-directory/6/classlib/build/classes
     [exec]    [delete] Deleting 34 files from /home/hybld/continuum-working-directory/6/classlib/modules/prefs/bin/test

     [exec] clean:
     [exec]    [delete] Deleting 205 files from /home/hybld/continuum-working-directory/6/classlib/build/classes
     [exec]    [delete] Deleting 60 files from /home/hybld/continuum-working-directory/6/classlib/modules/print/bin/test

     [exec] clean:
     [exec]    [delete] Deleting 177 files from /home/hybld/continuum-working-directory/6/classlib/build/classes
     [exec]    [delete] Deleting 13 files from /home/hybld/continuum-working-directory/6/classlib/modules/regex/bin/test

     [exec] clean:
     [exec]    [delete] Deleting 230 files from /home/hybld/continuum-working-directory/6/classlib/build/classes
     [exec]    [delete] Deleting 53 files from /home/hybld/continuum-working-directory/6/classlib/modules/rmi/bin/test

     [exec] clean:
     [exec]    [delete] Deleting 429 files from /home/hybld/continuum-working-directory/6/classlib/build/classes
     [exec]    [delete] Deleting 622 files from /home/hybld/continuum-working-directory/6/classlib/modules/security/bin/test

     [exec] clean:
     [exec]    [delete] Deleting 2 files from /home/hybld/continuum-working-directory/6/classlib/build/classes

     [exec] clean:
     [exec]    [delete] Deleting 74 files from /home/hybld/continuum-working-directory/6/classlib/build/classes
     [exec]    [delete] Deleting 54 files from /home/hybld/continuum-working-directory/6/classlib/modules/sound/bin/test

     [exec] clean:
     [exec]    [delete] Deleting 82 files from /home/hybld/continuum-working-directory/6/classlib/build/classes
     [exec]    [delete] Deleting 67 files from /home/hybld/continuum-working-directory/6/classlib/modules/sql/bin/test

     [exec] clean:
     [exec]    [delete] Deleting 6 files from /home/hybld/continuum-working-directory/6/classlib/build/classes

     [exec] clean:
     [exec]    [delete] Deleting 1635 files from /home/hybld/continuum-working-directory/6/classlib/build/classes
     [exec]    [delete] Deleting 4 files from /home/hybld/continuum-working-directory/6/classlib/build/classes
     [exec]    [delete] Deleting 1595 files from /home/hybld/continuum-working-directory/6/classlib/modules/swing/bin/test

     [exec] clean:
     [exec]    [delete] Deleting 40 files from /home/hybld/continuum-working-directory/6/classlib/build/classes
     [exec]    [delete] Deleting 32 files from /home/hybld/continuum-working-directory/6/classlib/modules/text/bin/test

     [exec] clean:
     [exec]    [delete] Deleting 36 files from /home/hybld/continuum-working-directory/6/classlib/build/classes
     [exec]    [delete] Deleting 4 files from /home/hybld/continuum-working-directory/6/classlib/modules/tools/bin/test

...

     [exec]     [javac] ----------
     [exec]     [javac] 1. WARNING in /home/hybld/continuum-working-directory/6/classlib/modules/annotation/src/test/java/org/apache/harmony/annotation/tests/java/lang/annotation/IncompleteAnnotationExceptionTest.java
     [exec]     [javac]  (at line 53)
     [exec]     [javac] 	clazz, elementName);
     [exec]     [javac] 	^^^^^
     [exec]     [javac] Type safety: The expression of type Class needs unchecked conversion
to conform to Class<? extends Annotation>
     [exec]     [javac] ----------
     [exec]     [javac] 1 problem (1 warning)

     [exec] prepare-exclude:

...

     [exec]     [junit] 	at java.awt.Toolkit.access$1(Toolkit.java:977)
     [exec]     [junit] 	at java.awt.Toolkit$1.init(Toolkit.java:555)
     [exec]     [junit] 	at org.apache.harmony.awt.wtk.NativeEventThread.run(NativeEventThread.java:47)
     [exec]     [junit] Tests run: 12, Failures: 0, Errors: 12, Time elapsed: 73.302 sec
     [exec]     [junit] TEST java.awt.AccessibleAWTButtonTest FAILED
     [exec]     [junit] Exception in thread "AWT-NativeEventThread" java.lang.InternalError:
Cannot open display ''
     [exec]     [junit] Exception in thread "AWT-EventDispatchThread" 	at org.apache.harmony.awt.wtk.linux.XServerConnection.<init>(XServerConnection.java:40)java.lang.NullPointerException

     [exec]     [junit] 	at org.apache.harmony.awt.wtk.linux.LinuxWindowFactory.<init>(LinuxWindowFactory.java:46)
     [exec]     [junit] 	at java.awt.Toolkit.getNativeEventQueue(Toolkit.java:1177)	at org.apache.harmony.awt.wtk.linux.LinuxWTK.<init>(LinuxWTK.java:92)

...

     [exec]     [junit] 	at java.awt.Toolkit.createWTK(Toolkit.java:980)
     [exec]     [junit] 	at java.awt.Toolkit.access$1(Toolkit.java:977)
     [exec]     [junit] 	at java.awt.Toolkit$1.init(Toolkit.java:555)
     [exec]     [junit] 	at org.apache.harmony.awt.wtk.NativeEventThread.run(NativeEventThread.java:47)
     [exec]     [junit] TEST java.awt.AccessibleAWTCheckboxMenuItemTest FAILED
     [exec]     [junit] Exception in thread "AWT-NativeEventThread" java.lang.InternalError:
Cannot open display ''
     [exec]     [junit] Exception in thread "AWT-EventDispatchThread" java.lang.NullPointerException
at org.apache.harmony.awt.wtk.linux.XServerConnection.<init>(XServerConnection.java:40)

     [exec]     [junit] 	at java.awt.Toolkit.getNativeEventQueue(Toolkit.java:1177)	at org.apache.harmony.awt.wtk.linux.LinuxWindowFactory.<init>(LinuxWindowFactory.java:46)
     [exec]     [junit] 	at java.awt.EventDispatchThread.run(EventDispatchThread.java:45)

...

     [exec]     [junit] 	at java.awt.Toolkit.createWTK(Toolkit.java:980)
     [exec]     [junit] 	at java.awt.Toolkit.access$1(Toolkit.java:977)
     [exec]     [junit] 	at java.awt.Toolkit$1.init(Toolkit.java:555)
     [exec]     [junit] 	at org.apache.harmony.awt.wtk.NativeEventThread.run(NativeEventThread.java:47)
     [exec]     [junit] TEST java.awt.AccessibleAWTCheckboxTest FAILED
     [exec]     [junit] Exception in thread "AWT-NativeEventThread" java.lang.InternalError:
Cannot open display ''
     [exec]     [junit] Exception in thread "AWT-EventDispatchThread" 	at org.apache.harmony.awt.wtk.linux.XServerConnection.<init>(XServerConnection.java:40)java.lang.NullPointerException

     [exec]     [junit] 	at org.apache.harmony.awt.wtk.linux.LinuxWindowFactory.<init>(LinuxWindowFactory.java:46)
     [exec]     [junit] 	at java.awt.Toolkit.getNativeEventQueue(Toolkit.java:1177)	at org.apache.harmony.awt.wtk.linux.LinuxWTK.<init>(LinuxWTK.java:92)

...


     [exec]     [junit] 	at java.awt.Toolkit.access$1(Toolkit.java:977)
     [exec]     [junit] 	at java.awt.Toolkit$1.init(Toolkit.java:555)
     [exec]     [junit] 	at org.apache.harmony.awt.wtk.NativeEventThread.run(NativeEventThread.java:47)
     [exec]     [junit] TEST java.awt.AccessibleAWTChoiceTest FAILED
     [exec]     [junit] Exception in thread "AWT-NativeEventThread" java.lang.InternalError:
Cannot open display ''
     [exec]     [junit] Exception in thread "AWT-EventDispatchThread" java.lang.NullPointerException
     [exec]     [junit] 	at org.apache.harmony.awt.wtk.linux.XServerConnection.<init>(XServerConnection.java:40)
     [exec]     [junit] 	at java.awt.Toolkit.getNativeEventQueue(Toolkit.java:1177)	at org.apache.harmony.awt.wtk.linux.LinuxWindowFactory.<init>(LinuxWindowFactory.java:46)


...

     [exec]     [junit] 	at java.awt.Toolkit.access$1(Toolkit.java:977)	at java.awt.EventDispatchThread.run(EventDispatchThread.java:45)

     [exec]     [junit] 	at java.awt.Toolkit$1.init(Toolkit.java:555)
     [exec]     [junit] 	at org.apache.harmony.awt.wtk.NativeEventThread.run(NativeEventThread.java:47)
     [exec]     [junit] TEST java.awt.AccessibleAWTContainerTest FAILED
     [exec]     [junit] Exception in thread "AWT-NativeEventThread" java.lang.InternalError:
Cannot open display ''
     [exec]     [junit] 	at org.apache.harmony.awt.wtk.linux.XServerConnection.<init>(XServerConnection.java:40)
     [exec]     [junit] 	at org.apache.harmony.awt.wtk.linux.LinuxWindowFactory.<init>(LinuxWindowFactory.java:46)
     [exec]     [junit] 	at org.apache.harmony.awt.wtk.linux.LinuxWTK.<init>(LinuxWTK.java:92)
     [exec]     [junit] 	at java.lang.Class.newInstanceImpl(Native Method)

...

     [exec]     [junit] 	at java.awt.Toolkit.createWTK(Toolkit.java:980)
     [exec]     [junit] 	at java.awt.Toolkit.access$1(Toolkit.java:977)
     [exec]     [junit] 	at java.awt.Toolkit$1.init(Toolkit.java:555)
     [exec]     [junit] 	at org.apache.harmony.awt.wtk.NativeEventThread.run(NativeEventThread.java:47)
     [exec]     [junit] TEST java.awt.AccessibleAWTDialogTest FAILED
     [exec]     [junit] Exception in thread "AWT-NativeEventThread" java.lang.InternalError:
Cannot open display ''
     [exec]     [junit] 	at org.apache.harmony.awt.wtk.linux.XServerConnection.<init>(XServerConnection.java:40)
     [exec]     [junit] 	at org.apache.harmony.awt.wtk.linux.LinuxWindowFactory.<init>(LinuxWindowFactory.java:46)
     [exec]     [junit] 	at org.apache.harmony.awt.wtk.linux.LinuxWTK.<init>(LinuxWTK.java:92)
     [exec]     [junit] 	at java.lang.Class.newInstanceImpl(Native Method)

...


     [exec]     [junit] 	at java.awt.Toolkit.access$1(Toolkit.java:977)
     [exec]     [junit] 	at java.awt.Toolkit$1.init(Toolkit.java:555)
     [exec]     [junit] 	at org.apache.harmony.awt.wtk.NativeEventThread.run(NativeEventThread.java:47)
     [exec]     [junit] TEST java.awt.AccessibleAWTFrameTest FAILED
     [exec]     [junit] Exception in thread "AWT-NativeEventThread" java.lang.InternalError:
Cannot open display ''
     [exec]     [junit] Exception in thread "AWT-EventDispatchThread" java.lang.NullPointerException
     [exec]     [junit] 	at org.apache.harmony.awt.wtk.linux.XServerConnection.<init>(XServerConnection.java:40)
     [exec]     [junit] 	at java.awt.Toolkit.getNativeEventQueue(Toolkit.java:1177)	at org.apache.harmony.awt.wtk.linux.LinuxWindowFactory.<init>(LinuxWindowFactory.java:46)


...

     [exec]     [junit] 	at java.awt.Toolkit.createWTK(Toolkit.java:980)
     [exec]     [junit] 	at java.awt.Toolkit.access$1(Toolkit.java:977)
     [exec]     [junit] 	at java.awt.Toolkit$1.init(Toolkit.java:555)
     [exec]     [junit] 	at org.apache.harmony.awt.wtk.NativeEventThread.run(NativeEventThread.java:47)
     [exec]     [junit] TEST java.awt.AccessibleAWTLabelTest FAILED
     [exec]     [junit] Exception in thread "AWT-NativeEventThread" java.lang.InternalError:
Cannot open display ''
     [exec]     [junit] Exception in thread "AWT-EventDispatchThread" java.lang.NullPointerException
at org.apache.harmony.awt.wtk.linux.XServerConnection.<init>(XServerConnection.java:40)

     [exec]     [junit] 	at org.apache.harmony.awt.wtk.linux.LinuxWindowFactory.<init>(LinuxWindowFactory.java:46)
at java.awt.Toolkit.getNativeEventQueue(Toolkit.java:1177)


...

     [exec]     [junit] Tests run: 16, Failures: 0, Errors: 16, Time elapsed: 96.265 sec

     [exec]     [junit] 	at java.awt.Toolkit$1.init(Toolkit.java:555)
     [exec]     [junit] 	at org.apache.harmony.awt.wtk.NativeEventThread.run(NativeEventThread.java:47)
     [exec]     [junit] TEST java.awt.AccessibleAWTListTest FAILED
     [exec]     [junit] Exception in thread "AWT-NativeEventThread" java.lang.InternalError:
Cannot open display ''
     [exec]     [junit] Exception in thread "AWT-EventDispatchThread" 	at org.apache.harmony.awt.wtk.linux.XServerConnection.<init>(XServerConnection.java:40)java.lang.NullPointerException

     [exec]     [junit] 	at org.apache.harmony.awt.wtk.linux.LinuxWindowFactory.<init>(LinuxWindowFactory.java:46)
     [exec]     [junit] 	at java.awt.Toolkit.getNativeEventQueue(Toolkit.java:1177)	at org.apache.harmony.awt.wtk.linux.LinuxWTK.<init>(LinuxWTK.java:92)

...

     [exec]     [junit] 	at java.awt.EventDispatchThread.run(EventDispatchThread.java:45)
at java.awt.Toolkit$1.init(Toolkit.java:555)

     [exec]     [junit] 	at org.apache.harmony.awt.wtk.NativeEventThread.run(NativeEventThread.java:47)
     [exec]     [junit] Tests run: 2, Failures: 0, Errors: 2, Time elapsed: 12.038 sec
     [exec]     [junit] TEST java.awt.AccessibleAWTMenuBarTest FAILED
     [exec]     [junit] Exception in thread "AWT-NativeEventThread" java.lang.InternalError:
Cannot open display ''
     [exec]     [junit] 	at org.apache.harmony.awt.wtk.linux.XServerConnection.<init>(XServerConnection.java:40)
     [exec]     [junit] 	at org.apache.harmony.awt.wtk.linux.LinuxWindowFactory.<init>(LinuxWindowFactory.java:46)
     [exec]     [junit] 	at org.apache.harmony.awt.wtk.linux.LinuxWTK.<init>(LinuxWTK.java:92)
     [exec]     [junit] 	at java.lang.Class.newInstanceImpl(Native Method)

...


     [exec]     [junit] 	at java.awt.Toolkit$1.init(Toolkit.java:555)	at java.awt.EventDispatchThread.run(EventDispatchThread.java:45)

     [exec]     [junit] 	at org.apache.harmony.awt.wtk.NativeEventThread.run(NativeEventThread.java:47)
     [exec]     [junit] TEST java.awt.AccessibleAWTMenuComponentTest FAILED
     [exec]     [junit] Exception in thread "AWT-NativeEventThread" java.lang.InternalError:
Cannot open display ''
     [exec]     [junit] 	at org.apache.harmony.awt.wtk.linux.XServerConnection.<init>(XServerConnection.java:40)Exception
in thread "AWT-EventDispatchThread" 
     [exec]     [junit] java.lang.NullPointerException	at org.apache.harmony.awt.wtk.linux.LinuxWindowFactory.<init>(LinuxWindowFactory.java:46)

     [exec]     [junit] 	at org.apache.harmony.awt.wtk.linux.LinuxWTK.<init>(LinuxWTK.java:92)

...

     [exec]     [junit] 	at java.awt.Toolkit.createWTK(Toolkit.java:980)
     [exec]     [junit] 	at java.awt.Toolkit.access$1(Toolkit.java:977)
     [exec]     [junit] 	at java.awt.Toolkit$1.init(Toolkit.java:555)
     [exec]     [junit] 	at org.apache.harmony.awt.wtk.NativeEventThread.run(NativeEventThread.java:47)
     [exec]     [junit] TEST java.awt.AccessibleAWTMenuItemTest FAILED
     [exec]     [junit] Exception in thread "AWT-NativeEventThread" java.lang.InternalError:
Cannot open display ''
     [exec]     [junit] Exception in thread "AWT-EventDispatchThread" 	at org.apache.harmony.awt.wtk.linux.XServerConnection.<init>(XServerConnection.java:40)
     [exec]     [junit] java.lang.NullPointerException	at org.apache.harmony.awt.wtk.linux.LinuxWindowFactory.<init>(LinuxWindowFactory.java:46)

     [exec]     [junit] 	at org.apache.harmony.awt.wtk.linux.LinuxWTK.<init>(LinuxWTK.java:92)

...

     [exec]     [junit] 	at java.awt.Toolkit.createWTK(Toolkit.java:980)
     [exec]     [junit] 	at java.awt.Toolkit.access$1(Toolkit.java:977)
     [exec]     [junit] 	at java.awt.Toolkit$1.init(Toolkit.java:555)
     [exec]     [junit] 	at org.apache.harmony.awt.wtk.NativeEventThread.run(NativeEventThread.java:47)
     [exec]     [junit] TEST java.awt.AccessibleAWTMenuTest FAILED
     [exec]     [junit] Exception in thread "AWT-NativeEventThread" java.lang.InternalError:
Cannot open display ''
     [exec]     [junit] 	at org.apache.harmony.awt.wtk.linux.XServerConnection.<init>(XServerConnection.java:40)
     [exec]     [junit] 	at org.apache.harmony.awt.wtk.linux.LinuxWindowFactory.<init>(LinuxWindowFactory.java:46)
     [exec]     [junit] 	at org.apache.harmony.awt.wtk.linux.LinuxWTK.<init>(LinuxWTK.java:92)
     [exec]     [junit] 	at java.lang.Class.newInstanceImpl(Native Method)

...

     [exec]     [junit] 	at java.awt.Toolkit.createWTK(Toolkit.java:980)
     [exec]     [junit] 	at java.awt.Toolkit.access$1(Toolkit.java:977)
     [exec]     [junit] 	at java.awt.Toolkit$1.init(Toolkit.java:555)
     [exec]     [junit] 	at org.apache.harmony.awt.wtk.NativeEventThread.run(NativeEventThread.java:47)
     [exec]     [junit] TEST java.awt.AccessibleAWTPanelTest FAILED
     [exec]     [junit] Exception in thread "AWT-NativeEventThread" java.lang.InternalError:
Cannot open display ''
     [exec]     [junit] 	at org.apache.harmony.awt.wtk.linux.XServerConnection.<init>(XServerConnection.java:40)
     [exec]     [junit] 	at org.apache.harmony.awt.wtk.linux.LinuxWindowFactory.<init>(LinuxWindowFactory.java:46)
     [exec]     [junit] 	at org.apache.harmony.awt.wtk.linux.LinuxWTK.<init>(LinuxWTK.java:92)
     [exec]     [junit] 	at java.lang.Class.newInstanceImpl(Native Method)

...

     [exec]     [junit] 	at java.awt.Toolkit.access$1(Toolkit.java:977)
     [exec]     [junit] 	at java.awt.Toolkit$1.init(Toolkit.java:555)
     [exec]     [junit] 	at org.apache.harmony.awt.wtk.NativeEventThread.run(NativeEventThread.java:47)
     [exec]     [junit] 	at java.awt.EventDispatchThread.run(EventDispatchThread.java:45)
     [exec]     [junit] TEST java.awt.AccessibleAWTPopupMenuTest FAILED
     [exec]     [junit] Exception in thread "AWT-NativeEventThread" java.lang.InternalError:
Cannot open display ''
     [exec]     [junit] Exception in thread "AWT-EventDispatchThread" 	at org.apache.harmony.awt.wtk.linux.XServerConnection.<init>(XServerConnection.java:40)
     [exec]     [junit] java.lang.NullPointerException
     [exec]     [junit] 	at org.apache.harmony.awt.wtk.linux.LinuxWindowFactory.<init>(LinuxWindowFactory.java:46)
     [exec]     [junit] 	at java.awt.Toolkit.getNativeEventQueue(Toolkit.java:1177)

...

     [exec]     [junit] 	at java.awt.Toolkit.createWTK(Toolkit.java:980)
     [exec]     [junit] 	at java.awt.Toolkit.access$1(Toolkit.java:977)
     [exec]     [junit] 	at java.awt.Toolkit$1.init(Toolkit.java:555)
     [exec]     [junit] 	at org.apache.harmony.awt.wtk.NativeEventThread.run(NativeEventThread.java:47)
     [exec]     [junit] TEST java.awt.AccessibleAWTScrollBarTest FAILED
     [exec]     [junit] Exception in thread "AWT-NativeEventThread" java.lang.InternalError:
Cannot open display ''
     [exec]     [junit] Exception in thread "AWT-EventDispatchThread" 	at org.apache.harmony.awt.wtk.linux.XServerConnection.<init>(XServerConnection.java:40)java.lang.NullPointerException

     [exec]     [junit] 	at org.apache.harmony.awt.wtk.linux.LinuxWindowFactory.<init>(LinuxWindowFactory.java:46)
     [exec]     [junit] 	at java.awt.Toolkit.getNativeEventQueue(Toolkit.java:1177)

...

     [exec]     [junit] 	at org.apache.harmony.awt.wtk.NativeEventThread.run(NativeEventThread.java:47)

     [exec]     [junit] 	at java.awt.Toolkit.getNativeEventQueue(Toolkit.java:1177)
     [exec]     [junit] 	at java.awt.EventDispatchThread.run(EventDispatchThread.java:45)
     [exec]     [junit] TEST java.awt.AccessibleAWTScrollPaneTest FAILED
     [exec]     [junit] Exception in thread "AWT-NativeEventThread" java.lang.InternalError:
Cannot open display ''
     [exec]     [junit] Exception in thread "AWT-EventDispatchThread" 	at org.apache.harmony.awt.wtk.linux.XServerConnection.<init>(XServerConnection.java:40)
     [exec]     [junit] java.lang.NullPointerException
     [exec]     [junit] 	at org.apache.harmony.awt.wtk.linux.LinuxWindowFactory.<init>(LinuxWindowFactory.java:46)
     [exec]     [junit] 	at java.awt.Toolkit.getNativeEventQueue(Toolkit.java:1177)

...

     [exec]     [junit] 	at java.awt.Toolkit.createWTK(Toolkit.java:980)
     [exec]     [junit] 	at java.awt.Toolkit.access$1(Toolkit.java:977)
     [exec]     [junit] 	at java.awt.Toolkit$1.init(Toolkit.java:555)
     [exec]     [junit] 	at org.apache.harmony.awt.wtk.NativeEventThread.run(NativeEventThread.java:47)
     [exec]     [junit] TEST java.awt.AccessibleAWTTextAreaTest FAILED
     [exec]     [junit] Exception in thread "AWT-NativeEventThread" java.lang.InternalError:
Cannot open display ''
     [exec]     [junit] Exception in thread "AWT-EventDispatchThread" 	at org.apache.harmony.awt.wtk.linux.XServerConnection.<init>(XServerConnection.java:40)
     [exec]     [junit] java.lang.NullPointerException
     [exec]     [junit] 	at org.apache.harmony.awt.wtk.linux.LinuxWindowFactory.<init>(LinuxWindowFactory.java:46)
     [exec]     [junit] 	at java.awt.Toolkit.getNativeEventQueue(Toolkit.java:1177)

...

     [exec]     [junit] 	at java.awt.Toolkit.getNativeEventQueue(Toolkit.java:1177)	at org.apache.harmony.awt.wtk.NativeEventThread.run(NativeEventThread.java:47)

     [exec]     [junit] 	at java.awt.EventDispatchThread.run(EventDispatchThread.java:45)
     [exec]     [junit] Tests run: 1, Failures: 0, Errors: 1, Time elapsed: 0 sec
     [exec]     [junit] Tests FAILED (timeout)
     [exec]     [junit] Running org.apache.harmony.awt.HeadlessTest
     [exec]     [junit] Tests run: 5, Failures: 0, Errors: 0, Time elapsed: 1.635 sec

     [exec] touch-failures-file:


...

     [exec]     [junit] 	at java.awt.Toolkit.access$1(Toolkit.java:977)
     [exec]     [junit] 	at java.awt.Toolkit$1.init(Toolkit.java:555)
     [exec]     [junit] 	at org.apache.harmony.awt.wtk.NativeEventThread.run(NativeEventThread.java:47)
     [exec]     [junit] Tests run: 9, Failures: 0, Errors: 1, Time elapsed: 6.185 sec
     [exec]     [junit] TEST org.apache.harmony.beans.tests.java.beans.SimpleBeanInfoTest
FAILED
     [exec]     [junit] Tests run: 43, Failures: 0, Errors: 0, Time elapsed: 0.019 sec
     [exec]     [junit] Tests run: 6, Failures: 0, Errors: 0, Time elapsed: 0.008 sec
     [exec]     [junit] Tests FAILED

     [exec] touch-failures-file:

     [exec] touch-errors-file:


...

     [exec]     [junit] org.apache.harmony.rmi.test.MyException: MyRemoteObject.test_Exception
     [exec]     [junit] Done.

     [exec]     [junit] Testing test_Error...
     [exec]     [junit] java.rmi.ServerError: Error occurred while remote method invocation;
nested exception is:
     [exec]     [junit] 	java.lang.Error: MyRemoteObject.test_Error
     [exec]     [junit] Done.

     [exec]     [junit] Testing test_RuntimeException...
     [exec]     [junit] java.lang.RuntimeException: MyRemoteObject.text_RuntimeException
     [exec]     [junit] Done.

...

     [exec]     [junit] org.apache.harmony.rmi.test.MyException: MyRemoteObject.test_Exception
     [exec]     [junit] Done.

     [exec]     [junit] Testing test_Error...
     [exec]     [junit] java.rmi.ServerError: Error occurred while remote method invocation;
nested exception is:
     [exec]     [junit] 	java.lang.Error: MyRemoteObject.test_Error
     [exec]     [junit] Done.

     [exec]     [junit] Testing test_RuntimeException...
     [exec]     [junit] java.lang.RuntimeException: MyRemoteObject.text_RuntimeException
     [exec]     [junit] Done.

...

     [exec]     [junit] 	at java.awt.Toolkit.getNativeEventQueue(Toolkit.java:1177)
     [exec]     [junit] 	at java.awt.EventDispatchThread.run(EventDispatchThread.java:45)
     [exec]     [junit] 	at org.apache.harmony.awt.wtk.NativeEventThread.run(NativeEventThread.java:47)
     [exec]     [junit] Tests run: 93, Failures: 93, Errors: 0, Time elapsed: 0.242 sec
     [exec]     [junit] TEST javax.swing.AbstractButtonTest FAILED
     [exec]     [junit] Exception in thread "AWT-NativeEventThread" java.lang.InternalError:
Cannot open display ''
     [exec]     [junit] 	at org.apache.harmony.awt.wtk.linux.XServerConnection.<init>(XServerConnection.java:40)
     [exec]     [junit] 	at org.apache.harmony.awt.wtk.linux.LinuxWindowFactory.<init>(LinuxWindowFactory.java:46)
     [exec]     [junit] 	at org.apache.harmony.awt.wtk.linux.LinuxWTK.<init>(LinuxWTK.java:92)
     [exec]     [junit] 	at java.lang.Class.newInstanceImpl(Native Method)

...

     [exec]     [junit] 	at org.apache.harmony.awt.wtk.NativeEventThread.run(NativeEventThread.java:47)
     [exec]     [junit] Exception in thread "AWT-EventDispatchThread" java.lang.NullPointerException
     [exec]     [junit] 	at java.awt.Toolkit.getNativeEventQueue(Toolkit.java:1177)
     [exec]     [junit] 	at java.awt.EventDispatchThread.run(EventDispatchThread.java:45)
     [exec]     [junit] TEST javax.swing.AbstractButton_MultithreadedTest FAILED
     [exec]     [junit] Exception in thread "AWT-NativeEventThread" java.lang.InternalError:
Cannot open display ''
     [exec]     [junit] Exception in thread "AWT-EventDispatchThread" java.lang.NullPointerException
     [exec]     [junit] 	at java.awt.Toolkit.getNativeEventQueue(Toolkit.java:1177)
     [exec]     [junit] 	at java.awt.EventDispatchThread.run(EventDispatchThread.java:45)
     [exec]     [junit] 	at org.apache.harmony.awt.wtk.linux.XServerConnection.<init>(XServerConnection.java:40)

...

     [exec]     [junit] 	at java.awt.Toolkit.access$1(Toolkit.java:977)
     [exec]     [junit] 	at java.awt.Toolkit$1.init(Toolkit.java:555)
     [exec]     [junit] 	at org.apache.harmony.awt.wtk.NativeEventThread.run(NativeEventThread.java:47)
     [exec]     [junit] Tests run: 28, Failures: 0, Errors: 28, Time elapsed: 6.12 sec
     [exec]     [junit] TEST javax.swing.AccessibleJButtonTest FAILED
     [exec]     [junit] Exception in thread "AWT-NativeEventThread" java.lang.InternalError:
Cannot open display ''
     [exec]     [junit] 	at org.apache.harmony.awt.wtk.linux.XServerConnection.<init>(XServerConnection.java:40)
     [exec]     [junit] Exception in thread "AWT-EventDispatchThread" 	at org.apache.harmony.awt.wtk.linux.LinuxWindowFactory.<init>(LinuxWindowFactory.java:46)java.lang.NullPointerException

     [exec]     [junit] 	at org.apache.harmony.awt.wtk.linux.LinuxWTK.<init>(LinuxWTK.java:92)

...

     [exec]     [junit] 	at java.awt.Toolkit.access$1(Toolkit.java:977)
     [exec]     [junit] 	at java.awt.Toolkit$1.init(Toolkit.java:555)
     [exec]     [junit] 	at org.apache.harmony.awt.wtk.NativeEventThread.run(NativeEventThread.java:47)
     [exec]     [junit] Tests run: 8, Failures: 0, Errors: 8, Time elapsed: 0.013 sec
     [exec]     [junit] TEST javax.swing.ButtonGroupTest FAILED
     [exec]     [junit] Exception in thread "AWT-NativeEventThread" java.lang.InternalError:
Cannot open display ''
     [exec]     [junit] Exception in thread "AWT-EventDispatchThread" 	at org.apache.harmony.awt.wtk.linux.XServerConnection.<init>(XServerConnection.java:40)java.lang.NullPointerException

     [exec]     [junit] 	at org.apache.harmony.awt.wtk.linux.LinuxWindowFactory.<init>(LinuxWindowFactory.java:46)
     [exec]     [junit] 	at org.apache.harmony.awt.wtk.linux.LinuxWTK.<init>(LinuxWTK.java:92)
at java.awt.Toolkit.getNativeEventQueue(Toolkit.java:1177)

...

     [exec]     [junit] 	at java.awt.Toolkit.access$1(Toolkit.java:977)
     [exec]     [junit] 	at java.awt.Toolkit$1.init(Toolkit.java:555)
     [exec]     [junit] 	at org.apache.harmony.awt.wtk.NativeEventThread.run(NativeEventThread.java:47)
     [exec]     [junit] Tests run: 3, Failures: 0, Errors: 3, Time elapsed: 0.018 sec
     [exec]     [junit] TEST javax.swing.DebugGraphicsTest FAILED
     [exec]     [junit] Exception in thread "AWT-NativeEventThread" java.lang.InternalError:
Cannot open display ''
     [exec]     [junit] Exception in thread "AWT-EventDispatchThread" 	at org.apache.harmony.awt.wtk.linux.XServerConnection.<init>(XServerConnection.java:40)
     [exec]     [junit] java.lang.NullPointerException	at org.apache.harmony.awt.wtk.linux.LinuxWindowFactory.<init>(LinuxWindowFactory.java:46)

     [exec]     [junit] 	at org.apache.harmony.awt.wtk.linux.LinuxWTK.<init>(LinuxWTK.java:92)

...


     [exec]     [junit] 	at java.awt.Toolkit$1.init(Toolkit.java:555)
     [exec]     [junit] 	at org.apache.harmony.awt.wtk.NativeEventThread.run(NativeEventThread.java:47)
     [exec]     [junit] Tests run: 1, Failures: 0, Errors: 1, Time elapsed: 0 sec
     [exec]     [junit] Tests FAILED (timeout)

     [exec] touch-failures-file:

     [exec] touch-errors-file:


...

     [exec] gen-report:

     [exec] check-test-result:

     [exec] BUILD FAILED
     [exec] /home/hybld/continuum-working-directory/6/classlib/build.xml:169: The following
error occurred while executing this line:
     [exec] /home/hybld/continuum-working-directory/6/classlib/make/build-test.xml:142: There
were test crashes: /home/hybld/continuum-working-directory/6/classlib/build/test_report/TEST-java.awt.AccessibleAWTTextComponentTest.xml:/home/hybld/continuum-working-directory/6/classlib/build/test_report/TEST-javax.swing.DefaultButtonModelTest.xml

     [exec] Total time: 69 minutes 48 seconds
     [exec] Result: 1
     [echo] Tests.failed is set to true

japi:

     [exec] Processing class java.lang,Object:+
     [exec] Processing package java.lang,:=============================================================================+-+++++++++++-+++++++++++++-+++++++++++++++++-+++++-+++++++++++++++++++++++-++++--^+^+++++++++--++++++++++

...

     [exec] Processing package java.lang.management,:=============================================================================++++-+++++++++++
     [exec] Processing package java.lang.ref,:=============================================================================+++++
     [exec] Processing package java.lang.reflect,:=============================================================================+++++++++++++++++++++
     [exec] Processing class ,java:
     [exec] Failed to Japize java: java.lang.RuntimeException: NoClassDefFoundError: java
     [exec] java.lang.RuntimeException: NoClassDefFoundError: java
     [exec] 	at net.wuffies.japi.ClassFile.forName(ClassFile.java:163)
     [exec] 	at net.wuffies.japi.Japize.getClassWrapper(Japize.java:1425)
     [exec] 	at net.wuffies.japi.Japize.japizeClass(Japize.java:748)
     [exec] 	at net.wuffies.japi.Japize.processClass(Japize.java:516)

...

     [exec] 	at net.wuffies.japi.Japize.doJapize(Japize.java:443)
     [exec] 	at net.wuffies.japi.Japize.main(Japize.java:316)

     [exec] Processing class ,javax:
     [exec] Failed to Japize javax: java.lang.RuntimeException: NoClassDefFoundError: javax
     [exec] java.lang.RuntimeException: NoClassDefFoundError: javax
     [exec] 	at net.wuffies.japi.ClassFile.forName(ClassFile.java:163)
     [exec] 	at net.wuffies.japi.Japize.getClassWrapper(Japize.java:1425)
     [exec] 	at net.wuffies.japi.Japize.japizeClass(Japize.java:748)
     [exec] 	at net.wuffies.japi.Japize.processClass(Japize.java:516)

...

     [exec] 	at net.wuffies.japi.Japize.doJapize(Japize.java:443)
     [exec] 	at net.wuffies.japi.Japize.main(Japize.java:316)

     [exec] Processing class ,org:
     [exec] Failed to Japize org: java.lang.RuntimeException: NoClassDefFoundError: org
     [exec] java.lang.RuntimeException: NoClassDefFoundError: org
     [exec] 	at net.wuffies.japi.ClassFile.forName(ClassFile.java:163)
     [exec] 	at net.wuffies.japi.Japize.getClassWrapper(Japize.java:1425)
     [exec] 	at net.wuffies.japi.Japize.japizeClass(Japize.java:748)
     [exec] 	at net.wuffies.japi.Japize.processClass(Japize.java:516)

...

update-index:

test-result:

BUILD FAILED
/home/hybld/continuum-working-directory/6/build.xml:204: There were test errors.

Total time: 88 minutes 15 seconds

****************************************************************************

...

Mime
View raw message