harmony-alerts mailing list archives

Site index · List index
Message view « Date » · « Thread »
Top « Date » · « Thread »
From nbe...@kc.rr.com
Subject [build-test alert] BUILD FAILED Linux i386 gcc debug: classlib tests run
Date Fri, 27 Apr 2007 04:40:36 GMT
BUILD FAILED:
	Ant Error Message:
/home/nathan/harmony/buildtest/cc/projects/classlib/trunk/build.xml:169: The following error
occurred while executing this line: /home/nathan/harmony/buildtest/cc/projects/classlib/trunk/make/build-test.xml:148:
There were test failures.

Date of build:	04/26/2007 22:51:05
Time to build:	49 minutes 6 seconds
Last changed:	04/26/2007 20:39:01
Last log entry:	HARMONY-3746 : turn off GCv5 until the blocker is resolved.

***********************************************************
Execution log (errors/warnings messages):	
Tests FAILED
Tests FAILED
Tests FAILED
Tests FAILED
Test org.apache.harmony.awt.HeadlessTest FAILED
Tests FAILED
Tests FAILED
Tests FAILED
Tests FAILED
Tests FAILED
Test org.apache.harmony.crypto.internal.NullCipherSpiTest FAILED
Test javax.imageio.ImageIOTest FAILED
Tests FAILED
Tests FAILED
Test org.apache.harmony.jndi.tests.javax.naming.spi.NamingManagerTest FAILED
Test org.apache.harmony.jndi.tests.javax.naming.spi.NamingManagerBuilderTest FAILED
Test org.apache.harmony.jndi.tests.javax.naming.spi.DirectoryManagerTest FAILED
Tests FAILED
Test org.apache.harmony.lang.management.OperatingSystemMXBeanImplTest FAILED
Tests FAILED
Tests FAILED
Tests FAILED
Test org.apache.harmony.misc.tests.accessors.StringAccessorTest FAILED
Tests FAILED
Tests FAILED
Tests FAILED
Tests FAILED
Tests FAILED
Tests FAILED
Tests FAILED
Tests FAILED
Tests FAILED
Tests FAILED
Tests FAILED
Tests FAILED
Tests FAILED
Tests FAILED
Tests FAILED
Tests FAILED
Tests FAILED
Tests FAILED
Tests FAILED

========================================
Testing class libraries...
========================================
Checking for depends/jars/yoko_M2-20070130/yoko.jar
Checking for depends/jars/yoko_M2-20070130/yoko-core.jar
Checking for depends/jars/yoko_M2-20070130/yoko-rmi-impl.jar
Checking for depends/jars/yoko_M2-20070130/yoko-rmi-spec.jar
Checking for depends/jars/bcel-5.2/bcel-5.2.jar
Checking for depends/jars/xalan-j_2.7.0/xalan.jar
Checking for depends/jars/xerces_2.9.0/xerces.zip
Checking for depends/jars/junit_3.8.2/junit.jar
Checking for depends/jars/bcprov-jdk15-134/bcprov.jar
Checking for depends/jars/icu4j_3.4.4/icu4j_3_4_4.jar
Checking for depends/jars/mx4j_3.0.2/mx4j.zip
Checking for depends/jars/ecj_3.2/ecj_3.2.jar
Checking for depends/jars/jetty/jetty-6.0.0.jar
Checking for depends/jars/jetty/jetty-util-6.0.0.jar
Checking for depends/jars/jetty/servlet-api-2.5-6.0.0.jar
Checking for depends/libs/build/lcms/icc34.h
Checking for depends/libs/build/lcms/lcms.h
Checking for depends/libs/build/png/pngconf.h
Checking for depends/libs/build/png/png.h
Checking for depends/libs/build/jpeg/jconfig.lnx
Checking for depends/libs/build/jpeg/jpeglib.h
Checking for depends/libs/build/jpeg/jmorecfg.h
Checking for depends/libs/build/jpeg/jerror.h
Checking for depends/libs/build/lcms/liblcms.linux.x86
Checking for depends/libs/build/png/libpng.linux.x86
Checking for depends/libs/build/jpeg/libjpeg.linux.x86
hy.test.vm.name = drl
Compiling ACCESSIBILITY classes
Compiling ACCESSIBILITY tests
Since fork is false, ignoring memoryMaximumSize setting
Compiling ANNOTATION classes
Compiling ANNOTATION tests
Since fork is false, ignoring memoryMaximumSize setting
----------
1. WARNING in /home/nathan/harmony/buildtest/cc/projects/classlib/trunk/modules/annotation/src/test/java/org/apache/harmony/annotation/tests/java/lang/annotation/IncompleteAnnotationExceptionTest.java
 (at line 53)
	clazz, elementName);
	^^^^^
Type safety: The expression of type Class needs unchecked conversion to conform to Class<?
extends Annotation>
----------
1 problem (1 warning)
Compiling APPLET classes
Compiling APPLET tests
Since fork is false, ignoring memoryMaximumSize setting
Compiling ARCHIVE classes
Compiling ARCHIVE tests
Since fork is false, ignoring memoryMaximumSize setting
Compiling AUTH classes
Compiling AUTH tests
Since fork is false, ignoring memoryMaximumSize setting
Compiling AWT classes
Compiling AWT tests
Since fork is false, ignoring memoryMaximumSize setting
Compiling BEANS classes
Compiling support classes for BEANS tests
Compiling internal BEANS tests
Compiling BEANS tests
Since fork is false, ignoring memoryMaximumSize setting
Running internal BEANS tests
Running BEANS tests
Compiling CRYPTO classes
Compiling CRYPTO test support files
Compiling CRYPTO api tests
Since fork is false, ignoring memoryMaximumSize setting
Compiling CRYPTO api injected tests
Since fork is false, ignoring memoryMaximumSize setting
Compiling CRYPTO impl injected tests
Since fork is false, ignoring memoryMaximumSize setting
Compiling CRYPTO impl tests
Since fork is false, ignoring memoryMaximumSize setting
Running CRYPTO api tests
Running CRYPTO api.injected tests
Running CRYPTO impl tests
Running CRYPTO impl injected tests
Compiling ImageIO classes
Compiling ImageIO tests
Since fork is false, ignoring memoryMaximumSize setting
Compiling INSTRUMENT classes
Compiling INSTRUMENT tests
Since fork is false, ignoring memoryMaximumSize setting
Compiling JNDI classes
Compiling JNDI tests
Since fork is false, ignoring memoryMaximumSize setting
Compiling LANG-MANAGEMENT classes
Compiling LANG-MANAGEMENT API tests
Since fork is false, ignoring memoryMaximumSize setting
Compiling LANG-MANAGEMENT Implementation tests
Since fork is false, ignoring memoryMaximumSize setting
Compiling LOGGING classes
Compiling LOGGING tests
Since fork is false, ignoring memoryMaximumSize setting
Compiling LUNI classes
Compiling LUNI JUnit Tests
Since fork is false, ignoring memoryMaximumSize setting
Running LUNI JUnit Tests
Compiling MATH classes
Compiling MATH tests
Since fork is false, ignoring memoryMaximumSize setting
Compiling MISC classes
Compiling MISC tests
Since fork is false, ignoring memoryMaximumSize setting
Compiling NIO classes
Compiling NIO tests
Since fork is false, ignoring memoryMaximumSize setting
Compiling NIO_CHAR classes
Compiling NIO_CHAR tests
Since fork is false, ignoring memoryMaximumSize setting
Compiling PACK200 classes
Compiling PACK200 tests
Since fork is false, ignoring memoryMaximumSize setting
Running PACK200 tests
init: passed
hyerror: passed
hytime: passed
hyfile: passed
Compiling PREFS classes
Compiling PREFS tests
Since fork is false, ignoring memoryMaximumSize setting
Compiling PRINT classes
Compiling Print tests
Since fork is false, ignoring memoryMaximumSize setting
Compiling REGEX classes
Compiling REGEX tests
Since fork is false, ignoring memoryMaximumSize setting
Compiling RMI classes
Compiling RMI api tests
Since fork is false, ignoring memoryMaximumSize setting
Running RMI api tests
Compiling SECURITY classes
Compiling SECURITY test support files
Since fork is false, ignoring memoryMaximumSize setting
Compiling SECURITY api tests
Since fork is false, ignoring memoryMaximumSize setting
Compiling SECURITY api injected tests
Since fork is false, ignoring memoryMaximumSize setting
Compiling SECURITY impl injected tests
Since fork is false, ignoring memoryMaximumSize setting
Compiling SECURITY impl tests
Since fork is false, ignoring memoryMaximumSize setting
Running SECURITY api tests
Running SECURITY api.injected tests
Running SECURITY impl tests
Running SECURITY impl injected tests
Compiling SOUND classes
Compiling SOUND tests
Since fork is false, ignoring memoryMaximumSize setting
Compiling SQL classes
Compiling SQL tests
Since fork is false, ignoring memoryMaximumSize setting
Compiling Sun Compat classes
Compiling SUNCOMPAT tests
Compiling SWING classes
Compiling SWING tests
Since fork is false, ignoring memoryMaximumSize setting
Compiling TEXT classes
Compiling TEXT tests
Since fork is false, ignoring memoryMaximumSize setting
Compiling TOOLS classes
Compiling Tools tests
Since fork is false, ignoring memoryMaximumSize setting
Compiling X-NET classes
Compiling X-NET test support files
Compiling X-NET api tests
Since fork is false, ignoring memoryMaximumSize setting
Compiling X-NET impl injected tests
Since fork is false, ignoring memoryMaximumSize setting
Compiling X-NET impl tests
Since fork is false, ignoring memoryMaximumSize setting
Running X-NET api tests
Running X-NET impl tests
Running X-NET impl injected tests
The test report is in /home/nathan/harmony/buildtest/cc/projects/classlib/trunk/build/test_report/html/index.html

***********************************************************
Unit Tests: (4)
        

***********************************************************
Modifications since last successful build:	(64)
            
modified xli  /harmony/enhanced/drlvm/trunk/vm/vmcore/src/init/vm_properties.cpp 04/26/2007
20:39:01 HARMONY-3746 : turn off GCv5 until the blocker is resolved.
modified ayza  /harmony/enhanced/drlvm/trunk/build/make/build.xml 04/26/2007 11:23:10 With
this fix DRLVM build will produce corresponding source files' jars for all jars generated
by the build. See HARMONY-3764.
modified ayza  /harmony/enhanced/drlvm/trunk/build/make/build_component.xml 04/26/2007 11:23:10
With this fix DRLVM build will produce corresponding source files' jars for all jars generated
by the build. See HARMONY-3764.
modified ayza  /harmony/enhanced/drlvm/trunk/build/make/components/README.txt 04/26/2007 11:23:10
With this fix DRLVM build will produce corresponding source files' jars for all jars generated
by the build. See HARMONY-3764.
modified ayza  /harmony/enhanced/drlvm/trunk/build/make/targets/build.jar.xml 04/26/2007 11:23:10
With this fix DRLVM build will produce corresponding source files' jars for all jars generated
by the build. See HARMONY-3764.
modified ayza  /harmony/enhanced/drlvm/trunk/build/make/components/vm/kernel_classes.xml 04/26/2007
11:23:10 With this fix DRLVM build will produce corresponding source files' jars for all jars
generated by the build. See HARMONY-3764.
modified ayza  /harmony/enhanced/drlvm/trunk/build/make/components/vm/gc_cc.xml 04/26/2007
11:23:10 With this fix DRLVM build will produce corresponding source files' jars for all jars
generated by the build. See HARMONY-3764.
modified ayza  /harmony/enhanced/drlvm/trunk/build/make/components/vm/hythr.xml 04/26/2007
11:23:10 With this fix DRLVM build will produce corresponding source files' jars for all jars
generated by the build. See HARMONY-3764.
modified ayza  /harmony/enhanced/drlvm/trunk/build/make/components/vm/jitrino.xml 04/26/2007
11:23:10 With this fix DRLVM build will produce corresponding source files' jars for all jars
generated by the build. See HARMONY-3764.
modified ayza  /harmony/enhanced/drlvm/trunk/build/make/build_component.xsl 04/26/2007 11:23:10
With this fix DRLVM build will produce corresponding source files' jars for all jars generated
by the build. See HARMONY-3764.
modified ayza  /harmony/enhanced/drlvm/trunk/build/make/targets/build.java.xml 04/26/2007
11:23:10 With this fix DRLVM build will produce corresponding source files' jars for all jars
generated by the build. See HARMONY-3764.
modified ayza  /harmony/enhanced/drlvm/trunk/build/make/targets/build.xml 04/26/2007 11:23:10
With this fix DRLVM build will produce corresponding source files' jars for all jars generated
by the build. See HARMONY-3764.
modified ayza  /harmony/enhanced/drlvm/trunk/build/make/components/vm/gc_gen.xml 04/26/2007
11:23:10 With this fix DRLVM build will produce corresponding source files' jars for all jars
generated by the build. See HARMONY-3764.
added gshimansky  /harmony/enhanced/drlvm/trunk/src/test/regression/H3730 04/26/2007 10:03:52
Applied HARMONY-3730 [drlvm][jvmti] SINGLE_STEP events are not reported in JIT mode
modified gshimansky  /harmony/enhanced/drlvm/trunk/vm/vmcore/src/jit/ini.cpp 04/26/2007 10:03:52
Applied HARMONY-3730 [drlvm][jvmti] SINGLE_STEP events are not reported in JIT mode
added gshimansky  /harmony/enhanced/drlvm/trunk/src/test/regression/H3730/run.test.xml 04/26/2007
10:03:52 Applied HARMONY-3730 [drlvm][jvmti] SINGLE_STEP events are not reported in JIT mode
added gshimansky  /harmony/enhanced/drlvm/trunk/src/test/regression/H3730/StepM2N.java 04/26/2007
10:03:52 Applied HARMONY-3730 [drlvm][jvmti] SINGLE_STEP events are not reported in JIT mode
added gshimansky  /harmony/enhanced/drlvm/trunk/src/test/regression/H3730/StepM2N.cpp 04/26/2007
10:03:52 Applied HARMONY-3730 [drlvm][jvmti] SINGLE_STEP events are not reported in JIT mode
modified varlax  /harmony/enhanced/drlvm/trunk/vm/jitrino/src/codegenerator/ia32/Ia32GCMap.cpp
04/26/2007 06:28:40 Workaround for failing assert after HARMONY-3751
modified apetrenko  /harmony/enhanced/classlib/trunk/modules/awt/src/main/native/lcmm/shared/cmmio.c
04/26/2007 06:20:13 Patch for HARMONY-3677 "[classlib][awt] Results of running checker tool"
modified apetrenko  /harmony/enhanced/classlib/trunk/modules/awt/src/main/native/gl/shared/LUTTables.cpp
04/26/2007 06:19:23 Patch for HARMONY-3677 "[classlib][awt] Results of running checker tool"
modified varlax  /harmony/enhanced/drlvm/trunk/build/make/targets/smoke.test.xml 04/26/2007
05:38:23 Applied HARMONY-3573 [drlvm][testing] run of drlvm smoke tests should support 'timeout'
tag
modified varlax  /harmony/enhanced/drlvm/trunk/src/test/regression/H1840/run.test.xml 04/26/2007
05:34:52 Applied HARMONY-1841 [drlvm][jit] Jitrino OPT crashes when returnAddress is on the
top of the stack before astore or astore_<n> instruction
modified varlax  /harmony/enhanced/drlvm/trunk/vm/jitrino/src/optimizer/FlowGraph.cpp 04/26/2007
05:34:52 Applied HARMONY-1841 [drlvm][jit] Jitrino OPT crashes when returnAddress is on the
top of the stack before astore or astore_<n> instruction
modified varlax  /harmony/enhanced/drlvm/trunk/build/make/build.xml 04/26/2007 05:03:39 Added
echoing of host Java version
modified pyang  /harmony/enhanced/classlib/trunk/modules/luni/src/main/java/org/apache/harmony/luni/util/Util.java
04/26/2007 04:43:49 Apply patch for HARMONY-3656([classlib][luni] File.mkdir does not support
unicode)
modified pyang  /harmony/enhanced/classlib/trunk/modules/luni/src/main/java/java/io/File.java
04/26/2007 04:43:49 Apply patch for HARMONY-3656([classlib][luni] File.mkdir does not support
unicode)
modified pyang  /harmony/enhanced/classlib/trunk/modules/portlib/src/main/native/port/windows/hyfile.c
04/26/2007 04:43:49 Apply patch for HARMONY-3656([classlib][luni] File.mkdir does not support
unicode)
modified pyang  /harmony/enhanced/classlib/trunk/modules/luni/src/test/java/tests/api/java/io/FileTest.java
04/26/2007 04:43:49 Apply patch for HARMONY-3656([classlib][luni] File.mkdir does not support
unicode)
modified pyang  /harmony/enhanced/classlib/trunk/modules/portlib/src/main/native/port/shared/hystr.c
04/26/2007 04:30:01 Apply patch for HARMONY-654([classlib][portlib] hytty_printf(%d, -1) outputs
01)
added pyang  /harmony/enhanced/classlib/trunk/modules/portlib/src/test/native/hycunit 04/26/2007
04:27:43 Apply patch for HARMONY-3749([classlib][portlib] Add Hycunit for native C unit test)
added pyang  /harmony/enhanced/classlib/trunk/modules/portlib/src/test/native/hycunit/hycunit.c
04/26/2007 04:27:43 Apply patch for HARMONY-3749([classlib][portlib] Add Hycunit for native
C unit test)
added pyang  /harmony/enhanced/classlib/trunk/modules/portlib/src/test/native/hycunit/hycunit.h
04/26/2007 04:27:43 Apply patch for HARMONY-3749([classlib][portlib] Add Hycunit for native
C unit test)
added varlax  /harmony/enhanced/drlvm/trunk/src/test/regression/H3751/Test.java 04/26/2007
04:04:51 Applied HARMONY-3751 [drlvm][jit][opt] GCMap verification routine fails with assertion
on write to vmmagic Address fields
added varlax  /harmony/enhanced/drlvm/trunk/src/test/regression/H3751 04/26/2007 04:04:51
Applied HARMONY-3751 [drlvm][jit][opt] GCMap verification routine fails with assertion on
write to vmmagic Address fields
modified varlax  /harmony/enhanced/drlvm/trunk/vm/jitrino/src/codegenerator/ia32/Ia32GCMap.cpp
04/26/2007 04:04:51 Applied HARMONY-3751 [drlvm][jit][opt] GCMap verification routine fails
with assertion on write to vmmagic Address fields
added varlax  /harmony/enhanced/drlvm/trunk/src/test/regression/H3751/run.test.xml 04/26/2007
04:04:51 Applied HARMONY-3751 [drlvm][jit][opt] GCMap verification routine fails with assertion
on write to vmmagic Address fields
modified varlax  /harmony/enhanced/drlvm/trunk/vm/vmcore/src/class_support/Class_File_Loader.cpp
04/26/2007 04:04:51 Applied HARMONY-3751 [drlvm][jit][opt] GCMap verification routine fails
with assertion on write to vmmagic Address fields
modified varlax  /harmony/enhanced/drlvm/trunk/vm/vmcore/include/class_member.h 04/26/2007
04:04:51 Applied HARMONY-3751 [drlvm][jit][opt] GCMap verification routine fails with assertion
on write to vmmagic Address fields
added varlax  /harmony/enhanced/drlvm/trunk/src/test/regression/H3738/Test.java 04/26/2007
04:01:25 Applied HARMONY-3738 [drlvm][jit][vmmagic] I8Lowerer does not eliminate all I8PseudoInsts
when address arithmetic with vmmagics is used.
added varlax  /harmony/enhanced/drlvm/trunk/src/test/regression/H3738 04/26/2007 04:01:25
Applied HARMONY-3738 [drlvm][jit][vmmagic] I8Lowerer does not eliminate all I8PseudoInsts
when address arithmetic with vmmagics is used.
added varlax  /harmony/enhanced/drlvm/trunk/src/test/regression/H3738/run.test.xml 04/26/2007
04:01:25 Applied HARMONY-3738 [drlvm][jit][vmmagic] I8Lowerer does not eliminate all I8PseudoInsts
when address arithmetic with vmmagics is used.
modified varlax  /harmony/enhanced/drlvm/trunk/vm/jitrino/src/codegenerator/ia32/Ia32I8Lowerer.cpp
04/26/2007 04:01:25 Applied HARMONY-3738 [drlvm][jit][vmmagic] I8Lowerer does not eliminate
all I8PseudoInsts when address arithmetic with vmmagics is used.
added varlax  /harmony/enhanced/drlvm/trunk/build/make/excludes/exclude.drlvm_smoke.linux.ia64.jit
04/26/2007 03:52:56 x-lists for ia64 updated
added varlax  /harmony/enhanced/drlvm/trunk/build/make/excludes/exclude.drlvm_kernel.linux.ia64.jit
04/26/2007 03:52:56 x-lists for ia64 updated
modified varlax  /harmony/enhanced/drlvm/trunk/build/make/excludes/exclude.drlvm_smoke.linux.ia64.int
04/26/2007 03:52:56 x-lists for ia64 updated
added varlax  /harmony/enhanced/drlvm/trunk/build/make/excludes/exclude.drlvm_kernel.linux.ia64.int
04/26/2007 03:52:56 x-lists for ia64 updated
deleted varlax  /harmony/enhanced/drlvm/trunk/build/make/excludes/exclude.drlvm_smoke.linux.ia64.jet
04/26/2007 03:52:56 x-lists for ia64 updated
deleted varlax  /harmony/enhanced/drlvm/trunk/build/make/excludes/exclude.drlvm_smoke.linux.ia64.opt
04/26/2007 03:52:56 x-lists for ia64 updated
modified varlax  /harmony/enhanced/drlvm/trunk/build/make/targets/test.xml 04/26/2007 03:52:56
x-lists for ia64 updated
modified pyang  /harmony/enhanced/classlib/trunk/modules/tools/src/main/java/com/sun/tools/javac/Main.java
04/26/2007 03:23:40 Apply patch for HARMONY-3685([classlib][tools] missing method of com.sun.tools.javac.Main.compile([Ljava.lang.String;,
java.io.PrintWriter))
modified pyang  /harmony/enhanced/classlib/trunk/modules/tools/src/main/java/org/apache/harmony/tools/javac/Main.java
04/26/2007 03:23:40 Apply patch for HARMONY-3685([classlib][tools] missing method of com.sun.tools.javac.Main.compile([Ljava.lang.String;,
java.io.PrintWriter))
added pyang  /harmony/enhanced/classlib/trunk/modules/tools/src/main/java/org/apache/harmony/tools/toolutils/Util.java
04/26/2007 03:23:40 Apply patch for HARMONY-3685([classlib][tools] missing method of com.sun.tools.javac.Main.compile([Ljava.lang.String;,
java.io.PrintWriter))
modified pyang  /harmony/enhanced/classlib/trunk/modules/tools/src/main/java/org/apache/harmony/tools/javac/Compiler.java
04/26/2007 03:23:40 Apply patch for HARMONY-3685([classlib][tools] missing method of com.sun.tools.javac.Main.compile([Ljava.lang.String;,
java.io.PrintWriter))
modified pyang  /harmony/enhanced/classlib/trunk/modules/tools/src/test/java/org/apache/harmony/tests/tools/javac/MainTest.java
04/26/2007 03:23:40 Apply patch for HARMONY-3685([classlib][tools] missing method of com.sun.tools.javac.Main.compile([Ljava.lang.String;,
java.io.PrintWriter))
modified pyang  /harmony/enhanced/classlib/trunk/modules/beans/src/test/java/org/apache/harmony/beans/tests/java/beans/beancontext/BeanContextSupportTest.java
04/26/2007 03:06:29 Apply patch for HARMONY-3757([classlib][beans]java.beans.beancontext.BeanContextServicesSupport
has problem in self-deserialization)
modified pyang  /harmony/enhanced/classlib/trunk/modules/beans/src/main/java/java/beans/beancontext/BeanContextSupport.java
04/26/2007 03:06:29 Apply patch for HARMONY-3757([classlib][beans]java.beans.beancontext.BeanContextServicesSupport
has problem in self-deserialization)
modified pyang  /harmony/enhanced/classlib/trunk/modules/sql/src/main/java/javax/sql/rowset/serial/SerialArray.java
04/26/2007 02:52:30 Apply patch for HARMONY-3750([classlib][sql]javax.sql.rowset.serial.SerialArray
implementation)
modified pyang  /harmony/enhanced/classlib/trunk/modules/sql/src/test/java/org/apache/harmony/sql/tests/javax/sql/rowset/serial/SerialArrayTest.java
04/26/2007 02:52:30 Apply patch for HARMONY-3750([classlib][sql]javax.sql.rowset.serial.SerialArray
implementation)
modified pyang  /harmony/enhanced/classlib/trunk/modules/sql/src/main/java/org/apache/harmony/sql/internal/nls/messages.properties
04/26/2007 02:09:11 Apply patch for HARMONY-3760([classlib][sql] 12 new methods in RowSetMetaDataImpl)
modified pyang  /harmony/enhanced/classlib/trunk/modules/sql/src/main/java/javax/sql/rowset/RowSetMetaDataImpl.java
04/26/2007 02:09:11 Apply patch for HARMONY-3760([classlib][sql] 12 new methods in RowSetMetaDataImpl)
modified pyang  /harmony/enhanced/classlib/trunk/modules/sql/src/test/java/org/apache/harmony/sql/tests/javax/sql/rowset/RowSetMetaDataImplTest.java
04/26/2007 02:09:11 Apply patch for HARMONY-3760([classlib][sql] 12 new methods in RowSetMetaDataImpl)
added pyang  /harmony/enhanced/classlib/trunk/modules/sql/src/test/resources/serialization/org/apache/harmony/sql/tests/javax/sql/rowset/RowSetMetaDataImplTest.golden.ser
04/26/2007 02:09:11 Apply patch for HARMONY-3760([classlib][sql] 12 new methods in RowSetMetaDataImpl)
modified smishura  /harmony/enhanced/classlib/trunk/modules/luni/src/main/native/launcher/shared/main.c
04/26/2007 00:17:22 Quick fix for commit r532301:Patch for HARMONY-3615 "[classlib][launcher]
should print help message when run without class specified"


Mime
View raw message