harmony-alerts mailing list archives

Site index · List index
Message view « Date » · « Thread »
Top « Date » · « Thread »
From nom...@intel.com
Subject [build-test alert] BUILD FAILED Linux SUSE 9 64bit gcc debug: classlib over drlvm
Date Thu, 26 Apr 2007 10:48:02 GMT
BUILD FAILED:
	Ant Error Message:
/export/cruise/trunk/cc/projects/classlib/trunk/build.xml:169: The following error occurred while executing this line: /export/cruise/trunk/cc/projects/classlib/trunk/make/build-test.xml:142: There were test crashes: /export/cruise/trunk/cc/projects/classlib/trunk/build/test_report/TEST-org.apache.harmony.jndi.tests.javax.naming.ldap.extras.TestRdnParser.xml:/export/cruise/trunk/cc/projects/classlib/trunk/build/test_report/TEST-org.apache.harmony.luni.tests.java.lang.String2Test.xml:/export/cruise/trunk/cc/projects/classlib/trunk/build/test_report/TEST-org.apache.harmony.security.tests.asn1.der.DerUTCTimeEDTest.xml:/export/cruise/trunk/cc/projects/classlib/trunk/build/test_report/TEST-org.apache.harmony.security.tests.java.security.serialization.InvalidKeyExceptionTest.xml:/export/cruise/trunk/cc/projects/classlib/trunk/build/test_report/TEST-org.apache.harmony.text.tests.java.text.DecimalFormatSymbolsTest.xml

Date of build:	04/26/2007 17:26:23
Time to build:	21 minutes 12 seconds
Last changed:	04/26/2007 17:14:35
Last log entry:	drlvm

***********************************************************
Execution log (errors/warnings messages):	
Tests FAILED
Tests FAILED
Tests FAILED
Tests FAILED

========================================
Testing class libraries...
========================================
Checking for depends/jars/yoko_M2-20070130/yoko.jar
Checking for depends/jars/yoko_M2-20070130/yoko-core.jar
Checking for depends/jars/yoko_M2-20070130/yoko-rmi-impl.jar
Checking for depends/jars/yoko_M2-20070130/yoko-rmi-spec.jar
Checking for depends/jars/bcel-5.2/bcel-5.2.jar
Checking for depends/jars/xalan-j_2.7.0/xalan.jar
Checking for depends/jars/xerces_2.9.0/xerces.zip
Checking for depends/jars/junit_3.8.2/junit.jar
Checking for depends/jars/bcprov-jdk15-134/bcprov.jar
Checking for depends/jars/icu4j_3.4.4/icu4j_3_4_4.jar
Checking for depends/jars/mx4j_3.0.2/mx4j.zip
Checking for depends/jars/ecj_3.2/ecj_3.2.jar
Checking for depends/jars/jetty/jetty-6.0.0.jar
Checking for depends/jars/jetty/jetty-util-6.0.0.jar
Checking for depends/jars/jetty/servlet-api-2.5-6.0.0.jar
Checking for depends/libs/build/lcms/icc34.h
Checking for depends/libs/build/lcms/lcms.h
Checking for depends/libs/build/png/pngconf.h
Checking for depends/libs/build/png/png.h
Checking for depends/libs/build/jpeg/jconfig.lnx
Checking for depends/libs/build/jpeg/jpeglib.h
Checking for depends/libs/build/jpeg/jmorecfg.h
Checking for depends/libs/build/jpeg/jerror.h
Checking for depends/libs/build/lcms/liblcms.linux.x86_64
Checking for depends/libs/build/png/libpng.linux.x86_64
Checking for depends/libs/build/jpeg/libjpeg.linux.x86_64
hy.test.vm.name = drl
Compiling ACCESSIBILITY classes
Compiling ACCESSIBILITY tests
Since fork is false, ignoring memoryMaximumSize setting
Compiling ANNOTATION classes
Compiling ANNOTATION tests
Since fork is false, ignoring memoryMaximumSize setting
----------
1. WARNING in /export/cruise/trunk/cc/projects/classlib/trunk/modules/annotation/src/test/java/org/apache/harmony/annotation/tests/java/lang/annotation/IncompleteAnnotationExceptionTest.java
 (at line 53)
	clazz, elementName);
	^^^^^
Type safety: The expression of type Class needs unchecked conversion to conform to Class<? extends Annotation>
----------
1 problem (1 warning)
Compiling APPLET classes
Compiling APPLET tests
Since fork is false, ignoring memoryMaximumSize setting
Compiling ARCHIVE classes
Compiling ARCHIVE tests
Since fork is false, ignoring memoryMaximumSize setting
Compiling AUTH classes
Compiling AUTH tests
Since fork is false, ignoring memoryMaximumSize setting
Compiling AWT classes
Compiling AWT tests
Since fork is false, ignoring memoryMaximumSize setting
java.lang.NullPointerException
	at java.awt.HeadlessEventDispatchThread.waitForAnyEvent(HeadlessEventDispatchThread.java:71)
	at java.awt.HeadlessEventDispatchThread.runModalLoop(HeadlessEventDispatchThread.java:56)
	at java.awt.HeadlessEventDispatchThread.run(HeadlessEventDispatchThread.java:31)
Compiling BEANS classes
Compiling support classes for BEANS tests
Compiling internal BEANS tests
Compiling BEANS tests
Since fork is false, ignoring memoryMaximumSize setting
Running internal BEANS tests
Running BEANS tests
Compiling CRYPTO classes
Compiling CRYPTO test support files
Compiling CRYPTO api tests
Since fork is false, ignoring memoryMaximumSize setting
Compiling CRYPTO api injected tests
Since fork is false, ignoring memoryMaximumSize setting
Compiling CRYPTO impl injected tests
Since fork is false, ignoring memoryMaximumSize setting
Compiling CRYPTO impl tests
Since fork is false, ignoring memoryMaximumSize setting
Running CRYPTO api tests
Running CRYPTO api.injected tests
Running CRYPTO impl tests
Running CRYPTO impl injected tests
Compiling ImageIO classes
Compiling ImageIO tests
Since fork is false, ignoring memoryMaximumSize setting
Compiling INSTRUMENT classes
Compiling INSTRUMENT tests
Since fork is false, ignoring memoryMaximumSize setting
Compiling JNDI classes
Compiling JNDI tests
Since fork is false, ignoring memoryMaximumSize setting
java: /export/cruise/trunk/cc/projects/drlvm/trunk/vm/jitrino/src/codegenerator/ia32/Ia32GCMap.cpp:137: void Jitrino::Ia32::checkManaged2UnmanagedConv(Jitrino::Ia32::IRManager&, Jitrino::Ia32::Opnd*, Jitrino::Ia32::Inst*): Assertion `0' failed.
SIGABRT in VM code.
Stack trace:
  0: raise (??:-1)
  1: abort (??:-1)
  2: new_do_write (??:-1)
  3: _IO_file_xsputn@@GLIBC_2.2.5 (??:-1)
  4: ?? (??:-1)
  5: ?? (??:-1)
  6: ?? (??:-1)
  7: free (??:-1)
  8: __assert_fail (??:-1)
  9: ?? (??:-1)
 10: ?? (??:-1)
 11: std::basic_ostream<char, std::char_traits<char> >& std::flush<char, std::char_traits<char> >(std::basic_ostream<char, std::char_traits<char> >&) (??:-1)
 12: checkManaged2UnmanagedConv (/export/cruise/trunk/cc/projects/drlvm/trunk/vm/jitrino/src/codegenerator/ia32/Ia32GCMap.cpp:121)
 13: Jitrino::Ia32::GCMap::registerGCSafePoint(Jitrino::Ia32::IRManager&, Jitrino::BitSet const&, Jitrino::Ia32::Inst*) (/export/cruise/trunk/cc/projects/drlvm/trunk/vm/jitrino/src/codegenerator/ia32/Ia32GCMap.cpp:174)
 14: ?? (0x387688
:-1)
 15: Jitrino::CompilationContext::getCurrentContext() (/export/cruise/trunk/cc/projects/drlvm/trunk/vm/jitrino/src/main/CompilationContext.cpp:86)
 16: Jitrino::Ia32::GCMap::processBasicBlock(Jitrino::Ia32::IRManager&, Jitrino::Node const*) (/export/cruise/trunk/cc/projects/drlvm/trunk/vm/jitrino/src/codegenerator/ia32/Ia32GCMap.cpp:70)
 17: Jitrino::Ia32::GCMap::registerInsts(Jitrino::Ia32::IRManager&) (/export/cruise/trunk/cc/projects/drlvm/trunk/vm/jitrino/src/codegenerator/ia32/Ia32GCMap.cpp:51)
 18: Jitrino::Ia32::GCMapCreator::runImpl() (/export/cruise/trunk/cc/projects/drlvm/trunk/vm/jitrino/src/codegenerator/ia32/Ia32GCMap.cpp:505)
 19: Jitrino::Ia32::SessionAction::run() (/export/cruise/trunk/cc/projects/drlvm/trunk/vm/jitrino/src/codegenerator/ia32/Ia32IRManager.cpp:2271)
 20: Jitrino::runPipeline(Jitrino::CompilationContext*) (/export/cruise/trunk/cc/projects/drlvm/trunk/vm/jitrino/src/main/Jitrino.cpp:228)
 21: Jitrino::compileMethod(Jitrino::CompilationContext*) (/export/cruise/trunk/cc/projects/drlvm/trunk/vm/jitrino/src/main/Jitrino.cpp:265)
 22: Jitrino::Jitrino::CompileMethod(Jitrino::CompilationContext*) (/export/cruise/trunk/cc/projects/drlvm/trunk/vm/jitrino/src/main/Jitrino.cpp:287)
 23: JIT_compile_method_with_params (/export/cruise/trunk/cc/projects/drlvm/trunk/vm/jitrino/src/vm/drl/DrlJITInterface.cpp:279)
 24: Dll_JIT::compile_method_with_params(void*, Method*, OpenMethodExecutionParams) (/export/cruise/trunk/cc/projects/drlvm/trunk/vm/vmcore/include/dll_jit_intf.h:86)
 25: compile_do_compilation_jit(Method*, JIT*) (/export/cruise/trunk/cc/projects/drlvm/trunk/vm/vmcore/src/jit/compile.cpp:657)
 26: vm_compile_method (/export/cruise/trunk/cc/projects/drlvm/trunk/vm/vmcore/src/class_support/C_Interface.cpp:2493)
 27: DrlEMImpl::methodProfileIsReady(MethodProfile*) (/export/cruise/trunk/cc/projects/drlvm/trunk/vm/em/src/DrlEMImpl.cpp:772)
 28: EBProfileCollector::syncModeJitCallback(MethodProfile*) (/export/cruise/trunk/cc/projects/drlvm/trunk/vm/em/src/EBProfileCollector.cpp:192)
 29: eb_profiler_sync_mode_callback(void*) (/export/cruise/trunk/cc/projects/drlvm/trunk/vm/em/src/EBProfileCollector.cpp:92)
 30: 0x0000002A98302084  <Generated stub>
 31: ?? (??:-1)
 32: org/apache/harmony/jndi/internal/parser/LdapTypeAndValueList$ValueWrapper.compareTo(Ljava/lang/Object;)I (LdapTypeAndValueList.java:213)
 33: java/util/TreeMap.find(Ljava/lang/Object;)Ljava/util/TreeMap$Entry; (TreeMap.java:912)
 34: java/util/TreeMap.get(Ljava/lang/Object;)Ljava/lang/Object; (TreeMap.java:1071)
 35: org/apache/harmony/jndi/internal/parser/LdapTypeAndValueList.toAttributeList()Ljava/util/List; (LdapTypeAndValueList.java:142)
 36: org/apache/harmony/jndi/internal/parser/LdapRdnParser.getList()Ljava/util/List; (LdapRdnParser.java:76)
 37: javax/naming/ldap/Rdn.<init>(Ljava/lang/String;)V (Rdn.java:118)
 38: ?? (??:-1)
 39: JIT_execute_method_default(void*, _jmethodID*, jvalue*, jvalue*) (/export/cruise/trunk/cc/projects/drlvm/trunk/vm/vmcore/src/util/em64t/base/ini_em64t.cpp:346)
 40: DrlEMImpl::executeMethod(_jmethodID*, jvalue*, jvalue*) (/export/cruise/trunk/cc/projects/drlvm/trunk/vm/em/src/DrlEMImpl.cpp:510)
 41: ExecuteMethod (/export/cruise/trunk/cc/projects/drlvm/trunk/vm/em/src/em_intf.cpp:44)
 42: vm_execute_java_method_array(_jmethodID*, jvalue*, jvalue*) (/export/cruise/trunk/cc/projects/drlvm/trunk/vm/vmcore/src/jit/ini.cpp:56)
 43: call_method_no_ref_result (/export/cruise/trunk/cc/projects/drlvm/trunk/vm/vmcore/src/jni/jni_method.cpp:188)
 44: CallVoidMethodA(JNIEnv_External*, _jobject*, _jmethodID*, jvalue*) (/export/cruise/trunk/cc/projects/drlvm/trunk/vm/vmcore/src/jni/jni_method.cpp:226)
 45: invoke_primitive_method (/export/cruise/trunk/cc/projects/drlvm/trunk/vm/vmcore/src/kernel_classes/native/java_lang_reflect_VMReflection.cpp:188)
 46: org/apache/harmony/jndi/tests/javax/naming/ldap/extras/TestRdnParser.testRdnString003()V (TestRdnParser.java:341)
 47: 0x0000002A95631536  <Generated stub>
 48: ?? (??:-1)
 49: java/lang/reflect/Method.invoke(Ljava/lang/Object;[Ljava/lang/Object;)Ljava/lang/Object; (Method.java:382)
 50: junit/framework/TestCase.runTest()V (TestCase.java:154)
 51: junit/framework/TestCase.runBare()V (TestCase.java:127)
 52: junit/framework/TestResult$1.protect()V (TestResult.java:106)
 53: junit/framework/TestResult.runProtected(Ljunit/framework/Test;Ljunit/framework/Protectable;)V (TestResult.java:124)
 54: junit/framework/TestResult.run(Ljunit/framework/TestCase;)V (TestResult.java:109)
 55: junit/framework/TestCase.run(Ljunit/framework/TestResult;)V (TestCase.java:118)
 56: junit/framework/TestSuite.runTest(Ljunit/framework/Test;Ljunit/framework/TestResult;)V (TestSuite.java:208)
 57: junit/framework/TestSuite.run(Ljunit/framework/TestResult;)V (TestSuite.java:203)
 58: org/apache/tools/ant/taskdefs/optional/junit/JUnitTestRunner.run()V (JUnitTestRunner.java:297)
 59: org/apache/tools/ant/taskdefs/optional/junit/JUnitTestRunner.launch(Lorg/apache/tools/ant/taskdefs/optional/junit/JUnitTest;ZZZZLjava/util/Properties;)I (JUnitTestRunner.java:672)
 60: ?? (??:-1)
 61: JIT_execute_method_default(void*, _jmethodID*, jvalue*, jvalue*) (/export/cruise/trunk/cc/projects/drlvm/trunk/vm/vmcore/src/util/em64t/base/ini_em64t.cpp:346)
 62: DrlEMImpl::executeMethod(_jmethodID*, jvalue*, jvalue*) (/export/cruise/trunk/cc/projects/drlvm/trunk/vm/em/src/DrlEMImpl.cpp:510)
 63: ExecuteMethod (/export/cruise/trunk/cc/projects/drlvm/trunk/vm/em/src/em_intf.cpp:44)
 64: vm_execute_java_method_array(_jmethodID*, jvalue*, jvalue*) (/export/cruise/trunk/cc/projects/drlvm/trunk/vm/vmcore/src/jit/ini.cpp:56)
 65: call_static_method_no_ref_result (/export/cruise/trunk/cc/projects/drlvm/trunk/vm/vmcore/src/jni/jni_method.cpp:1155)
 66: CallStaticVoidMethodA(JNIEnv_External*, _jobject*, _jmethodID*, jvalue*) (/export/cruise/trunk/cc/projects/drlvm/trunk/vm/vmcore/src/jni/jni_method.cpp:1563)
 67: CallStaticVoidMethodV(JNIEnv_External*, _jobject*, _jmethodID*, __va_list_tag*) (/export/cruise/trunk/cc/projects/drlvm/trunk/vm/vmcore/src/jni/jni_method.cpp:1547)
 68: CallStaticVoidMethod(JNIEnv_External*, _jobject*, _jmethodID*, ...) (/export/cruise/trunk/cc/projects/drlvm/trunk/vm/vmcore/src/jni/jni_method.cpp:1537)
 69: main_runJavaMain (../shared/main.c:1332)
 70: invocation (../shared/main.c:742)
 71: gpProtectedMain (../shared/main.c:391)
 72: main (../shared/cmain.c:147)
 73: __libc_start_main (??:-1)
 74: org/apache/tools/ant/taskdefs/optional/junit/JUnitTestRunner.main([Ljava/lang/String;)V (JUnitTestRunner.java:546)
<end of stack trace>
Compiling LANG-MANAGEMENT classes
Compiling LANG-MANAGEMENT API tests
Since fork is false, ignoring memoryMaximumSize setting
Compiling LANG-MANAGEMENT Implementation tests
Since fork is false, ignoring memoryMaximumSize setting
Compiling LOGGING classes
Compiling LOGGING tests
Since fork is false, ignoring memoryMaximumSize setting
Compiling LUNI classes
Compiling LUNI JUnit Tests
Since fork is false, ignoring memoryMaximumSize setting
Running LUNI JUnit Tests
java: /export/cruise/trunk/cc/projects/drlvm/trunk/vm/jitrino/src/codegenerator/ia32/Ia32GCMap.cpp:137: void Jitrino::Ia32::checkManaged2UnmanagedConv(Jitrino::Ia32::IRManager&, Jitrino::Ia32::Opnd*, Jitrino::Ia32::Inst*): Assertion `0' failed.
SIGABRT in VM code.
Stack trace:
  0: raise (??:-1)
  1: abort (??:-1)
  2: new_do_write (??:-1)
  3: _IO_file_xsputn@@GLIBC_2.2.5 (??:-1)
  4: ?? (??:-1)
  5: ?? (??:-1)
  6: ?? (??:-1)
  7: free (??:-1)
  8: __assert_fail (??:-1)
  9: ?? (??:-1)
 10: ?? (??:-1)
 11: std::basic_ostream<char, std::char_traits<char> >& std::flush<char, std::char_traits<char> >(std::basic_ostream<char, std::char_traits<char> >&) (??:-1)
 12: checkManaged2UnmanagedConv (/export/cruise/trunk/cc/projects/drlvm/trunk/vm/jitrino/src/codegenerator/ia32/Ia32GCMap.cpp:121)
 13: Jitrino::Ia32::GCMap::registerGCSafePoint(Jitrino::Ia32::IRManager&, Jitrino::BitSet const&, Jitrino::Ia32::Inst*) (/export/cruise/trunk/cc/projects/drlvm/trunk/vm/jitrino/src/codegenerator/ia32/Ia32GCMap.cpp:174)
 14: ?? (0x387688
:-1)
 15: Jitrino::CompilationContext::getCurrentContext() (/export/cruise/trunk/cc/projects/drlvm/trunk/vm/jitrino/src/main/CompilationContext.cpp:86)
 16: Jitrino::Ia32::GCMap::processBasicBlock(Jitrino::Ia32::IRManager&, Jitrino::Node const*) (/export/cruise/trunk/cc/projects/drlvm/trunk/vm/jitrino/src/codegenerator/ia32/Ia32GCMap.cpp:70)
 17: Jitrino::Ia32::GCMap::registerInsts(Jitrino::Ia32::IRManager&) (/export/cruise/trunk/cc/projects/drlvm/trunk/vm/jitrino/src/codegenerator/ia32/Ia32GCMap.cpp:51)
 18: Jitrino::Ia32::GCMapCreator::runImpl() (/export/cruise/trunk/cc/projects/drlvm/trunk/vm/jitrino/src/codegenerator/ia32/Ia32GCMap.cpp:505)
 19: Jitrino::Ia32::SessionAction::run() (/export/cruise/trunk/cc/projects/drlvm/trunk/vm/jitrino/src/codegenerator/ia32/Ia32IRManager.cpp:2271)
 20: Jitrino::runPipeline(Jitrino::CompilationContext*) (/export/cruise/trunk/cc/projects/drlvm/trunk/vm/jitrino/src/main/Jitrino.cpp:228)
 21: Jitrino::compileMethod(Jitrino::CompilationContext*) (/export/cruise/trunk/cc/projects/drlvm/trunk/vm/jitrino/src/main/Jitrino.cpp:265)
 22: Jitrino::Jitrino::CompileMethod(Jitrino::CompilationContext*) (/export/cruise/trunk/cc/projects/drlvm/trunk/vm/jitrino/src/main/Jitrino.cpp:287)
 23: JIT_compile_method_with_params (/export/cruise/trunk/cc/projects/drlvm/trunk/vm/jitrino/src/vm/drl/DrlJITInterface.cpp:279)
 24: Dll_JIT::compile_method_with_params(void*, Method*, OpenMethodExecutionParams) (/export/cruise/trunk/cc/projects/drlvm/trunk/vm/vmcore/include/dll_jit_intf.h:86)
 25: compile_do_compilation_jit(Method*, JIT*) (/export/cruise/trunk/cc/projects/drlvm/trunk/vm/vmcore/src/jit/compile.cpp:657)
 26: vm_compile_method (/export/cruise/trunk/cc/projects/drlvm/trunk/vm/vmcore/src/class_support/C_Interface.cpp:2493)
 27: DrlEMImpl::methodProfileIsReady(MethodProfile*) (/export/cruise/trunk/cc/projects/drlvm/trunk/vm/em/src/DrlEMImpl.cpp:772)
 28: EBProfileCollector::syncModeJitCallback(MethodProfile*) (/export/cruise/trunk/cc/projects/drlvm/trunk/vm/em/src/EBProfileCollector.cpp:192)
 29: eb_profiler_sync_mode_callback(void*) (/export/cruise/trunk/cc/projects/drlvm/trunk/vm/em/src/EBProfileCollector.cpp:92)
 30: 0x0000002A98302084  <Generated stub>
 31: ?? (??:-1)
 32: java/lang/String.getCharset(Ljava/lang/String;)Ljava/nio/charset/Charset; (String.java:892)
 33: java/lang/String.getBytes(Ljava/lang/String;)[B (String.java:883)
 34: ?? (??:-1)
 35: JIT_execute_method_default(void*, _jmethodID*, jvalue*, jvalue*) (/export/cruise/trunk/cc/projects/drlvm/trunk/vm/vmcore/src/util/em64t/base/ini_em64t.cpp:346)
 36: DrlEMImpl::executeMethod(_jmethodID*, jvalue*, jvalue*) (/export/cruise/trunk/cc/projects/drlvm/trunk/vm/em/src/DrlEMImpl.cpp:510)
 37: ExecuteMethod (/export/cruise/trunk/cc/projects/drlvm/trunk/vm/em/src/em_intf.cpp:44)
 38: vm_execute_java_method_array(_jmethodID*, jvalue*, jvalue*) (/export/cruise/trunk/cc/projects/drlvm/trunk/vm/vmcore/src/jit/ini.cpp:56)
 39: call_method_no_ref_result (/export/cruise/trunk/cc/projects/drlvm/trunk/vm/vmcore/src/jni/jni_method.cpp:188)
 40: CallVoidMethodA(JNIEnv_External*, _jobject*, _jmethodID*, jvalue*) (/export/cruise/trunk/cc/projects/drlvm/trunk/vm/vmcore/src/jni/jni_method.cpp:226)
 41: invoke_primitive_method (/export/cruise/trunk/cc/projects/drlvm/trunk/vm/vmcore/src/kernel_classes/native/java_lang_reflect_VMReflection.cpp:188)
 42: org/apache/harmony/luni/tests/java/lang/String2Test.test_getBytes()V (String2Test.java:366)
 43: 0x0000002A956315A6  <Generated stub>
 44: ?? (??:-1)
 45: java/lang/reflect/Method.invoke(Ljava/lang/Object;[Ljava/lang/Object;)Ljava/lang/Object; (Method.java:382)
 46: junit/framework/TestCase.runTest()V (TestCase.java:154)
 47: junit/framework/TestCase.runBare()V (TestCase.java:127)
 48: junit/framework/TestResult$1.protect()V (TestResult.java:106)
 49: junit/framework/TestResult.runProtected(Ljunit/framework/Test;Ljunit/framework/Protectable;)V (TestResult.java:124)
 50: junit/framework/TestResult.run(Ljunit/framework/TestCase;)V (TestResult.java:109)
 51: junit/framework/TestCase.run(Ljunit/framework/TestResult;)V (TestCase.java:118)
 52: junit/framework/TestSuite.runTest(Ljunit/framework/Test;Ljunit/framework/TestResult;)V (TestSuite.java:208)
 53: junit/framework/TestSuite.run(Ljunit/framework/TestResult;)V (TestSuite.java:203)
 54: org/apache/tools/ant/taskdefs/optional/junit/JUnitTestRunner.run()V (JUnitTestRunner.java:297)
 55: org/apache/tools/ant/taskdefs/optional/junit/JUnitTestRunner.launch(Lorg/apache/tools/ant/taskdefs/optional/junit/JUnitTest;ZZZZLjava/util/Properties;)I (JUnitTestRunner.java:672)
 56: ?? (??:-1)
 57: JIT_execute_method_default(void*, _jmethodID*, jvalue*, jvalue*) (/export/cruise/trunk/cc/projects/drlvm/trunk/vm/vmcore/src/util/em64t/base/ini_em64t.cpp:346)
 58: DrlEMImpl::executeMethod(_jmethodID*, jvalue*, jvalue*) (/export/cruise/trunk/cc/projects/drlvm/trunk/vm/em/src/DrlEMImpl.cpp:510)
 59: ExecuteMethod (/export/cruise/trunk/cc/projects/drlvm/trunk/vm/em/src/em_intf.cpp:44)
 60: vm_execute_java_method_array(_jmethodID*, jvalue*, jvalue*) (/export/cruise/trunk/cc/projects/drlvm/trunk/vm/vmcore/src/jit/ini.cpp:56)
 61: call_static_method_no_ref_result (/export/cruise/trunk/cc/projects/drlvm/trunk/vm/vmcore/src/jni/jni_method.cpp:1155)
 62: CallStaticVoidMethodA(JNIEnv_External*, _jobject*, _jmethodID*, jvalue*) (/export/cruise/trunk/cc/projects/drlvm/trunk/vm/vmcore/src/jni/jni_method.cpp:1563)
 63: CallStaticVoidMethodV(JNIEnv_External*, _jobject*, _jmethodID*, __va_list_tag*) (/export/cruise/trunk/cc/projects/drlvm/trunk/vm/vmcore/src/jni/jni_method.cpp:1547)
 64: CallStaticVoidMethod(JNIEnv_External*, _jobject*, _jmethodID*, ...) (/export/cruise/trunk/cc/projects/drlvm/trunk/vm/vmcore/src/jni/jni_method.cpp:1537)
 65: main_runJavaMain (../shared/main.c:1332)
 66: invocation (../shared/main.c:742)
 67: gpProtectedMain (../shared/main.c:391)
 68: main (../shared/cmain.c:147)
 69: __libc_start_main (??:-1)
 70: org/apache/tools/ant/taskdefs/optional/junit/JUnitTestRunner.main([Ljava/lang/String;)V (JUnitTestRunner.java:546)
<end of stack trace>
Compiling MATH classes
Compiling MATH tests
Since fork is false, ignoring memoryMaximumSize setting
Compiling MISC classes
Compiling MISC tests
Since fork is false, ignoring memoryMaximumSize setting
Compiling NIO classes
Compiling NIO tests
Since fork is false, ignoring memoryMaximumSize setting
Compiling NIO_CHAR classes
Compiling NIO_CHAR tests
Since fork is false, ignoring memoryMaximumSize setting
Cannot find unmappable byte array for US-ASCII
Cannot find unmappable byte array for gb18030
Cannot find unmappable byte array for ISO-8859-1
Cannot find malform byte array for ISO-8859-1
Cannot find unmappable byte array for UTF-16BE
Cannot find malform byte array for UTF-16BE
Cannot find unmappable byte array for UTF-16
Cannot find malform byte array for UTF-16
Cannot find unmappable byte array for UTF-16LE
Cannot find malform byte array for UTF-16LE
Cannot find unmappable byte array for UTF-8
Compiling PACK200 classes
Compiling PACK200 tests
Since fork is false, ignoring memoryMaximumSize setting
Running PACK200 tests
Compiling PREFS classes
Compiling PREFS tests
Since fork is false, ignoring memoryMaximumSize setting
Compiling PRINT classes
Compiling Print tests
Since fork is false, ignoring memoryMaximumSize setting
java.net.ConnectException: localhost/127.0.0.1:631 - Connection refused
	at org.apache.harmony.luni.net.PlainSocketImpl.connect(PlainSocketImpl.java:229)
	at org.apache.harmony.luni.net.PlainSocketImpl.connect(PlainSocketImpl.java:509)
	at java.net.Socket.connect(Socket.java:932)
	at org.apache.harmony.luni.internal.net.www.protocol.http.HttpURLConnection.getHTTPConnection(HttpURLConnection.java:635)
	at org.apache.harmony.luni.internal.net.www.protocol.http.HttpURLConnection.connect(HttpURLConnection.java:619)
	at org.apache.harmony.x.print.ipp.IppClient.request(IppClient.java:111)
	at org.apache.harmony.x.print.ipp.IppClient.request(IppClient.java:87)
	at org.apache.harmony.x.print.cups.CUPSPrintServiceProvider.findDefaultPrintService(CUPSPrintServiceProvider.java:471)
	at org.apache.harmony.x.print.cups.CUPSPrintServiceProvider.getDefaultPrintService(CUPSPrintServiceProvider.java:169)
	at javax.print.PrintServiceLookup.lookupDefaultPrintService(PrintServiceLookup.java:139)
	at javax.print.attribute.HashAttributeTest.testAdd2(HashAttributeTest.java:128)
	at java.lang.reflect.VMReflection.invokeMethod(VMReflection.java)
	at java.lang.reflect.Method.invoke(Method.java:382)
	at junit.framework.TestCase.runTest(TestCase.java:154)
	at junit.framework.TestCase.runBare(TestCase.java:127)
	at junit.framework.TestResult$1.protect(TestResult.java:106)
	at junit.framework.TestResult.runProtected(TestResult.java:124)
	at junit.framework.TestResult.run(TestResult.java:109)
	at junit.framework.TestCase.run(TestCase.java:118)
	at junit.framework.TestSuite.runTest(TestSuite.java:208)
	at junit.framework.TestSuite.run(TestSuite.java:203)
	at org.apache.tools.ant.taskdefs.optional.junit.JUnitTestRunner.run(JUnitTestRunner.java:297)
	at org.apache.tools.ant.taskdefs.optional.junit.JUnitTestRunner.launch(JUnitTestRunner.java:672)
	at org.apache.tools.ant.taskdefs.optional.junit.JUnitTestRunner.main(JUnitTestRunner.java:546)
java.net.ConnectException: localhost/127.0.0.1:631 - Connection refused
	at org.apache.harmony.luni.net.PlainSocketImpl.connect(PlainSocketImpl.java:229)
	at org.apache.harmony.luni.net.PlainSocketImpl.connect(PlainSocketImpl.java:509)
	at java.net.Socket.connect(Socket.java:932)
	at org.apache.harmony.luni.internal.net.www.protocol.http.HttpURLConnection.getHTTPConnection(HttpURLConnection.java:635)
	at org.apache.harmony.luni.internal.net.www.protocol.http.HttpURLConnection.connect(HttpURLConnection.java:619)
	at org.apache.harmony.x.print.ipp.IppClient.request(IppClient.java:111)
	at org.apache.harmony.x.print.ipp.IppClient.request(IppClient.java:87)
	at org.apache.harmony.x.print.cups.CUPSPrintServiceProvider.findDefaultPrintService(CUPSPrintServiceProvider.java:471)
	at org.apache.harmony.x.print.cups.CUPSPrintServiceProvider.getDefaultPrintService(CUPSPrintServiceProvider.java:169)
	at javax.print.PrintServiceLookup.lookupDefaultPrintService(PrintServiceLookup.java:139)
	at javax.print.attribute.HashAttributeTest.testEquals(HashAttributeTest.java:284)
	at java.lang.reflect.VMReflection.invokeMethod(VMReflection.java)
	at java.lang.reflect.Method.invoke(Method.java:382)
	at junit.framework.TestCase.runTest(TestCase.java:154)
	at junit.framework.TestCase.runBare(TestCase.java:127)
	at junit.framework.TestResult$1.protect(TestResult.java:106)
	at junit.framework.TestResult.runProtected(TestResult.java:124)
	at junit.framework.TestResult.run(TestResult.java:109)
	at junit.framework.TestCase.run(TestCase.java:118)
	at junit.framework.TestSuite.runTest(TestSuite.java:208)
	at junit.framework.TestSuite.run(TestSuite.java:203)
	at org.apache.tools.ant.taskdefs.optional.junit.JUnitTestRunner.run(JUnitTestRunner.java:297)
	at org.apache.tools.ant.taskdefs.optional.junit.JUnitTestRunner.launch(JUnitTestRunner.java:672)
	at org.apache.tools.ant.taskdefs.optional.junit.JUnitTestRunner.main(JUnitTestRunner.java:546)
java.net.ConnectException: localhost/127.0.0.1:631 - Connection refused
	at org.apache.harmony.luni.net.PlainSocketImpl.connect(PlainSocketImpl.java:229)
	at org.apache.harmony.luni.net.PlainSocketImpl.connect(PlainSocketImpl.java:509)
	at java.net.Socket.connect(Socket.java:932)
	at org.apache.harmony.luni.internal.net.www.protocol.http.HttpURLConnection.getHTTPConnection(HttpURLConnection.java:635)
	at org.apache.harmony.luni.internal.net.www.protocol.http.HttpURLConnection.connect(HttpURLConnection.java:619)
	at org.apache.harmony.x.print.ipp.IppClient.request(IppClient.java:111)
	at org.apache.harmony.x.print.ipp.IppClient.request(IppClient.java:87)
	at org.apache.harmony.x.print.cups.CUPSPrintServiceProvider.findDefaultPrintService(CUPSPrintServiceProvider.java:471)
	at org.apache.harmony.x.print.cups.CUPSPrintServiceProvider.getDefaultPrintService(CUPSPrintServiceProvider.java:169)
	at javax.print.PrintServiceLookup.lookupDefaultPrintService(PrintServiceLookup.java:139)
	at javax.print.attribute.HashAttributeTest.testAdd2(HashAttributeTest.java:128)
	at java.lang.reflect.VMReflection.invokeMethod(VMReflection.java)
	at java.lang.reflect.Method.invoke(Method.java:382)
	at junit.framework.TestCase.runTest(TestCase.java:154)
	at junit.framework.TestCase.runBare(TestCase.java:127)
	at junit.framework.TestResult$1.protect(TestResult.java:106)
	at junit.framework.TestResult.runProtected(TestResult.java:124)
	at junit.framework.TestResult.run(TestResult.java:109)
	at junit.framework.TestCase.run(TestCase.java:118)
	at junit.framework.TestSuite.runTest(TestSuite.java:208)
	at junit.framework.TestSuite.run(TestSuite.java:203)
	at junit.framework.TestSuite.runTest(TestSuite.java:208)
	at junit.framework.TestSuite.run(TestSuite.java:203)
	at org.apache.tools.ant.taskdefs.optional.junit.JUnitTestRunner.run(JUnitTestRunner.java:297)
	at org.apache.tools.ant.taskdefs.optional.junit.JUnitTestRunner.launch(JUnitTestRunner.java:672)
	at org.apache.tools.ant.taskdefs.optional.junit.JUnitTestRunner.main(JUnitTestRunner.java:546)
java.net.ConnectException: localhost/127.0.0.1:631 - Connection refused
	at org.apache.harmony.luni.net.PlainSocketImpl.connect(PlainSocketImpl.java:229)
	at org.apache.harmony.luni.net.PlainSocketImpl.connect(PlainSocketImpl.java:509)
	at java.net.Socket.connect(Socket.java:932)
	at org.apache.harmony.luni.internal.net.www.protocol.http.HttpURLConnection.getHTTPConnection(HttpURLConnection.java:635)
	at org.apache.harmony.luni.internal.net.www.protocol.http.HttpURLConnection.connect(HttpURLConnection.java:619)
	at org.apache.harmony.x.print.ipp.IppClient.request(IppClient.java:111)
	at org.apache.harmony.x.print.ipp.IppClient.request(IppClient.java:87)
	at org.apache.harmony.x.print.cups.CUPSPrintServiceProvider.findDefaultPrintService(CUPSPrintServiceProvider.java:471)
	at org.apache.harmony.x.print.cups.CUPSPrintServiceProvider.getDefaultPrintService(CUPSPrintServiceProvider.java:169)
	at javax.print.PrintServiceLookup.lookupDefaultPrintService(PrintServiceLookup.java:139)
	at javax.print.attribute.HashAttributeTest.testEquals(HashAttributeTest.java:284)
	at java.lang.reflect.VMReflection.invokeMethod(VMReflection.java)
	at java.lang.reflect.Method.invoke(Method.java:382)
	at junit.framework.TestCase.runTest(TestCase.java:154)
	at junit.framework.TestCase.runBare(TestCase.java:127)
	at junit.framework.TestResult$1.protect(TestResult.java:106)
	at junit.framework.TestResult.runProtected(TestResult.java:124)
	at junit.framework.TestResult.run(TestResult.java:109)
	at junit.framework.TestCase.run(TestCase.java:118)
	at junit.framework.TestSuite.runTest(TestSuite.java:208)
	at junit.framework.TestSuite.run(TestSuite.java:203)
	at junit.framework.TestSuite.runTest(TestSuite.java:208)
	at junit.framework.TestSuite.run(TestSuite.java:203)
	at org.apache.tools.ant.taskdefs.optional.junit.JUnitTestRunner.run(JUnitTestRunner.java:297)
	at org.apache.tools.ant.taskdefs.optional.junit.JUnitTestRunner.launch(JUnitTestRunner.java:672)
	at org.apache.tools.ant.taskdefs.optional.junit.JUnitTestRunner.main(JUnitTestRunner.java:546)
Compiling REGEX classes
Compiling REGEX tests
Since fork is false, ignoring memoryMaximumSize setting
Compiling RMI classes
Compiling RMI api tests
Since fork is false, ignoring memoryMaximumSize setting
Running RMI api tests
testDirectSocket_SingleVM starting
Test server started.
Object: MyRemoteObject[UnicastServerRef[endpoint:[[127.0.0.2:46624]](local), ObjID[65536, UID[fc:1122d7baf4e:-8000]]]] created and exported.
Apr 26, 2007 5:42:02 PM org.apache.harmony.rmi.server.RMIReference makeStrong
FINER: main: Strongly referenced RegistryImpl
Registry created.
Object bound in the registry.
Registry located.
Apr 26, 2007 5:42:03 PM org.apache.harmony.rmi.client.ClientConnection sendDGCAck
FINER: main: Sent DGC ack to [localhost:1099] for UID[fc:1122d7baf4e:-7ffd]
Lookup object is: Proxy[interf:[org.apache.harmony.rmi.test.MyRemoteInterface, java.rmi.Remote], RemoteObjectInvocationHandler[UnicastRef[endpoint:[[127.0.0.2:46624]](remote), ObjID[65536, UID[fc:1122d7baf4e:-8000]]]]]
Testing test_String_Void...
Done.
Testing test_Void_String...
Returned: MyRemoteObject.test_Void_String
Done.
Testing test_Int_Void...
Done.
Testing test_Void_Int...
Returned: 987654321
Done.
Testing test_Remote_Void...
Done.
Testing test_Remote_Void with remote object extending another remote object...
Done.
Testing test_Void_Remote...
Apr 26, 2007 5:42:04 PM org.apache.harmony.rmi.client.ClientConnection sendDGCAck
FINER: main: Sent DGC ack to [127.0.0.2:46624] for UID[fc:1122d7baf4e:-7fe8]
Returned: Proxy[interf:[org.apache.harmony.rmi.test.MyRemoteInterface2, java.rmi.Remote], RemoteObjectInvocationHandler[UnicastRef[endpoint:[[127.0.0.2:46632]](remote), ObjID[65539, UID[fc:1122d7baf4e:-7fe9]]]]]
Done.
Testing test_Long_Long...
Returned: 998877665544332211
Done.
Testing test_String_String...
Returned: MyRemoteObject.test_String_String
Done.
Testing test_Remote_Remote...
Apr 26, 2007 5:42:04 PM org.apache.harmony.rmi.client.ClientConnection sendDGCAck
FINER: main: Sent DGC ack to [127.0.0.2:46624] for UID[fc:1122d7baf4e:-7fde]
Returned: Proxy[interf:[org.apache.harmony.rmi.test.MyRemoteInterface2, java.rmi.Remote], RemoteObjectInvocationHandler[UnicastRef[endpoint:[[127.0.0.2:46636]](remote), ObjID[65541, UID[fc:1122d7baf4e:-7fdf]]]]]
Done.
Testing test_RemoteString_Void...
Done.
Testing test_RemoteRemote_Remote...
Apr 26, 2007 5:42:05 PM org.apache.harmony.rmi.client.ClientConnection sendDGCAck
FINER: main: Sent DGC ack to [127.0.0.2:46624] for UID[fc:1122d7baf4e:-7fd0]
Returned: Proxy[interf:[org.apache.harmony.rmi.test.MyRemoteInterface2, java.rmi.Remote], RemoteObjectInvocationHandler[UnicastRef[endpoint:[[127.0.0.2:46643]](remote), ObjID[65545, UID[fc:1122d7baf4e:-7fd1]]]]]
Done.
Testing test_BooleanStringRemote_Void...
Done.
Testing test_Proxy_Void...
Done.
Testing test_Array_Void...
Done.
Testing test_Void_Array...
Done.
Testing test_RemoteArray_Void...
Done.
Testing test_Void_RemoteArray...
Apr 26, 2007 5:42:05 PM org.apache.harmony.rmi.client.ClientConnection sendDGCAck
FINER: main: Sent DGC ack to [127.0.0.2:46624] for UID[fc:1122d7baf4e:-7fbd]
Done.
Testing test_Exception...
org.apache.harmony.rmi.test.MyException: MyRemoteObject.test_Exception
Done.
Testing test_Error...
java.rmi.ServerError: Error occurred while remote method invocation; nested exception is:
	java.lang.Error: MyRemoteObject.test_Error
Done.
Testing test_RuntimeException...
java.lang.RuntimeException: MyRemoteObject.text_RuntimeException
Done.
Testing test_RemoteException...
java.rmi.ServerException: RemoteException occurred while remote method invocation; nested exception is:
	java.rmi.RemoteException: MyRemoteObject.text_RemoteException
Done.
Test server complete.
Test server closing.
Unexporting MyRemoteObject[UnicastServerRef[endpoint:[[127.0.0.2:46624]](local), ObjID[65536, UID[fc:1122d7baf4e:-8000]]]] ...
Done.
Unexporting RegistryImpl ...
Done.
Unexporting MyRemoteObject1[UnicastServerRef[endpoint:[[127.0.0.2:46628]](local), ObjID[65537, UID[fc:1122d7baf4e:-7ff4]]]] ...
Done.
Unexporting MyRemoteObject4[UnicastServerRef[endpoint:[[127.0.0.2:46630]](local), ObjID[65538, UID[fc:1122d7baf4e:-7fef]]]] ...
Done.
Unexporting MyRemoteObject1[UnicastServerRef[endpoint:[[127.0.0.2:46634]](local), ObjID[65540, UID[fc:1122d7baf4e:-7fe3]]]] ...
Done.
Unexporting MyRemoteObject1[UnicastServerRef[endpoint:[[127.0.0.2:46637]](local), ObjID[65542, UID[fc:1122d7baf4e:-7fdd]]]] ...
Done.
Unexporting MyRemoteObject1[UnicastServerRef[endpoint:[[127.0.0.2:46639]](local), ObjID[65543, UID[fc:1122d7baf4e:-7fd8]]]] ...
Done.
Unexporting MyRemoteObject3[UnicastServerRef[endpoint:[[127.0.0.2:46640]](local), ObjID[65544, UID[fc:1122d7baf4e:-7fd7]]]] ...
testDirectHTTP_SingleVM starting
Test server started.
Object: MyRemoteObject[UnicastServerRef[endpoint:[[127.0.0.2:46652]](local), ObjID[65536, UID[fc:1122d7bd0bd:-8000]]]] created and exported.
Apr 26, 2007 5:42:11 PM org.apache.harmony.rmi.server.RMIReference makeStrong
FINER: main: Strongly referenced RegistryImpl
Registry created.
Object bound in the registry.
Registry located.
Apr 26, 2007 5:42:12 PM org.apache.harmony.rmi.client.ClientConnection sendDGCAck
FINER: main: Sent DGC ack to [localhost:1099] for UID[fc:1122d7bd0bd:-7ffd]
Lookup object is: Proxy[interf:[org.apache.harmony.rmi.test.MyRemoteInterface, java.rmi.Remote], RemoteObjectInvocationHandler[UnicastRef[endpoint:[[127.0.0.2:46652]](remote), ObjID[65536, UID[fc:1122d7bd0bd:-8000]]]]]
Testing test_String_Void...
Done.
Testing test_Void_String...
Returned: MyRemoteObject.test_Void_String
Done.
Testing test_Int_Void...
Done.
Testing test_Void_Int...
Returned: 987654321
Done.
Testing test_Remote_Void...
Done.
Testing test_Remote_Void with remote object extending another remote object...
Done.
Testing test_Void_Remote...
Apr 26, 2007 5:42:12 PM org.apache.harmony.rmi.client.ClientConnection sendDGCAck
FINER: main: Sent DGC ack to [127.0.0.2:46652] for UID[fc:1122d7bd0bd:-7fe8]
Returned: Proxy[interf:[org.apache.harmony.rmi.test.MyRemoteInterface2, java.rmi.Remote], RemoteObjectInvocationHandler[UnicastRef[endpoint:[[127.0.0.2:46660]](remote), ObjID[65539, UID[fc:1122d7bd0bd:-7fe9]]]]]
Done.
Testing test_Long_Long...
Returned: 998877665544332211
Done.
Testing test_String_String...
Returned: MyRemoteObject.test_String_String
Done.
Testing test_Remote_Remote...
Apr 26, 2007 5:42:13 PM org.apache.harmony.rmi.client.ClientConnection sendDGCAck
FINER: main: Sent DGC ack to [127.0.0.2:46652] for UID[fc:1122d7bd0bd:-7fde]
Returned: Proxy[interf:[org.apache.harmony.rmi.test.MyRemoteInterface2, java.rmi.Remote], RemoteObjectInvocationHandler[UnicastRef[endpoint:[[127.0.0.2:46664]](remote), ObjID[65541, UID[fc:1122d7bd0bd:-7fdf]]]]]
Done.
Testing test_RemoteString_Void...
Done.
Testing test_RemoteRemote_Remote...
Apr 26, 2007 5:42:13 PM org.apache.harmony.rmi.client.ClientConnection sendDGCAck
FINER: main: Sent DGC ack to [127.0.0.2:46652] for UID[fc:1122d7bd0bd:-7fd0]
Returned: Proxy[interf:[org.apache.harmony.rmi.test.MyRemoteInterface2, java.rmi.Remote], RemoteObjectInvocationHandler[UnicastRef[endpoint:[[127.0.0.2:46671]](remote), ObjID[65545, UID[fc:1122d7bd0bd:-7fd1]]]]]
Done.
Testing test_BooleanStringRemote_Void...
Done.
Testing test_Proxy_Void...
Done.
Testing test_Array_Void...
Done.
Testing test_Void_Array...
Done.
Testing test_RemoteArray_Void...
Done.
Testing test_Void_RemoteArray...
Apr 26, 2007 5:42:14 PM org.apache.harmony.rmi.client.ClientConnection sendDGCAck
FINER: main: Sent DGC ack to [127.0.0.2:46652] for UID[fc:1122d7bd0bd:-7fbd]
Done.
Testing test_Exception...
org.apache.harmony.rmi.test.MyException: MyRemoteObject.test_Exception
Done.
Testing test_Error...
java.rmi.ServerError: Error occurred while remote method invocation; nested exception is:
	java.lang.Error: MyRemoteObject.test_Error
Done.
Testing test_RuntimeException...
java.lang.RuntimeException: MyRemoteObject.text_RuntimeException
Done.
Testing test_RemoteException...
java.rmi.ServerException: RemoteException occurred while remote method invocation; nested exception is:
	java.rmi.RemoteException: MyRemoteObject.text_RemoteException
Done.
Test server complete.
Test server closing.
Unexporting MyRemoteObject[UnicastServerRef[endpoint:[[127.0.0.2:46652]](local), ObjID[65536, UID[fc:1122d7bd0bd:-8000]]]] ...
Done.
Unexporting RegistryImpl ...
Done.
Unexporting MyRemoteObject1[UnicastServerRef[endpoint:[[127.0.0.2:46656]](local), ObjID[65537, UID[fc:1122d7bd0bd:-7ff4]]]] ...
Done.
Unexporting MyRemoteObject4[UnicastServerRef[endpoint:[[127.0.0.2:46658]](local), ObjID[65538, UID[fc:1122d7bd0bd:-7fef]]]] ...
Done.
Unexporting MyRemoteObject1[UnicastServerRef[endpoint:[[127.0.0.2:46662]](local), ObjID[65540, UID[fc:1122d7bd0bd:-7fe3]]]] ...
Done.
Unexporting MyRemoteObject1[UnicastServerRef[endpoint:[[127.0.0.2:46665]](local), ObjID[65542, UID[fc:1122d7bd0bd:-7fdd]]]] ...
Done.
Unexporting MyRemoteObject1[UnicastServerRef[endpoint:[[127.0.0.2:46667]](local), ObjID[65543, UID[fc:1122d7bd0bd:-7fd8]]]] ...
Done.
Unexporting MyRemoteObject3[UnicastServerRef[endpoint:[[127.0.0.2:46668]](local), ObjID[65544, UID[fc:1122d7bd0bd:-7fd7]]]] ...
Done.
Unexporting MyRemoteObject1[UnicastServerRef[endpoint:[[127.0.0.2:46672]](local), ObjID[65546, UID[fc:1122d7bd0bd:-7fcf]]]] ...
Done.
Unexporting MyRemoteObject1[UnicastServerRef[endpoint:[[127.0.0.2:46674]](local), ObjID[65547, UID[fc:1122d7bd0bd:-7fc4]]]] ...
Done.
Unexporting MyRemoteObject1[UnicastServerRef[endpoint:[[127.0.0.2:46675]](local), ObjID[65548, UID[fc:1122d7bd0bd:-7fc3]]]] ...
Done.
Test server exiting.
Unexporting MyRemoteObject1[UnicastServerRef[endpoint:[[127.0.0.2:46680]](local), ObjID[65536, UID[94:1122d7bef6c:-7ff7]]]] ...
Done.
Unexporting MyRemoteObject1[UnicastServerRef[endpoint:[[127.0.0.2:46681]](local), ObjID[65537, UID[94:1122d7bef6c:-7ff6]]]] ...
Done.
Unexporting MyRemoteObject1[UnicastServerRef[endpoint:[[127.0.0.2:46682]](local), ObjID[65538, UID[94:1122d7bef6c:-7ff5]]]] ...
Done.
Unexporting MyRemoteObject1[UnicastServerRef[endpoint:[[127.0.0.2:46683]](local), ObjID[65539, UID[94:1122d7bef6c:-7ff4]]]] ...
Done.
Unexporting MyRemoteObject1[UnicastServerRef[endpoint:[[127.0.0.2:46684]](local), ObjID[65540, UID[94:1122d7bef6c:-7ff3]]]] ...
Done.
Unexporting MyRemoteObject1[UnicastServerRef[endpoint:[[127.0.0.2:46685]](local), ObjID[65541, UID[94:1122d7bef6c:-7ff2]]]] ...
Done.
Unexporting MyRemoteObject1[UnicastServerRef[endpoint:[[127.0.0.2:46686]](local), ObjID[65542, UID[94:1122d7bef6c:-7ff1]]]] ...
Done.
Unexporting MyRemoteObject1[UnicastServerRef[endpoint:[[127.0.0.2:46687]](local), ObjID[65543, UID[94:1122d7bef6c:-7ff0]]]] ...
Done.
LogStream[tst]:
Compiling SECURITY classes
Compiling SECURITY test support files
Since fork is false, ignoring memoryMaximumSize setting
Compiling SECURITY api tests
Since fork is false, ignoring memoryMaximumSize setting
Compiling SECURITY api injected tests
Since fork is false, ignoring memoryMaximumSize setting
Compiling SECURITY impl injected tests
Since fork is false, ignoring memoryMaximumSize setting
Compiling SECURITY impl tests
Since fork is false, ignoring memoryMaximumSize setting
Running SECURITY api tests
java: /export/cruise/trunk/cc/projects/drlvm/trunk/vm/jitrino/src/codegenerator/ia32/Ia32GCMap.cpp:137: void Jitrino::Ia32::checkManaged2UnmanagedConv(Jitrino::Ia32::IRManager&, Jitrino::Ia32::Opnd*, Jitrino::Ia32::Inst*): Assertion `0' failed.
SIGABRT in VM code.
Stack trace:
  0: raise (??:-1)
  1: abort (??:-1)
  2: new_do_write (??:-1)
  3: _IO_file_xsputn@@GLIBC_2.2.5 (??:-1)
  4: ?? (??:-1)
  5: ?? (??:-1)
  6: ?? (??:-1)
  7: free (??:-1)
  8: __assert_fail (??:-1)
  9: ?? (??:-1)
 10: ?? (??:-1)
 11: std::basic_ostream<char, std::char_traits<char> >& std::flush<char, std::char_traits<char> >(std::basic_ostream<char, std::char_traits<char> >&) (??:-1)
 12: checkManaged2UnmanagedConv (/export/cruise/trunk/cc/projects/drlvm/trunk/vm/jitrino/src/codegenerator/ia32/Ia32GCMap.cpp:121)
 13: Jitrino::Ia32::GCMap::registerGCSafePoint(Jitrino::Ia32::IRManager&, Jitrino::BitSet const&, Jitrino::Ia32::Inst*) (/export/cruise/trunk/cc/projects/drlvm/trunk/vm/jitrino/src/codegenerator/ia32/Ia32GCMap.cpp:174)
 14: __gnu_cxx::__normal_iterator<Jitrino::Ia32::Opnd* const*, std::vector<Jitrino::Ia32::Opnd*, Jitrino::StlMMAllocator<Jitrino::Ia32::Opnd*> > >::__normal_iterator(Jitrino::Ia32::Opnd* const* const&) (/usr/include/g++/bits/stl_iterator.h:593)
 15: ?? (0x387688
:-1)
 16: Jitrino::Tls::get(unsigned long) (/export/cruise/trunk/cc/projects/drlvm/trunk/vm/jitrino/src/shared/mkernel.cpp:139)
 17: ?? (??:-1)
 18: java/io/DataInputStream.decodeUTF(I)Ljava/lang/String; (DataInputStream.java:424)
 19: java/io/DataInputStream.readUTF()Ljava/lang/String; (DataInputStream.java:406)
 20: java/io/ObjectInputStream.readNewString(Z)Ljava/lang/Object; (ObjectInputStream.java:2062)
 21: java/io/ObjectInputStream.readNonPrimitiveContent(Z)Ljava/lang/Object; (ObjectInputStream.java:822)
 22: java/io/ObjectInputStream.readObject(Z)Ljava/lang/Object; (ObjectInputStream.java:2157)
 23: java/io/ObjectInputStream.readObject()Ljava/lang/Object; (ObjectInputStream.java:2112)
 24: java/io/ObjectInputStream.readFieldValues(Ljava/lang/Object;Ljava/io/ObjectStreamClass;)V (ObjectInputStream.java:1185)
 25: java/io/ObjectInputStream.defaultReadObject()V (ObjectInputStream.java:432)
 26: java/io/ObjectInputStream.readObjectForClass(Ljava/lang/Object;Ljava/io/ObjectStreamClass;)V (ObjectInputStream.java:1418)
 27: java/io/ObjectInputStream.readHierarchy(Ljava/lang/Object;Ljava/io/ObjectStreamClass;)V (ObjectInputStream.java:1327)
 28: java/io/ObjectInputStream.readNewObject(Z)Ljava/lang/Object; (ObjectInputStream.java:1990)
 29: java/io/ObjectInputStream.readNonPrimitiveContent(Z)Ljava/lang/Object; (ObjectInputStream.java:820)
 30: java/io/ObjectInputStream.readObject(Z)Ljava/lang/Object; (ObjectInputStream.java:2157)
 31: java/io/ObjectInputStream.readObject()Ljava/lang/Object; (ObjectInputStream.java:2112)
 32: java/io/ObjectInputStream.readNewArray(Z)Ljava/lang/Object; (ObjectInputStream.java:1563)
 33: java/io/ObjectInputStream.readNonPrimitiveContent(Z)Ljava/lang/Object; (ObjectInputStream.java:818)
 34: java/io/ObjectInputStream.readObject(Z)Ljava/lang/Object; (ObjectInputStream.java:2157)
 35: java/io/ObjectInputStream.readObject()Ljava/lang/Object; (ObjectInputStream.java:2112)
 36: java/io/ObjectInputStream.readFieldValues(Ljava/lang/Object;Ljava/io/ObjectStreamClass;)V (ObjectInputStream.java:1185)
 37: java/io/ObjectInputStream.defaultReadObject()V (ObjectInputStream.java:432)
 38: java/io/ObjectInputStream.readObjectForClass(Ljava/lang/Object;Ljava/io/ObjectStreamClass;)V (ObjectInputStream.java:1418)
 39: java/io/ObjectInputStream.readHierarchy(Ljava/lang/Object;Ljava/io/ObjectStreamClass;)V (ObjectInputStream.java:1327)
 40: java/io/ObjectInputStream.readNewObject(Z)Ljava/lang/Object; (ObjectInputStream.java:1990)
 41: java/io/ObjectInputStream.readNonPrimitiveContent(Z)Ljava/lang/Object; (ObjectInputStream.java:820)
 42: java/io/ObjectInputStream.readObject(Z)Ljava/lang/Object; (ObjectInputStream.java:2157)
 43: java/io/ObjectInputStream.readObject()Ljava/lang/Object; (ObjectInputStream.java:2112)
 44: java/io/ObjectInputStream.readFieldValues(Ljava/lang/Object;Ljava/io/ObjectStreamClass;)V (ObjectInputStream.java:1185)
 45: java/io/ObjectInputStream.defaultReadObject()V (ObjectInputStream.java:432)
 46: java/io/ObjectInputStream.readObjectForClass(Ljava/lang/Object;Ljava/io/ObjectStreamClass;)V (ObjectInputStream.java:1418)
 47: java/io/ObjectInputStream.readHierarchy(Ljava/lang/Object;Ljava/io/ObjectStreamClass;)V (ObjectInputStream.java:1327)
 48: java/io/ObjectInputStream.readNewObject(Z)Ljava/lang/Object; (ObjectInputStream.java:1990)
 49: java/io/ObjectInputStream.readNonPrimitiveContent(Z)Ljava/lang/Object; (ObjectInputStream.java:820)
 50: java/io/ObjectInputStream.readObject(Z)Ljava/lang/Object; (ObjectInputStream.java:2157)
 51: java/io/ObjectInputStream.readObject()Ljava/lang/Object; (ObjectInputStream.java:2112)
 52: java/io/ObjectInputStream.readFieldValues(Ljava/lang/Object;Ljava/io/ObjectStreamClass;)V (ObjectInputStream.java:1185)
 53: java/io/ObjectInputStream.defaultReadObject()V (ObjectInputStream.java:432)
 54: java/io/ObjectInputStream.readObjectForClass(Ljava/lang/Object;Ljava/io/ObjectStreamClass;)V (ObjectInputStream.java:1418)
 55: java/io/ObjectInputStream.readHierarchy(Ljava/lang/Object;Ljava/io/ObjectStreamClass;)V (ObjectInputStream.java:1327)
 56: java/io/ObjectInputStream.readNewObject(Z)Ljava/lang/Object; (ObjectInputStream.java:1990)
 57: java/io/ObjectInputStream.readNonPrimitiveContent(Z)Ljava/lang/Object; (ObjectInputStream.java:820)
 58: java/io/ObjectInputStream.readObject(Z)Ljava/lang/Object; (ObjectInputStream.java:2157)
 59: java/io/ObjectInputStream.readObject()Ljava/lang/Object; (ObjectInputStream.java:2112)
 60: org/apache/harmony/testframework/serialization/SerializationTest.getObjectFromStream(Ljava/io/InputStream;)Ljava/io/Serializable; (SerializationTest.java:208)
 61: org/apache/harmony/testframework/serialization/SerializationTest.copySerializable(Ljava/io/Serializable;)Ljava/io/Serializable; (SerializationTest.java:585)
 62: org/apache/harmony/testframework/serialization/SerializationTest.verifySelf(Ljava/lang/Object;Lorg/apache/harmony/testframework/serialization/SerializationTest$SerializableAssert;)V (SerializationTest.java:473)
 63: org/apache/harmony/testframework/serialization/SerializationTest.verifySelf([Ljava/lang/Object;Lorg/apache/harmony/testframework/serialization/SerializationTest$SerializableAssert;)V (SerializationTest.java:511)
 64: org/apache/harmony/testframework/serialization/SerializationTest.verifySelf([Ljava/lang/Object;)V (SerializationTest.java:490)
 65: org/apache/harmony/testframework/serialization/SerializationTest.testSelf()V (SerializationTest.java:135)
 66: java/lang/reflect/VMReflection.invokeMethod(JLjava/lang/Object;[Ljava/lang/Object;)Ljava/lang/Object; (VMReflection.java:-2)
 67: java/lang/reflect/Method.invoke(Ljava/lang/Object;[Ljava/lang/Object;)Ljava/lang/Object; (Method.java:382)
 68: junit/framework/TestCase.runTest()V (TestCase.java:154)
 69: junit/framework/TestCase.runBare()V (TestCase.java:127)
 70: org/apache/harmony/testframework/serialization/SerializationTest.runBare()V (SerializationTest.java:113)
 71: junit/framework/TestResult$1.protect()V (TestResult.java:106)
 72: junit/framework/TestResult.runProtected(Ljunit/framework/Test;Ljunit/framework/Protectable;)V (TestResult.java:124)
 73: junit/framework/TestResult.run(Ljunit/framework/TestCase;)V (TestResult.java:109)
 74: junit/framework/TestCase.run(Ljunit/framework/TestResult;)V (TestCase.java:118)
 75: junit/framework/TestSuite.runTest(Ljunit/framework/Test;Ljunit/framework/TestResult;)V (TestSuite.java:208)
 76: junit/framework/TestSuite.run(Ljunit/framework/TestResult;)V (TestSuite.java:203)
 77: org/apache/tools/ant/taskdefs/optional/junit/JUnitTestRunner.run()V (JUnitTestRunner.java:297)
 78: org/apache/tools/ant/taskdefs/optional/junit/JUnitTestRunner.launch(Lorg/apache/tools/ant/taskdefs/optional/junit/JUnitTest;ZZZZLjava/util/Properties;)I (JUnitTestRunner.java:672)
 79: org/apache/tools/ant/taskdefs/optional/junit/JUnitTestRunner.main([Ljava/lang/String;)V (JUnitTestRunner.java:546)
<end of stack trace>
Running SECURITY api.injected tests
Running SECURITY impl tests
java: /export/cruise/trunk/cc/projects/drlvm/trunk/vm/jitrino/src/codegenerator/ia32/Ia32GCMap.cpp:137: void Jitrino::Ia32::checkManaged2UnmanagedConv(Jitrino::Ia32::IRManager&, Jitrino::Ia32::Opnd*, Jitrino::Ia32::Inst*): Assertion `0' failed.
SIGABRT in VM code.
SIGSEGV in VM code.
Stack trace:
  0: native_is_frame_valid (/export/cruise/trunk/cc/projects/drlvm/trunk/vm/vmcore/src/util/em64t/base/native_stack_em64t.cpp:69)
  1: walk_native_stack_jit (/export/cruise/trunk/cc/projects/drlvm/trunk/vm/vmcore/src/util/native_stack.cpp:258)
  2: walk_native_stack_registers (/export/cruise/trunk/cc/projects/drlvm/trunk/vm/vmcore/src/util/native_stack.cpp:125)
  3: st_print_stack(Registers*) (/export/cruise/trunk/cc/projects/drlvm/trunk/vm/vmcore/src/stack/stack_dump.cpp:401)
  4: abort_handler(int, siginfo*, void*) (/export/cruise/trunk/cc/projects/drlvm/trunk/vm/vmcore/src/util/linux/signals_em64t.cpp:558)
  5: __restore_rt (??:-1)
  6: ?? (??:-1)
  7: com/ibm/icu/util/ULocale.getDefault()Lcom/ibm/icu/util/ULocale; (ULocale.java:872)
  8: com/ibm/icu/impl/ICUResourceBundle.instantiateBundle(Ljava/lang/String;Ljava/lang/String;Ljava/lang/ClassLoader;Z)Lcom/ibm/icu/util/UResourceBundle; (ICUResourceBundle.java:1149)
  9: com/ibm/icu/impl/ICUResourceBundle.getBundleInstance(Ljava/lang/String;Ljava/lang/String;Ljava/lang/ClassLoader;Z)Lcom/ibm/icu/util/UResourceBundle; (ICUResourceBundle.java:1140)
 10: com/ibm/icu/util/UResourceBundle.instantiateBundle(Ljava/lang/String;Ljava/lang/String;Ljava/lang/ClassLoader;Z)Lcom/ibm/icu/util/UResourceBundle; (UResourceBundle.java:498)
 11: com/ibm/icu/util/UResourceBundle.getBundleInstance(Ljava/lang/String;Ljava/lang/String;Ljava/lang/ClassLoader;Z)Lcom/ibm/icu/util/UResourceBundle; (UResourceBundle.java:127)
 12: com/ibm/icu/util/UResourceBundle.getBundleInstance(Ljava/lang/String;Ljava/lang/String;Ljava/lang/ClassLoader;)Lcom/ibm/icu/util/UResourceBundle; (UResourceBundle.java:108)
 13: com/ibm/icu/util/UResourceBundle.getBundleInstance(Ljava/lang/String;Lcom/ibm/icu/util/ULocale;)Lcom/ibm/icu/util/UResourceBundle; (UResourceBundle.java:195)
 14: com/ibm/icu/util/Currency.getName(Lcom/ibm/icu/util/ULocale;I[Z)Ljava/lang/String; (Currency.java:386)
 15: com/ibm/icu/text/DecimalFormatSymbols.initialize(Lcom/ibm/icu/util/ULocale;)V (DecimalFormatSymbols.java:608)
 16: com/ibm/icu/text/DecimalFormatSymbols.<init>(Ljava/util/Locale;)V (DecimalFormatSymbols.java:58)
 17: java/text/DecimalFormat.<init>(Ljava/lang/String;Ljava/text/DecimalFormatSymbols;)V (DecimalFormat.java:92)
 18: java/text/NumberFormat.getInstance(Ljava/util/Locale;Ljava/lang/String;)Ljava/text/NumberFormat; (NumberFormat.java:283)
 19: java/text/NumberFormat.getNumberInstance(Ljava/util/Locale;)Ljava/text/NumberFormat; (NumberFormat.java:348)
 20: java/text/NumberFormat.getInstance(Ljava/util/Locale;)Ljava/text/NumberFormat; (NumberFormat.java:279)
 21: java/text/SimpleDateFormat.<init>(Ljava/util/Locale;)V (SimpleDateFormat.java:128)
 22: java/text/SimpleDateFormat.<init>(Ljava/lang/String;Ljava/util/Locale;)V (SimpleDateFormat.java:121)
 23: java/text/SimpleDateFormat.<init>(Ljava/lang/String;)V (SimpleDateFormat.java:82)
 24: org/apache/harmony/security/asn1/ASN1UTCTime.setEncodingContent(Lorg/apache/harmony/security/asn1/BerOutputStream;)V (ASN1UTCTime.java:119)
 25: org/apache/harmony/security/asn1/DerOutputStream.<init>(Lorg/apache/harmony/security/asn1/ASN1Type;Ljava/lang/Object;)V (DerOutputStream.java:40)
 26: org/apache/harmony/security/tests/asn1/der/DerUTCTimeEDTest.runTest(Z)V (DerUTCTimeEDTest.java:112)
 27: org/apache/harmony/security/tests/asn1/der/DerUTCTimeEDTest.testUTCEncoderDecoder01()V (DerUTCTimeEDTest.java:82)
 28: org/apache/harmony/security/tests/asn1/der/DerUTCTimeEDTest$TestWorker.run()V (DerUTCTimeEDTest.java:151)
 29: java/lang/Thread.runImpl()V (Thread.java:672)
<end of stack trace>
Running SECURITY impl injected tests
Compiling SOUND classes
Compiling SOUND tests
Since fork is false, ignoring memoryMaximumSize setting
Compiling SQL classes
Compiling SQL tests
Since fork is false, ignoring memoryMaximumSize setting
Compiling Sun Compat classes
Compiling SUNCOMPAT tests
Compiling TEXT classes
Compiling TEXT tests
Since fork is false, ignoring memoryMaximumSize setting
java: /export/cruise/trunk/cc/projects/drlvm/trunk/vm/jitrino/src/codegenerator/ia32/Ia32GCMap.cpp:137: void Jitrino::Ia32::checkManaged2UnmanagedConv(Jitrino::Ia32::IRManager&, Jitrino::Ia32::Opnd*, Jitrino::Ia32::Inst*): Assertion `0' failed.
SIGABRT in VM code.
Stack trace:
  0: raise (??:-1)
  1: abort (??:-1)
  2: new_do_write (??:-1)
  3: _IO_file_xsputn@@GLIBC_2.2.5 (??:-1)
  4: ?? (??:-1)
  5: ?? (??:-1)
  6: ?? (??:-1)
  7: free (??:-1)
  8: __assert_fail (??:-1)
  9: ?? (??:-1)
 10: ?? (??:-1)
 11: std::basic_ostream<char, std::char_traits<char> >& std::flush<char, std::char_traits<char> >(std::basic_ostream<char, std::char_traits<char> >&) (??:-1)
 12: checkManaged2UnmanagedConv (/export/cruise/trunk/cc/projects/drlvm/trunk/vm/jitrino/src/codegenerator/ia32/Ia32GCMap.cpp:121)
 13: Jitrino::Ia32::GCMap::registerGCSafePoint(Jitrino::Ia32::IRManager&, Jitrino::BitSet const&, Jitrino::Ia32::Inst*) (/export/cruise/trunk/cc/projects/drlvm/trunk/vm/jitrino/src/codegenerator/ia32/Ia32GCMap.cpp:174)
 14: __gnu_cxx::__normal_iterator<Jitrino::Ia32::Opnd* const*, std::vector<Jitrino::Ia32::Opnd*, Jitrino::StlMMAllocator<Jitrino::Ia32::Opnd*> > >::__normal_iterator(Jitrino::Ia32::Opnd* const* const&) (/usr/include/g++/bits/stl_iterator.h:593)
 15: ?? (0x387688
:-1)
 16: Jitrino::Tls::get(unsigned long) (/export/cruise/trunk/cc/projects/drlvm/trunk/vm/jitrino/src/shared/mkernel.cpp:139)
 17: ?? (??:-1)
 18: com/ibm/icu/util/ULocale.getDefault()Lcom/ibm/icu/util/ULocale; (ULocale.java:872)
 19: com/ibm/icu/impl/ICUResourceBundle.instantiateBundle(Ljava/lang/String;Ljava/lang/String;Ljava/lang/ClassLoader;Z)Lcom/ibm/icu/util/UResourceBundle; (ICUResourceBundle.java:1165)
 20: com/ibm/icu/impl/ICUResourceBundle.getBundleInstance(Ljava/lang/String;Ljava/lang/String;Ljava/lang/ClassLoader;Z)Lcom/ibm/icu/util/UResourceBundle; (ICUResourceBundle.java:1140)
 21: com/ibm/icu/util/UResourceBundle.instantiateBundle(Ljava/lang/String;Ljava/lang/String;Ljava/lang/ClassLoader;Z)Lcom/ibm/icu/util/UResourceBundle; (UResourceBundle.java:498)
 22: com/ibm/icu/util/UResourceBundle.getBundleInstance(Ljava/lang/String;Ljava/lang/String;Ljava/lang/ClassLoader;Z)Lcom/ibm/icu/util/UResourceBundle; (UResourceBundle.java:127)
 23: com/ibm/icu/util/UResourceBundle.getBundleInstance(Ljava/lang/String;Ljava/lang/String;Ljava/lang/ClassLoader;)Lcom/ibm/icu/util/UResourceBundle; (UResourceBundle.java:108)
 24: com/ibm/icu/util/UResourceBundle.getBundleInstance(Ljava/lang/String;Lcom/ibm/icu/util/ULocale;)Lcom/ibm/icu/util/UResourceBundle; (UResourceBundle.java:195)
 25: com/ibm/icu/util/Currency.getName(Lcom/ibm/icu/util/ULocale;I[Z)Ljava/lang/String; (Currency.java:386)
 26: com/ibm/icu/util/Currency.getSymbol(Lcom/ibm/icu/util/ULocale;)Ljava/lang/String; (Currency.java:323)
 27: com/ibm/icu/util/Currency.getSymbol(Ljava/util/Locale;)Ljava/lang/String; (Currency.java:311)
 28: com/ibm/icu/text/DecimalFormatSymbols.setCurrency(Lcom/ibm/icu/util/Currency;)V (DecimalFormatSymbols.java:358)
 29: java/text/DecimalFormat.copySymbols(Lcom/ibm/icu/text/DecimalFormatSymbols;Ljava/text/DecimalFormatSymbols;)V (DecimalFormat.java:843)
 30: java/text/DecimalFormat.<init>(Ljava/lang/String;Ljava/text/DecimalFormatSymbols;)V (DecimalFormat.java:93)
 31: java/text/NumberFormat.getInstance(Ljava/util/Locale;Ljava/lang/String;)Ljava/text/NumberFormat; (NumberFormat.java:283)
 32: java/text/NumberFormat.getCurrencyInstance(Ljava/util/Locale;)Ljava/text/NumberFormat; (NumberFormat.java:233)
 33: org/apache/harmony/text/tests/java/text/DecimalFormatSymbolsTest.test_setCurrencyLjava_util_Currency()V (DecimalFormatSymbolsTest.java:230)
 34: java/lang/reflect/VMReflection.invokeMethod(JLjava/lang/Object;[Ljava/lang/Object;)Ljava/lang/Object; (VMReflection.java:-2)
 35: java/lang/reflect/Method.invoke(Ljava/lang/Object;[Ljava/lang/Object;)Ljava/lang/Object; (Method.java:382)
 36: junit/framework/TestCase.runTest()V (TestCase.java:154)
 37: junit/framework/TestCase.runBare()V (TestCase.java:127)
 38: junit/framework/TestResult$1.protect()V (TestResult.java:106)
 39: junit/framework/TestResult.runProtected(Ljunit/framework/Test;Ljunit/framework/Protectable;)V (TestResult.java:124)
 40: junit/framework/TestResult.run(Ljunit/framework/TestCase;)V (TestResult.java:109)
 41: junit/framework/TestCase.run(Ljunit/framework/TestResult;)V (TestCase.java:118)
 42: junit/framework/TestSuite.runTest(Ljunit/framework/Test;Ljunit/framework/TestResult;)V (TestSuite.java:208)
 43: junit/framework/TestSuite.run(Ljunit/framework/TestResult;)V (TestSuite.java:203)
 44: org/apache/tools/ant/taskdefs/optional/junit/JUnitTestRunner.run()V (JUnitTestRunner.java:297)
 45: org/apache/tools/ant/taskdefs/optional/junit/JUnitTestRunner.launch(Lorg/apache/tools/ant/taskdefs/optional/junit/JUnitTest;ZZZZLjava/util/Properties;)I (JUnitTestRunner.java:672)
 46: org/apache/tools/ant/taskdefs/optional/junit/JUnitTestRunner.main([Ljava/lang/String;)V (JUnitTestRunner.java:546)
<end of stack trace>
Compiling TOOLS classes
Compiling Tools tests
Since fork is false, ignoring memoryMaximumSize setting
Compiling X-NET classes
Compiling X-NET test support files
Compiling X-NET api tests
Since fork is false, ignoring memoryMaximumSize setting
Compiling X-NET impl injected tests
Since fork is false, ignoring memoryMaximumSize setting
Compiling X-NET impl tests
Since fork is false, ignoring memoryMaximumSize setting
Running X-NET api tests
Running X-NET impl tests
Running X-NET impl injected tests
The test report is in /export/cruise/trunk/cc/projects/classlib/trunk/build/test_report/html/index.html

***********************************************************
Unit Tests: (12733)
        
error: org.apache.harmony.jndi.tests.javax.naming.ldap.extras.TestRdnParser vmcrash.CrashedTests
error: org.apache.harmony.luni.tests.java.lang.String2Test vmcrash.CrashedTests
error: org.apache.harmony.security.tests.asn1.der.DerUTCTimeEDTest vmcrash.CrashedTests
error: org.apache.harmony.security.tests.java.security.serialization.InvalidKeyExceptionTest vmcrash.CrashedTests
error: org.apache.harmony.text.tests.java.text.DecimalFormatSymbolsTest vmcrash.CrashedTests
Unit Test Error Details:	(5)
                
Test: org.apache.harmony.jndi.tests.javax.naming.ldap.extras.TestRdnParserClass: vmcrash.CrashedTests
Test: org.apache.harmony.luni.tests.java.lang.String2TestClass: vmcrash.CrashedTests
Test: org.apache.harmony.security.tests.asn1.der.DerUTCTimeEDTestClass: vmcrash.CrashedTests
Test: org.apache.harmony.security.tests.java.security.serialization.InvalidKeyExceptionTestClass: vmcrash.CrashedTests
Test: org.apache.harmony.text.tests.java.text.DecimalFormatSymbolsTestClass: vmcrash.CrashedTests

***********************************************************
Modifications since last successful build:	(33)
            
add cc-drlvm log20070426171435Lbuild.630 04/26/2007 17:14:35drlvm
add cc-classlib log20070426171048Lbuild.468 04/26/2007 17:10:48classlib
modified varlax  /harmony/enhanced/drlvm/trunk/build/make/build.xml 04/26/2007 17:03:39 Added echoing of host Java version
modified pyang  /harmony/enhanced/classlib/trunk/modules/luni/src/main/java/org/apache/harmony/luni/util/Util.java 04/26/2007 16:43:49 Apply patch for HARMONY-3656([classlib][luni] File.mkdir does not support unicode)
modified pyang  /harmony/enhanced/classlib/trunk/modules/luni/src/main/java/java/io/File.java 04/26/2007 16:43:49 Apply patch for HARMONY-3656([classlib][luni] File.mkdir does not support unicode)
modified pyang  /harmony/enhanced/classlib/trunk/modules/portlib/src/main/native/port/windows/hyfile.c 04/26/2007 16:43:49 Apply patch for HARMONY-3656([classlib][luni] File.mkdir does not support unicode)
modified pyang  /harmony/enhanced/classlib/trunk/modules/luni/src/test/java/tests/api/java/io/FileTest.java 04/26/2007 16:43:49 Apply patch for HARMONY-3656([classlib][luni] File.mkdir does not support unicode)
modified pyang  /harmony/enhanced/classlib/trunk/modules/portlib/src/main/native/port/shared/hystr.c 04/26/2007 16:30:01 Apply patch for HARMONY-654([classlib][portlib] hytty_printf(%d, -1) outputs 01)
added pyang  /harmony/enhanced/classlib/trunk/modules/portlib/src/test/native/hycunit 04/26/2007 16:27:43 Apply patch for HARMONY-3749([classlib][portlib] Add Hycunit for native C unit test)
added pyang  /harmony/enhanced/classlib/trunk/modules/portlib/src/test/native/hycunit/hycunit.c 04/26/2007 16:27:43 Apply patch for HARMONY-3749([classlib][portlib] Add Hycunit for native C unit test)
added pyang  /harmony/enhanced/classlib/trunk/modules/portlib/src/test/native/hycunit/hycunit.h 04/26/2007 16:27:43 Apply patch for HARMONY-3749([classlib][portlib] Add Hycunit for native C unit test)
added varlax  /harmony/enhanced/drlvm/trunk/src/test/regression/H3751/Test.java 04/26/2007 16:04:51 Applied HARMONY-3751 [drlvm][jit][opt] GCMap verification routine fails with assertion on write to vmmagic Address fields
added varlax  /harmony/enhanced/drlvm/trunk/src/test/regression/H3751 04/26/2007 16:04:51 Applied HARMONY-3751 [drlvm][jit][opt] GCMap verification routine fails with assertion on write to vmmagic Address fields
modified varlax  /harmony/enhanced/drlvm/trunk/vm/jitrino/src/codegenerator/ia32/Ia32GCMap.cpp 04/26/2007 16:04:51 Applied HARMONY-3751 [drlvm][jit][opt] GCMap verification routine fails with assertion on write to vmmagic Address fields
added varlax  /harmony/enhanced/drlvm/trunk/src/test/regression/H3751/run.test.xml 04/26/2007 16:04:51 Applied HARMONY-3751 [drlvm][jit][opt] GCMap verification routine fails with assertion on write to vmmagic Address fields
modified varlax  /harmony/enhanced/drlvm/trunk/vm/vmcore/src/class_support/Class_File_Loader.cpp 04/26/2007 16:04:51 Applied HARMONY-3751 [drlvm][jit][opt] GCMap verification routine fails with assertion on write to vmmagic Address fields
modified varlax  /harmony/enhanced/drlvm/trunk/vm/vmcore/include/class_member.h 04/26/2007 16:04:51 Applied HARMONY-3751 [drlvm][jit][opt] GCMap verification routine fails with assertion on write to vmmagic Address fields
added varlax  /harmony/enhanced/drlvm/trunk/src/test/regression/H3738/Test.java 04/26/2007 16:01:25 Applied HARMONY-3738 [drlvm][jit][vmmagic] I8Lowerer does not eliminate all I8PseudoInsts when address arithmetic with vmmagics is used.
added varlax  /harmony/enhanced/drlvm/trunk/src/test/regression/H3738 04/26/2007 16:01:25 Applied HARMONY-3738 [drlvm][jit][vmmagic] I8Lowerer does not eliminate all I8PseudoInsts when address arithmetic with vmmagics is used.
added varlax  /harmony/enhanced/drlvm/trunk/src/test/regression/H3738/run.test.xml 04/26/2007 16:01:25 Applied HARMONY-3738 [drlvm][jit][vmmagic] I8Lowerer does not eliminate all I8PseudoInsts when address arithmetic with vmmagics is used.
modified varlax  /harmony/enhanced/drlvm/trunk/vm/jitrino/src/codegenerator/ia32/Ia32I8Lowerer.cpp 04/26/2007 16:01:25 Applied HARMONY-3738 [drlvm][jit][vmmagic] I8Lowerer does not eliminate all I8PseudoInsts when address arithmetic with vmmagics is used.
added varlax  /harmony/enhanced/drlvm/trunk/build/make/excludes/exclude.drlvm_smoke.linux.ia64.jit 04/26/2007 15:52:56 x-lists for ia64 updated
added varlax  /harmony/enhanced/drlvm/trunk/build/make/excludes/exclude.drlvm_kernel.linux.ia64.jit 04/26/2007 15:52:56 x-lists for ia64 updated
modified varlax  /harmony/enhanced/drlvm/trunk/build/make/excludes/exclude.drlvm_smoke.linux.ia64.int 04/26/2007 15:52:56 x-lists for ia64 updated
added varlax  /harmony/enhanced/drlvm/trunk/build/make/excludes/exclude.drlvm_kernel.linux.ia64.int 04/26/2007 15:52:56 x-lists for ia64 updated
deleted varlax  /harmony/enhanced/drlvm/trunk/build/make/excludes/exclude.drlvm_smoke.linux.ia64.jet 04/26/2007 15:52:56 x-lists for ia64 updated
deleted varlax  /harmony/enhanced/drlvm/trunk/build/make/excludes/exclude.drlvm_smoke.linux.ia64.opt 04/26/2007 15:52:56 x-lists for ia64 updated
modified varlax  /harmony/enhanced/drlvm/trunk/build/make/targets/test.xml 04/26/2007 15:52:56 x-lists for ia64 updated
modified pyang  /harmony/enhanced/classlib/trunk/modules/tools/src/main/java/com/sun/tools/javac/Main.java 04/26/2007 15:23:40 Apply patch for HARMONY-3685([classlib][tools] missing method of com.sun.tools.javac.Main.compile([Ljava.lang.String;, java.io.PrintWriter))
modified pyang  /harmony/enhanced/classlib/trunk/modules/tools/src/main/java/org/apache/harmony/tools/javac/Main.java 04/26/2007 15:23:40 Apply patch for HARMONY-3685([classlib][tools] missing method of com.sun.tools.javac.Main.compile([Ljava.lang.String;, java.io.PrintWriter))
added pyang  /harmony/enhanced/classlib/trunk/modules/tools/src/main/java/org/apache/harmony/tools/toolutils/Util.java 04/26/2007 15:23:40 Apply patch for HARMONY-3685([classlib][tools] missing method of com.sun.tools.javac.Main.compile([Ljava.lang.String;, java.io.PrintWriter))
modified pyang  /harmony/enhanced/classlib/trunk/modules/tools/src/main/java/org/apache/harmony/tools/javac/Compiler.java 04/26/2007 15:23:40 Apply patch for HARMONY-3685([classlib][tools] missing method of com.sun.tools.javac.Main.compile([Ljava.lang.String;, java.io.PrintWriter))
modified pyang  /harmony/enhanced/classlib/trunk/modules/tools/src/test/java/org/apache/harmony/tests/tools/javac/MainTest.java 04/26/2007 15:23:40 Apply patch for HARMONY-3685([classlib][tools] missing method of com.sun.tools.javac.Main.compile([Ljava.lang.String;, java.io.PrintWriter))

Mime
View raw message