harmony-alerts mailing list archives

Site index · List index
Message view « Date » · « Thread »
Top « Date » · « Thread »
From nbe...@kc.rr.com
Subject [build-test alert] BUILD FAILED Linux i386 gcc debug: classlib tests run
Date Thu, 26 Apr 2007 04:13:21 GMT
BUILD FAILED:
	Ant Error Message:
/home/nathan/harmony/buildtest/cc/projects/classlib/trunk/build.xml:169: The following error
occurred while executing this line: /home/nathan/harmony/buildtest/cc/projects/classlib/trunk/make/build-test.xml:148:
There were test failures.

Date of build:	04/25/2007 22:23:40
Time to build:	49 minutes 16 seconds
Last changed:	04/25/2007 15:53:14
Last log entry:	Adding icu libraries for macosx/ppc32.


***********************************************************
Execution log (errors/warnings messages):	
Tests FAILED
Tests FAILED
Tests FAILED
Tests FAILED
Tests FAILED
Test org.apache.harmony.awt.HeadlessTest FAILED
Tests FAILED
Tests FAILED
Tests FAILED
Tests FAILED
Tests FAILED
Test org.apache.harmony.crypto.internal.NullCipherSpiTest FAILED
Tests FAILED
Tests FAILED
Test org.apache.harmony.jndi.tests.javax.naming.spi.NamingManagerTest FAILED
Test org.apache.harmony.jndi.tests.javax.naming.spi.NamingManagerBuilderTest FAILED
Test org.apache.harmony.jndi.tests.javax.naming.spi.DirectoryManagerTest FAILED
Tests FAILED
Test org.apache.harmony.lang.management.OperatingSystemMXBeanImplTest FAILED
Tests FAILED
Tests FAILED
Tests FAILED
Test org.apache.harmony.misc.tests.accessors.StringAccessorTest FAILED
Tests FAILED
Tests FAILED
Tests FAILED
Tests FAILED
Tests FAILED
Tests FAILED
Tests FAILED
Tests FAILED
Tests FAILED
Tests FAILED
Tests FAILED
Tests FAILED
Tests FAILED
Tests FAILED
Tests FAILED
Tests FAILED
Tests FAILED
Tests FAILED
Tests FAILED

========================================
Testing class libraries...
========================================
Checking for depends/jars/yoko_M2-20070130/yoko.jar
Checking for depends/jars/yoko_M2-20070130/yoko-core.jar
Checking for depends/jars/yoko_M2-20070130/yoko-rmi-impl.jar
Checking for depends/jars/yoko_M2-20070130/yoko-rmi-spec.jar
Checking for depends/jars/bcel-5.2/bcel-5.2.jar
Checking for depends/jars/xalan-j_2.7.0/xalan.jar
Checking for depends/jars/xerces_2.9.0/xerces.zip
Checking for depends/jars/junit_3.8.2/junit.jar
Checking for depends/jars/bcprov-jdk15-134/bcprov.jar
Checking for depends/jars/icu4j_3.4.4/icu4j_3_4_4.jar
Checking for depends/jars/mx4j_3.0.2/mx4j.zip
Checking for depends/jars/ecj_3.2/ecj_3.2.jar
Checking for depends/jars/jetty/jetty-6.0.0.jar
Checking for depends/jars/jetty/jetty-util-6.0.0.jar
Checking for depends/jars/jetty/servlet-api-2.5-6.0.0.jar
Checking for depends/libs/build/lcms/icc34.h
Checking for depends/libs/build/lcms/lcms.h
Checking for depends/libs/build/png/pngconf.h
Checking for depends/libs/build/png/png.h
Checking for depends/libs/build/jpeg/jconfig.lnx
Checking for depends/libs/build/jpeg/jpeglib.h
Checking for depends/libs/build/jpeg/jmorecfg.h
Checking for depends/libs/build/jpeg/jerror.h
Checking for depends/libs/build/lcms/liblcms.linux.x86
Checking for depends/libs/build/png/libpng.linux.x86
Checking for depends/libs/build/jpeg/libjpeg.linux.x86
hy.test.vm.name = ibm
Compiling ACCESSIBILITY classes
Compiling ACCESSIBILITY tests
Since fork is false, ignoring memoryMaximumSize setting
Compiling ANNOTATION classes
Compiling ANNOTATION tests
Since fork is false, ignoring memoryMaximumSize setting
----------
1. WARNING in /home/nathan/harmony/buildtest/cc/projects/classlib/trunk/modules/annotation/src/test/java/org/apache/harmony/annotation/tests/java/lang/annotation/IncompleteAnnotationExceptionTest.java
 (at line 53)
	clazz, elementName);
	^^^^^
Type safety: The expression of type Class needs unchecked conversion to conform to Class<?
extends Annotation>
----------
1 problem (1 warning)
Compiling APPLET classes
Compiling APPLET tests
Since fork is false, ignoring memoryMaximumSize setting
Compiling ARCHIVE classes
Compiling ARCHIVE tests
Since fork is false, ignoring memoryMaximumSize setting
Compiling AUTH classes
Compiling AUTH tests
Since fork is false, ignoring memoryMaximumSize setting
Compiling AWT classes
Compiling AWT tests
Since fork is false, ignoring memoryMaximumSize setting
Compiling BEANS classes
Compiling support classes for BEANS tests
Since fork is false, ignoring memoryMaximumSize setting
Compiling internal BEANS tests
Since fork is false, ignoring memoryMaximumSize setting
Compiling BEANS tests
Since fork is false, ignoring memoryMaximumSize setting
Running internal BEANS tests
Running BEANS tests
Compiling CRYPTO classes
Compiling CRYPTO test support files
Since fork is false, ignoring memoryMaximumSize setting
Compiling CRYPTO api tests
Since fork is false, ignoring memoryMaximumSize setting
Compiling CRYPTO api injected tests
Since fork is false, ignoring memoryMaximumSize setting
Compiling CRYPTO impl injected tests
Since fork is false, ignoring memoryMaximumSize setting
Compiling CRYPTO impl tests
Since fork is false, ignoring memoryMaximumSize setting
Running CRYPTO api tests
Running CRYPTO api.injected tests
Running CRYPTO impl tests
Running CRYPTO impl injected tests
Compiling ImageIO classes
Compiling ImageIO tests
Since fork is false, ignoring memoryMaximumSize setting
Compiling INSTRUMENT classes
Compiling INSTRUMENT tests
Since fork is false, ignoring memoryMaximumSize setting
Compiling JNDI classes
Compiling JNDI tests
Since fork is false, ignoring memoryMaximumSize setting
Compiling LANG-MANAGEMENT classes
Compiling LANG-MANAGEMENT API tests
Since fork is false, ignoring memoryMaximumSize setting
Compiling LANG-MANAGEMENT Implementation tests
Since fork is false, ignoring memoryMaximumSize setting
Compiling LOGGING classes
Compiling LOGGING tests
Since fork is false, ignoring memoryMaximumSize setting
Since fork is false, ignoring memoryMaximumSize setting
Compiling LUNI classes
Compiling LUNI JUnit Tests
Since fork is false, ignoring memoryMaximumSize setting
Running LUNI JUnit Tests
Compiling MATH classes
Compiling MATH tests
Since fork is false, ignoring memoryMaximumSize setting
Compiling MISC classes
Compiling MISC tests
Since fork is false, ignoring memoryMaximumSize setting
Compiling NIO classes
Compiling NIO tests
Since fork is false, ignoring memoryMaximumSize setting
Compiling NIO_CHAR classes
Compiling NIO_CHAR tests
Since fork is false, ignoring memoryMaximumSize setting
Compiling PACK200 classes
Compiling PACK200 tests
Since fork is false, ignoring memoryMaximumSize setting
Running PACK200 tests
init: passed
hyerror: passed
hytime: passed
hyfile: passed
Compiling PREFS classes
Compiling PREFS tests
Since fork is false, ignoring memoryMaximumSize setting
Compiling PRINT classes
Compiling Print tests
Since fork is false, ignoring memoryMaximumSize setting
Compiling REGEX classes
Compiling REGEX tests
Since fork is false, ignoring memoryMaximumSize setting
Compiling RMI classes
Compiling RMI api tests
Since fork is false, ignoring memoryMaximumSize setting
Running RMI api tests
Compiling SECURITY classes
Compiling SECURITY test support files
Since fork is false, ignoring memoryMaximumSize setting
Compiling SECURITY api tests
Since fork is false, ignoring memoryMaximumSize setting
Compiling SECURITY api injected tests
Since fork is false, ignoring memoryMaximumSize setting
Compiling SECURITY impl injected tests
Since fork is false, ignoring memoryMaximumSize setting
Compiling SECURITY impl tests
Since fork is false, ignoring memoryMaximumSize setting
Running SECURITY api tests
Running SECURITY api.injected tests
Running SECURITY impl tests
Running SECURITY impl injected tests
Compiling SOUND classes
Compiling SOUND tests
Since fork is false, ignoring memoryMaximumSize setting
Compiling SQL classes
Compiling SQL tests
Since fork is false, ignoring memoryMaximumSize setting
Compiling Sun Compat classes
Compiling SUNCOMPAT tests
Compiling SWING classes
Compiling SWING tests
Since fork is false, ignoring memoryMaximumSize setting
Compiling TEXT classes
Compiling TEXT tests
Since fork is false, ignoring memoryMaximumSize setting
Compiling TOOLS classes
Compiling Tools tests
Since fork is false, ignoring memoryMaximumSize setting
Compiling X-NET classes
Compiling X-NET test support files
Since fork is false, ignoring memoryMaximumSize setting
Compiling X-NET api tests
Since fork is false, ignoring memoryMaximumSize setting
Compiling X-NET impl injected tests
Since fork is false, ignoring memoryMaximumSize setting
Compiling X-NET impl tests
Since fork is false, ignoring memoryMaximumSize setting
Running X-NET api tests
Running X-NET impl tests
Running X-NET impl injected tests
The test report is in /home/nathan/harmony/buildtest/cc/projects/classlib/trunk/build/test_report/html/index.html

***********************************************************
Unit Tests: (4)
        

***********************************************************
Modifications since last successful build:	(103)
            
added hindessm  /harmony/enhanced/classlib/trunk/depends/libs/macosx.ppc32/libicuuc.dylib.34
04/25/2007 15:53:14 Adding icu libraries for macosx/ppc32.
added hindessm  /harmony/enhanced/classlib/trunk/depends/libs/macosx.ppc32/libicudata.dylib.34
04/25/2007 15:53:14 Adding icu libraries for macosx/ppc32.
added hindessm  /harmony/enhanced/classlib/trunk/depends/libs/macosx.ppc32/libicui18n.dylib.34
04/25/2007 15:53:14 Adding icu libraries for macosx/ppc32.
added hindessm  /harmony/enhanced/classlib/trunk/depends/libs/macosx.ppc32 04/25/2007 15:53:14
Adding icu libraries for macosx/ppc32.
added hindessm  /harmony/enhanced/classlib/trunk/depends/libs/macosx.ppc32/libICUInterface34.dylib
04/25/2007 15:53:14 Adding icu libraries for macosx/ppc32.
modified hindessm  /harmony/enhanced/classlib/trunk/modules/awt/src/main/native/jpegdecoder
04/25/2007 15:43:24 Adding ignores for new OS/X dylib files.
modified hindessm  /harmony/enhanced/classlib/trunk/modules/text/src/main/native/text 04/25/2007
15:43:24 Adding ignores for new OS/X dylib files.
modified hindessm  /harmony/enhanced/classlib/trunk/modules/nio/src/main/native/nio 04/25/2007
15:43:24 Adding ignores for new OS/X dylib files.
modified hindessm  /harmony/enhanced/classlib/trunk/modules/awt/src/main/native/oglwrapper
04/25/2007 15:43:24 Adding ignores for new OS/X dylib files.
modified hindessm  /harmony/enhanced/classlib/trunk/modules/luni/src/main/native/luni 04/25/2007
15:43:24 Adding ignores for new OS/X dylib files.
modified hindessm  /harmony/enhanced/classlib/trunk/modules/instrument/src/main/native/instrument
04/25/2007 15:43:24 Adding ignores for new OS/X dylib files.
modified hindessm  /harmony/enhanced/classlib/trunk/modules/misc/src/main/native/accessors
04/25/2007 15:43:24 Adding ignores for new OS/X dylib files.
modified hindessm  /harmony/enhanced/classlib/trunk/modules/archive/src/main/native/zlib 04/25/2007
15:43:24 Adding ignores for new OS/X dylib files.
modified hindessm  /harmony/enhanced/classlib/trunk/modules/awt/src/main/native/linuxfont
04/25/2007 15:43:24 Adding ignores for new OS/X dylib files.
modified hindessm  /harmony/enhanced/classlib/trunk/modules/portlib/src/main/native/thread
04/25/2007 15:43:24 Adding ignores for new OS/X dylib files.
modified hindessm  /harmony/enhanced/classlib/trunk/modules/awt/src/main/native/lcmm 04/25/2007
15:43:24 Adding ignores for new OS/X dylib files.
modified hindessm  /harmony/enhanced/classlib/trunk/modules/portlib/src/main/native/sig 04/25/2007
15:43:24 Adding ignores for new OS/X dylib files.
modified hindessm  /harmony/enhanced/classlib/trunk/modules/awt/src/main/native/gl 04/25/2007
15:43:24 Adding ignores for new OS/X dylib files.
modified hindessm  /harmony/enhanced/classlib/trunk/modules/imageio/src/main/native/pngencoder
04/25/2007 15:43:24 Adding ignores for new OS/X dylib files.
modified hindessm  /harmony/enhanced/classlib/trunk/modules/portlib/src/main/native/port 04/25/2007
15:43:24 Adding ignores for new OS/X dylib files.
modified hindessm  /harmony/enhanced/classlib/trunk/modules/imageio/src/main/native/jpegencoder
04/25/2007 15:43:24 Adding ignores for new OS/X dylib files.
modified hindessm  /harmony/enhanced/classlib/trunk/modules/luni/src/main/native/vmi 04/25/2007
15:43:24 Adding ignores for new OS/X dylib files.
modified hindessm  /harmony/enhanced/classlib/trunk/modules/auth/src/main/native/auth 04/25/2007
15:43:24 Adding ignores for new OS/X dylib files.
modified hindessm  /harmony/enhanced/classlib/trunk/modules/archive/src/main/native/archive
04/25/2007 15:43:24 Adding ignores for new OS/X dylib files.
modified hindessm  /harmony/enhanced/classlib/trunk/modules/awt/src/main/native/x11wrapper
04/25/2007 15:43:24 Adding ignores for new OS/X dylib files.
modified hindessm  /harmony/enhanced/classlib/trunk/modules/portlib/src/main/native/thrstub
04/25/2007 15:41:53 Add thrstub dylib ignore.
modified hindessm  /harmony/enhanced/classlib/trunk/modules/luni/src/main/native/luni/shared/luniglob.c
04/25/2007 15:33:11 Applied patches from "[#HARMONY-3298] [classlib][luni] Extraneous pathseparator
in *.boot.class.path causes DaCapo ('jython' benchmark) failure".
modified hindessm  /harmony/enhanced/classlib/trunk/modules/luni/src/test/java/org/apache/harmony/luni/tests/java/lang/SystemTest.java
04/25/2007 15:33:11 Applied patches from "[#HARMONY-3298] [classlib][luni] Extraneous pathseparator
in *.boot.class.path causes DaCapo ('jython' benchmark) failure".
modified hindessm  /harmony/enhanced/classlib/trunk/modules/awt/src/main/native/jpegdecoder/unix/makefile
04/25/2007 15:08:45 Adding flags for Mac OS/X.Adding support for running ranlib to add an
index to .a files - requiredon OS/X 10.3.Extend shlib.suffix to be used in Makefile - dylib
on OS/X not .so.
modified hindessm  /harmony/enhanced/classlib/trunk/modules/portlib/src/main/native/thrstub/unix/makefile
04/25/2007 15:08:45 Adding flags for Mac OS/X.Adding support for running ranlib to add an
index to .a files - requiredon OS/X 10.3.Extend shlib.suffix to be used in Makefile - dylib
on OS/X not .so.
modified hindessm  /harmony/enhanced/classlib/trunk/depends/build/rules.mk 04/25/2007 15:08:45
Adding flags for Mac OS/X.Adding support for running ranlib to add an index to .a files -
requiredon OS/X 10.3.Extend shlib.suffix to be used in Makefile - dylib on OS/X not .so.
modified hindessm  /harmony/enhanced/classlib/trunk/modules/luni/src/main/native/launcher/unix/makefile
04/25/2007 15:08:45 Adding flags for Mac OS/X.Adding support for running ranlib to add an
index to .a files - requiredon OS/X 10.3.Extend shlib.suffix to be used in Makefile - dylib
on OS/X not .so.
modified hindessm  /harmony/enhanced/classlib/trunk/modules/text/src/main/native/text/unix/makefile
04/25/2007 15:08:45 Adding flags for Mac OS/X.Adding support for running ranlib to add an
index to .a files - requiredon OS/X 10.3.Extend shlib.suffix to be used in Makefile - dylib
on OS/X not .so.
modified hindessm  /harmony/enhanced/classlib/trunk/modules/nio/src/main/native/nio/unix/makefile
04/25/2007 15:08:45 Adding flags for Mac OS/X.Adding support for running ranlib to add an
index to .a files - requiredon OS/X 10.3.Extend shlib.suffix to be used in Makefile - dylib
on OS/X not .so.
modified hindessm  /harmony/enhanced/classlib/trunk/modules/awt/src/main/native/oglwrapper/unix/makefile
04/25/2007 15:08:45 Adding flags for Mac OS/X.Adding support for running ranlib to add an
index to .a files - requiredon OS/X 10.3.Extend shlib.suffix to be used in Makefile - dylib
on OS/X not .so.
modified hindessm  /harmony/enhanced/classlib/trunk/modules/luni/src/main/native/luni/unix/makefile
04/25/2007 15:08:45 Adding flags for Mac OS/X.Adding support for running ranlib to add an
index to .a files - requiredon OS/X 10.3.Extend shlib.suffix to be used in Makefile - dylib
on OS/X not .so.
modified hindessm  /harmony/enhanced/classlib/trunk/modules/instrument/src/main/native/instrument/unix/makefile
04/25/2007 15:08:45 Adding flags for Mac OS/X.Adding support for running ranlib to add an
index to .a files - requiredon OS/X 10.3.Extend shlib.suffix to be used in Makefile - dylib
on OS/X not .so.
modified hindessm  /harmony/enhanced/classlib/trunk/modules/misc/src/main/native/accessors/unix/makefile
04/25/2007 15:08:45 Adding flags for Mac OS/X.Adding support for running ranlib to add an
index to .a files - requiredon OS/X 10.3.Extend shlib.suffix to be used in Makefile - dylib
on OS/X not .so.
modified hindessm  /harmony/enhanced/classlib/trunk/modules/awt/src/main/native/linuxfont/unix/makefile
04/25/2007 15:08:45 Adding flags for Mac OS/X.Adding support for running ranlib to add an
index to .a files - requiredon OS/X 10.3.Extend shlib.suffix to be used in Makefile - dylib
on OS/X not .so.
modified hindessm  /harmony/enhanced/classlib/trunk/modules/archive/src/main/native/zlib/unix/makefile
04/25/2007 15:08:45 Adding flags for Mac OS/X.Adding support for running ranlib to add an
index to .a files - requiredon OS/X 10.3.Extend shlib.suffix to be used in Makefile - dylib
on OS/X not .so.
added hindessm  /harmony/enhanced/classlib/trunk/depends/build/platform/macosx.ppc32.mk 04/25/2007
15:08:45 Adding flags for Mac OS/X.Adding support for running ranlib to add an index to .a
files - requiredon OS/X 10.3.Extend shlib.suffix to be used in Makefile - dylib on OS/X not
.so.
modified hindessm  /harmony/enhanced/classlib/trunk/modules/portlib/src/main/native/thread/unix/makefile
04/25/2007 15:08:45 Adding flags for Mac OS/X.Adding support for running ranlib to add an
index to .a files - requiredon OS/X 10.3.Extend shlib.suffix to be used in Makefile - dylib
on OS/X not .so.
modified hindessm  /harmony/enhanced/classlib/trunk/modules/awt/src/main/native/lcmm/unix/makefile
04/25/2007 15:08:45 Adding flags for Mac OS/X.Adding support for running ranlib to add an
index to .a files - requiredon OS/X 10.3.Extend shlib.suffix to be used in Makefile - dylib
on OS/X not .so.
modified hindessm  /harmony/enhanced/classlib/trunk/depends/build/defines.mk 04/25/2007 15:08:45
Adding flags for Mac OS/X.Adding support for running ranlib to add an index to .a files -
requiredon OS/X 10.3.Extend shlib.suffix to be used in Makefile - dylib on OS/X not .so.
modified hindessm  /harmony/enhanced/classlib/trunk/modules/awt/src/main/native/gl/unix/makefile
04/25/2007 15:08:45 Adding flags for Mac OS/X.Adding support for running ranlib to add an
index to .a files - requiredon OS/X 10.3.Extend shlib.suffix to be used in Makefile - dylib
on OS/X not .so.
modified hindessm  /harmony/enhanced/classlib/trunk/modules/portlib/src/main/native/sig/unix/makefile
04/25/2007 15:08:45 Adding flags for Mac OS/X.Adding support for running ranlib to add an
index to .a files - requiredon OS/X 10.3.Extend shlib.suffix to be used in Makefile - dylib
on OS/X not .so.
modified hindessm  /harmony/enhanced/classlib/trunk/modules/imageio/src/main/native/pngencoder/unix/makefile
04/25/2007 15:08:45 Adding flags for Mac OS/X.Adding support for running ranlib to add an
index to .a files - requiredon OS/X 10.3.Extend shlib.suffix to be used in Makefile - dylib
on OS/X not .so.
modified hindessm  /harmony/enhanced/classlib/trunk/modules/imageio/src/main/native/jpegencoder/unix/makefile
04/25/2007 15:08:45 Adding flags for Mac OS/X.Adding support for running ranlib to add an
index to .a files - requiredon OS/X 10.3.Extend shlib.suffix to be used in Makefile - dylib
on OS/X not .so.
modified hindessm  /harmony/enhanced/classlib/trunk/make/properties.xml 04/25/2007 15:08:45
Adding flags for Mac OS/X.Adding support for running ranlib to add an index to .a files -
requiredon OS/X 10.3.Extend shlib.suffix to be used in Makefile - dylib on OS/X not .so.
modified hindessm  /harmony/enhanced/classlib/trunk/modules/portlib/src/main/native/port/unix/makefile
04/25/2007 15:08:45 Adding flags for Mac OS/X.Adding support for running ranlib to add an
index to .a files - requiredon OS/X 10.3.Extend shlib.suffix to be used in Makefile - dylib
on OS/X not .so.
modified hindessm  /harmony/enhanced/classlib/trunk/modules/auth/src/main/native/auth/unix/makefile
04/25/2007 15:08:45 Adding flags for Mac OS/X.Adding support for running ranlib to add an
index to .a files - requiredon OS/X 10.3.Extend shlib.suffix to be used in Makefile - dylib
on OS/X not .so.
modified hindessm  /harmony/enhanced/classlib/trunk/modules/archive/src/main/native/archive/unix/makefile
04/25/2007 15:08:45 Adding flags for Mac OS/X.Adding support for running ranlib to add an
index to .a files - requiredon OS/X 10.3.Extend shlib.suffix to be used in Makefile - dylib
on OS/X not .so.
modified hindessm  /harmony/enhanced/classlib/trunk/modules/luni/src/main/native/vmi/unix/makefile
04/25/2007 15:08:45 Adding flags for Mac OS/X.Adding support for running ranlib to add an
index to .a files - requiredon OS/X 10.3.Extend shlib.suffix to be used in Makefile - dylib
on OS/X not .so.
modified hindessm  /harmony/enhanced/classlib/trunk/modules/luni/build.xml 04/25/2007 15:08:45
Adding flags for Mac OS/X.Adding support for running ranlib to add an index to .a files -
requiredon OS/X 10.3.Extend shlib.suffix to be used in Makefile - dylib on OS/X not .so.
modified hindessm  /harmony/enhanced/classlib/trunk/modules/awt/src/main/native/x11wrapper/unix/makefile
04/25/2007 15:08:45 Adding flags for Mac OS/X.Adding support for running ranlib to add an
index to .a files - requiredon OS/X 10.3.Extend shlib.suffix to be used in Makefile - dylib
on OS/X not .so.
modified hindessm  /harmony/enhanced/classlib/trunk/make/properties.xml 04/25/2007 14:49:47
Initial property updates for Mac OS/X
modified apetrenko  /harmony/enhanced/classlib/trunk/modules/awt/src/main/native/linuxfont/unix/LinuxNativeFont.c
04/25/2007 11:13:14 Patch for HARMONY-3677 "[classlib][awt] Results of running checker tool"
modified apetrenko  /harmony/enhanced/classlib/trunk/modules/awt/src/main/java/common/java/awt/HeadlessToolkit.java
04/25/2007 10:42:40 Patch for HARMONY-3654 "[classlib][awt] Busy waiting in headless event
dispatching"
modified apetrenko  /harmony/enhanced/classlib/trunk/modules/awt/src/main/java/common/java/awt/EventQueueCore.java
04/25/2007 10:42:40 Patch for HARMONY-3654 "[classlib][awt] Busy waiting in headless event
dispatching"
modified apetrenko  /harmony/enhanced/classlib/trunk/modules/awt/src/main/java/common/java/awt/HeadlessEventDispatchThread.java
04/25/2007 10:42:40 Patch for HARMONY-3654 "[classlib][awt] Busy waiting in headless event
dispatching"
modified apetrenko  /harmony/enhanced/classlib/trunk/modules/awt/src/main/java/common/java/awt/Toolkit.java
04/25/2007 10:42:40 Patch for HARMONY-3654 "[classlib][awt] Busy waiting in headless event
dispatching"
modified apetrenko  /harmony/enhanced/classlib/trunk/modules/awt/src/main/java/common/java/awt/EventDispatchThread.java
04/25/2007 10:42:40 Patch for HARMONY-3654 "[classlib][awt] Busy waiting in headless event
dispatching"
modified apetrenko  /harmony/enhanced/classlib/trunk/modules/awt/src/main/native/gl/shared/pngdecoder.c
04/25/2007 10:30:26 Patch for HARMONY-3677 "[classlib][awt] Results of running checker tool"
modified apetrenko  /harmony/enhanced/classlib/trunk/modules/awt/src/main/native/gl/shared/gifdecoder.c
04/25/2007 10:13:41 Patch for HARMONY-3677 "[classlib][awt] Results of running checker tool"
modified gshimansky  /harmony/enhanced/drlvm/trunk/vm/vmcore/src/jvmti/jvmti_event.cpp 04/25/2007
09:41:29 Applied HARMONY-3532 [drlvm][jvmti] wrong METHOD_EXIT events are generated before
VM_DEATH
modified gshimansky  /harmony/enhanced/drlvm/trunk/vm/vmcore/src/jvmti/jvmti_stack.cpp 04/25/2007
09:41:29 Applied HARMONY-3532 [drlvm][jvmti] wrong METHOD_EXIT events are generated before
VM_DEATH
modified gshimansky  /harmony/enhanced/drlvm/trunk/vm/vmcore/src/object/object_handles.cpp
04/25/2007 09:41:29 Applied HARMONY-3532 [drlvm][jvmti] wrong METHOD_EXIT events are generated
before VM_DEATH
modified apetrenko  /harmony/enhanced/classlib/trunk/modules/awt/src/main/native/gl/shared/blitter.cpp
04/25/2007 08:58:14 Patch for HARMONY-3677 "[classlib][awt] Results of running checker tool"
modified varlax  /harmony/enhanced/drlvm/trunk/vm/vmcore/src/kernel_classes/native/java_lang_reflect_VMReflection.cpp
04/25/2007 06:38:15 Verbose debug message removed in reflection of arrays.
modified hindessm  /harmony/enhanced/classlib/trunk/depends/build/rules.mk 04/25/2007 06:12:41
Extend make rules to support aix.
added hindessm  /harmony/enhanced/classlib/trunk/depends/build/platform/aix.ppc32.mk 04/25/2007
06:12:41 Extend make rules to support aix.
modified hindessm  /harmony/enhanced/classlib/trunk/depends/build/defines.mk 04/25/2007 06:12:41
Extend make rules to support aix.
added hindessm  /harmony/enhanced/classlib/trunk/depends/build/platform/aix.ppc64.mk 04/25/2007
06:12:41 Extend make rules to support aix.
added xli  /harmony/enhanced/classlib/trunk/modules/awt/make/exclude.windows.x86_64.drl.interm
04/25/2007 06:05:26 HARMONY-2867 : exclude the intermittent failure of java.awt.WindowTest
modified xli  /harmony/enhanced/drlvm/trunk/vm/gc_gen/src/common/space_tuner.cpp 04/25/2007
05:56:07 HARMONY-3700 : a LOS (Large object space) adaptation bug is fixed (subtraction downflow
to negative)
modified ayza  /harmony/enhanced/classlib/trunk/modules/luni/src/main/java/java/util/AbstractSet.java
04/25/2007 05:40:39 Applying patch from HARMONY-1639 ( [classlib][luni] Fresh install of jedit
4.3pre6 doesn't start - throws exception)
modified ayza  /harmony/enhanced/classlib/trunk/modules/luni/src/main/java/java/util/AbstractMap.java
04/25/2007 05:40:39 Applying patch from HARMONY-1639 ( [classlib][luni] Fresh install of jedit
4.3pre6 doesn't start - throws exception)
modified ayza  /harmony/enhanced/classlib/trunk/modules/luni/src/test/java/tests/api/java/util/TreeSetTest.java
04/25/2007 05:40:39 Applying patch from HARMONY-1639 ( [classlib][luni] Fresh install of jedit
4.3pre6 doesn't start - throws exception)
modified ayza  /harmony/enhanced/classlib/trunk/modules/luni/src/test/java/tests/api/java/util/TreeMapTest.java
04/25/2007 05:40:39 Applying patch from HARMONY-1639 ( [classlib][luni] Fresh install of jedit
4.3pre6 doesn't start - throws exception)
modified apetrenko  /harmony/enhanced/classlib/trunk/modules/luni/src/main/native/launcher/shared/main.c
04/25/2007 05:33:51 Patch for HARMONY-3615 "[classlib][launcher] should print help message
when run without class specified"
modified pyang  /harmony/enhanced/classlib/trunk/modules/sql/src/main/java/org/apache/harmony/sql/internal/nls/messages.properties
04/25/2007 04:20:18 Apply patch for HARMONY-3748( [classlib][sql] 9 new methods in RowSetMetaDataImpl)
with modifications
modified pyang  /harmony/enhanced/classlib/trunk/modules/sql/src/main/java/javax/sql/rowset/RowSetMetaDataImpl.java
04/25/2007 04:20:18 Apply patch for HARMONY-3748( [classlib][sql] 9 new methods in RowSetMetaDataImpl)
with modifications
modified pyang  /harmony/enhanced/classlib/trunk/modules/sql/src/test/java/org/apache/harmony/sql/tests/javax/sql/rowset/RowSetMetaDataImplTest.java
04/25/2007 04:20:18 Apply patch for HARMONY-3748( [classlib][sql] 9 new methods in RowSetMetaDataImpl)
with modifications
added pyang  /harmony/enhanced/classlib/trunk/modules/sql/src/main/java/javax/sql/rowset/SqlUtil.java
04/25/2007 04:20:18 Apply patch for HARMONY-3748( [classlib][sql] 9 new methods in RowSetMetaDataImpl)
with modifications
added pyang  /harmony/enhanced/classlib/trunk/modules/luni/src/test/resources/serialization/tests/api/java/util/IdentityHashMapTest.golden.ser
04/25/2007 02:51:36 Apply patch for HARMONY-3735([classlib][luni] Add more test cases for
some classes in luni module)
modified pyang  /harmony/enhanced/classlib/trunk/modules/luni/src/test/java/tests/api/java/util/ArraysTest.java
04/25/2007 02:51:36 Apply patch for HARMONY-3735([classlib][luni] Add more test cases for
some classes in luni module)
added pyang  /harmony/enhanced/classlib/trunk/modules/luni/src/test/resources/serialization/tests/api/java/util/PropertyPermissionTest.golden.ser
04/25/2007 02:51:36 Apply patch for HARMONY-3735([classlib][luni] Add more test cases for
some classes in luni module)
added pyang  /harmony/enhanced/classlib/trunk/modules/luni/src/test/resources/serialization/tests/api/java/util/HashSetTest.golden.ser
04/25/2007 02:51:36 Apply patch for HARMONY-3735([classlib][luni] Add more test cases for
some classes in luni module)
modified pyang  /harmony/enhanced/classlib/trunk/modules/luni/src/test/java/tests/api/java/util/CalendarTest.java
04/25/2007 02:51:36 Apply patch for HARMONY-3735([classlib][luni] Add more test cases for
some classes in luni module)
modified pyang  /harmony/enhanced/classlib/trunk/modules/luni/src/test/java/tests/api/java/util/IdentityHashMapTest.java
04/25/2007 02:51:36 Apply patch for HARMONY-3735([classlib][luni] Add more test cases for
some classes in luni module)
added pyang  /harmony/enhanced/classlib/trunk/modules/luni/src/test/java/tests/api/java/util/InvalidPropertiesFormatExceptionTest.java
04/25/2007 02:51:36 Apply patch for HARMONY-3735([classlib][luni] Add more test cases for
some classes in luni module)
modified pyang  /harmony/enhanced/classlib/trunk/modules/luni/src/test/java/tests/api/java/util/PropertyPermissionTest.java
04/25/2007 02:51:36 Apply patch for HARMONY-3735([classlib][luni] Add more test cases for
some classes in luni module)
modified pyang  /harmony/enhanced/classlib/trunk/modules/luni/src/test/java/tests/api/java/util/CollectionsTest.java
04/25/2007 02:51:36 Apply patch for HARMONY-3735([classlib][luni] Add more test cases for
some classes in luni module)
modified pyang  /harmony/enhanced/classlib/trunk/modules/luni/src/test/java/tests/api/java/util/HashSetTest.java
04/25/2007 02:51:36 Apply patch for HARMONY-3735([classlib][luni] Add more test cases for
some classes in luni module)
added pyang  /harmony/enhanced/classlib/trunk/modules/luni/src/test/resources/tests/api/java/io/test_array_strings.ser
04/25/2007 02:49:17 Apply patch for HARMONY-3726([classlib][luni]java.io.ObjectInputStream
fails to parse serialization file with [L[Ljava.lang.String;; as ObjectStreamField signature
for string array.)
modified pyang  /harmony/enhanced/classlib/trunk/modules/luni/src/main/java/java/io/ObjectInputStream.java
04/25/2007 02:49:17 Apply patch for HARMONY-3726([classlib][luni]java.io.ObjectInputStream
fails to parse serialization file with [L[Ljava.lang.String;; as ObjectStreamField signature
for string array.)
added pyang  /harmony/enhanced/classlib/trunk/modules/luni/src/test/resources/tests/api/java/io/test_array_integers.ser
04/25/2007 02:49:17 Apply patch for HARMONY-3726([classlib][luni]java.io.ObjectInputStream
fails to parse serialization file with [L[Ljava.lang.String;; as ObjectStreamField signature
for string array.)
modified pyang  /harmony/enhanced/classlib/trunk/modules/luni/src/test/java/tests/api/java/io/ObjectInputStreamTest.java
04/25/2007 02:49:17 Apply patch for HARMONY-3726([classlib][luni]java.io.ObjectInputStream
fails to parse serialization file with [L[Ljava.lang.String;; as ObjectStreamField signature
for string array.)
modified pyang  /harmony/enhanced/classlib/trunk/modules/security/src/test/api/java/org/apache/harmony/security/tests/java/security/Provider2Test.java
04/25/2007 02:39:24 Apply patch for HARMONY-3734([java][security]java.security.Provider.toString()
should not include the provider information)
modified pyang  /harmony/enhanced/classlib/trunk/modules/security/src/main/java/common/java/security/Provider.java
04/25/2007 02:39:24 Apply patch for HARMONY-3734([java][security]java.security.Provider.toString()
should not include the provider information)
modified pyang  /harmony/enhanced/classlib/trunk/modules/security/src/test/impl/java.injected/java/security/Provider_ImplTest.java
04/25/2007 02:39:24 Apply patch for HARMONY-3734([java][security]java.security.Provider.toString()
should not include the provider information)
modified varlax  /harmony/enhanced/drlvm/trunk/build/make/targets/reg.test.xml 04/25/2007
01:15:49 Add vmmagics.jar to compilation classpath
modified varlax  /harmony/enhanced/drlvm/trunk/build/make/targets/reg.test.xml 04/25/2007
00:56:34 Less verbose reg-test compilation


Mime
View raw message