harmony-alerts mailing list archives

Site index · List index
Message view « Date » · « Thread »
Top « Date » · « Thread »
From nom...@intel.com
Subject [build-test alert] BUILD FAILED Windows XP ia32 msvc debug: classlib
Date Mon, 23 Apr 2007 10:46:36 GMT
BUILD FAILED:
	Ant Error Message:
C:\cruise_short\trunk\cc\projects\classlib\trunk\build.xml:148: The following error occurred
while executing this line: C:\cruise_short\trunk\cc\projects\classlib\trunk\make\build-native.xml:67:
The following error occurred while executing this line: C:\cruise_short\trunk\cc\projects\classlib\trunk\modules\portlib\build.xml:141:
The following error occurred while executing this line: C:\cruise_short\trunk\cc\projects\classlib\trunk\make\properties.xml:404:
exec returned: 2

Date of build:	04/23/2007 17:33:18
Time to build:	12 minutes 53 seconds
Last changed:	04/23/2007 17:07:44
Last log entry:	Apply patch for HARMONY-654([classlib][luni] File.mkdir does not support unicode)
with modifications

***********************************************************
Errors/Warnings:	(126)
            
Checking depends/jars/yoko_M2-20070130/yoko.jar
Checksum verified (true)
Checking depends/jars/yoko_M2-20070130/yoko-core.jar
Checksum verified (true)
Checking depends/jars/yoko_M2-20070130/yoko-rmi-impl.jar
Checksum verified (true)
Checking depends/jars/yoko_M2-20070130/yoko-rmi-spec.jar
Checksum verified (true)
Checking depends/jars/bcel-5.2/bcel-5.2.jar
Checksum verified (true)
Checking depends/jars/xalan-j_2.7.0/xalan.jar
Checksum verified (true)
Checking depends/jars/xerces_2.9.0/xerces.zip
Checksum verified (true)
Checking depends/jars/junit_3.8.2/junit.jar
Checksum verified (true)
Checking depends/jars/bcprov-jdk15-134/bcprov.jar
Checksum verified (true)
Checking depends/jars/icu4j_3.4.4/icu4j_3_4_4.jar
Checksum verified (true)
Checking depends/jars/mx4j_3.0.2/mx4j.zip
Checksum verified (true)
Checking depends/jars/ecj_3.2/ecj_3.2.jar
Checksum verified (true)
Checking depends/jars/jetty/jetty-6.0.0.jar
Checksum verified (true)
Checking depends/jars/jetty/jetty-util-6.0.0.jar
Checksum verified (true)
Checking depends/jars/jetty/servlet-api-2.5-6.0.0.jar
Checksum verified (true)
Checking depends/libs/windows.x86/msvcr71.dll
Checksum verified (true)
Checking depends/libs/windows.x86/swing_awt_deps_winxp_2006-09-28.tgz
Checksum verified (true)
C:\cruise_short\trunk\cc\projects\classlib\trunk\modules\accessibility\bin\test not found.
C:\cruise_short\trunk\cc\projects\classlib\trunk\modules\annotation\bin\test not found.
C:\cruise_short\trunk\cc\projects\classlib\trunk\modules\applet\bin\test not found.
C:\cruise_short\trunk\cc\projects\classlib\trunk\modules\archive\bin\test not found.
C:\cruise_short\trunk\cc\projects\classlib\trunk\modules\auth\bin\test not found.
C:\cruise_short\trunk\cc\projects\classlib\trunk\modules\awt\bin\test not found.
C:\cruise_short\trunk\cc\projects\classlib\trunk\modules\beans\bin\test not found.
C:\cruise_short\trunk\cc\projects\classlib\trunk\modules\concurrent\bin\test not found.
C:\cruise_short\trunk\cc\projects\classlib\trunk\modules\crypto\bin\test not found.
C:\cruise_short\trunk\cc\projects\classlib\trunk\modules\imageio\bin\test not found.
C:\cruise_short\trunk\cc\projects\classlib\trunk\modules\instrument\bin\test not found.
C:\cruise_short\trunk\cc\projects\classlib\trunk\modules\jndi\bin\test not found.
C:\cruise_short\trunk\cc\projects\classlib\trunk\modules\lang-management\bin\api not found.
C:\cruise_short\trunk\cc\projects\classlib\trunk\modules\lang-management\bin\impl not found.
C:\cruise_short\trunk\cc\projects\classlib\trunk\modules\logging\bin\test not found.
C:\cruise_short\trunk\cc\projects\classlib\trunk\modules\luni\bin\test not found.
C:\cruise_short\trunk\cc\projects\classlib\trunk\modules\math\bin\test not found.
C:\cruise_short\trunk\cc\projects\classlib\trunk\modules\misc\bin\test not found.
C:\cruise_short\trunk\cc\projects\classlib\trunk\modules\nio\bin\test not found.
C:\cruise_short\trunk\cc\projects\classlib\trunk\modules\nio_char\bin\test not found.
C:\cruise_short\trunk\cc\projects\classlib\trunk\modules\pack200\bin\test not found.
C:\cruise_short\trunk\cc\projects\classlib\trunk\modules\prefs\bin\test not found.
C:\cruise_short\trunk\cc\projects\classlib\trunk\modules\print\bin\test not found.
C:\cruise_short\trunk\cc\projects\classlib\trunk\modules\regex\bin\test not found.
C:\cruise_short\trunk\cc\projects\classlib\trunk\modules\rmi\bin\test not found.
C:\cruise_short\trunk\cc\projects\classlib\trunk\modules\security\bin\test not found.
C:\cruise_short\trunk\cc\projects\classlib\trunk\modules\sound\bin\test not found.
C:\cruise_short\trunk\cc\projects\classlib\trunk\modules\sql\bin\test not found.
C:\cruise_short\trunk\cc\projects\classlib\trunk\modules\suncompat\bin\test not found.
C:\cruise_short\trunk\cc\projects\classlib\trunk\modules\swing\bin\test not found.
C:\cruise_short\trunk\cc\projects\classlib\trunk\modules\text\bin\test not found.
C:\cruise_short\trunk\cc\projects\classlib\trunk\modules\tools\bin\test not found.
C:\cruise_short\trunk\cc\projects\classlib\trunk\modules\x-net\bin\test not found.
The system cannot find the file specified.
Could Not Find C:\cruise_short\trunk\cc\projects\classlib\trunk\deploy\lib\hyfdlibm.pdb
C:\cruise_short\trunk\cc\projects\classlib\trunk\deploy\jdk\include not found.

========================================
Building Java component archives...
========================================
        
Checking for depends/jars/yoko_M2-20070130/yoko.jar
Checking for depends/jars/yoko_M2-20070130/yoko-core.jar
Checking for depends/jars/yoko_M2-20070130/yoko-rmi-impl.jar
Checking for depends/jars/yoko_M2-20070130/yoko-rmi-spec.jar
Checking for depends/jars/bcel-5.2/bcel-5.2.jar
Checking for depends/jars/xalan-j_2.7.0/xalan.jar
Checking for depends/jars/xerces_2.9.0/xerces.zip
Checking for depends/jars/junit_3.8.2/junit.jar
Checking for depends/jars/bcprov-jdk15-134/bcprov.jar
Checking for depends/jars/icu4j_3.4.4/icu4j_3_4_4.jar
Checking for depends/jars/mx4j_3.0.2/mx4j.zip
Checking for depends/jars/ecj_3.2/ecj_3.2.jar
Checking for depends/jars/jetty/jetty-6.0.0.jar
Checking for depends/jars/jetty/jetty-util-6.0.0.jar
Checking for depends/jars/jetty/servlet-api-2.5-6.0.0.jar
Checking for depends/libs/windows.x86/msvcr71.dll
Checking for depends/libs/windows.x86/swing_awt_deps_winxp_2006-09-28.tgz
Compiling ACCESSIBILITY classes
Compiling ANNOTATION classes
Compiling APPLET classes
Compiling ARCHIVE classes
Compiling AUTH classes
Compiling AWT classes
Compiling BEANS classes
Compiling CONCURRENT classes
Compiling CRYPTO classes
Compiling ImageIO classes
Compiling INSTRUMENT classes
Compiling JNDI classes
Compiling LANG-MANAGEMENT classes
Compiling LOGGING classes
Compiling LUNI classes
Compiling MATH classes
Compiling MISC classes
Compiling NIO classes
Compiling NIO_CHAR classes
Compiling PACK200 classes
Since fork is false, ignoring memoryMaximumSize setting
Since fork is false, ignoring memoryMaximumSize setting
Compiling PREFS classes
Compiling PRINT classes
Compiling REGEX classes
Compiling RMI classes
Compiling SECURITY classes
Compiling SOUND classes
Since fork is false, ignoring memoryMaximumSize setting
Compiling SQL classes
Compiling Sun Compat classes
Compiling SWING classes
Compiling TEXT classes
Compiling TOOLS classes
Compiling X-NET classes

========================================
Building native libs and executables...
========================================
        
NMAKE : fatal error U1077: 'cl' : return code '0x2'
Stop.

***********************************************************
Unit Tests: (0)
        
No Tests Run: This project doesn't have any tests

***********************************************************
Modifications since last successful build:	(3)
            
modified pyang  /harmony/enhanced/classlib/trunk/modules/portlib/src/main/native/port/shared/hystr.c
04/23/2007 17:07:44 Apply patch for HARMONY-654([classlib][luni] File.mkdir does not support
unicode) with modifications
modified pyang  /harmony/enhanced/classlib/trunk/modules/luni/src/test/java/tests/api/java/util/TimerTaskTest.java
04/23/2007 17:03:20 Apply patch for HARMONY-3437( [classlib][util] classlib test util.TimerTaskTest
failed on havy load box)
added pyang  /harmony/enhanced/classlib/trunk/modules/sql/src/main/java/javax/sql/rowset/RowSetMetaDataImpl.java
04/23/2007 17:01:54 Apply patch for HARMONY-3723([classlib][sql] new class javax.sql.rowset.RowSetMetaDataImpl)

Mime
View raw message