harmony-alerts mailing list archives

Site index · List index
Message view « Date » · « Thread »
Top « Date » · « Thread »
From nom...@intel.com
Subject [build-test alert] BUILD FAILED Linux SUSE 9 gcc debug: drlvm reg.test
Date Mon, 23 Apr 2007 06:48:05 GMT
BUILD FAILED:
	Ant Error Message:
/export/cruise/trunk/cc/projects/drlvm/trunk/build/make/build.xml:445: The following error occurred while executing this line: /export/cruise/trunk/cc/projects/drlvm/trunk/build/make/targets/reg.test.run.xml:122: There were test failures

Date of build:	04/23/2007 12:58:05
Time to build:	49 minutes 42 seconds
Last changed:	04/23/2007 08:52:31
Last log entry:	Add locks, mfence and sfence instructions to align windows with linux


***********************************************************
Execution log (errors/warnings messages):	
Test org.apache.harmony.drlvm.tests.regression.h1840.SimplestTest FAILED (timeout)
Test org.apache.harmony.drlvm.tests.regression.h2083.Test FAILED (timeout)
Test org.apache.harmony.drlvm.tests.regression.h2151.VMInit1Test FAILED (timeout)
Test org.apache.harmony.drlvm.tests.regression.h2926.Test FAILED (timeout)
Test org.apache.harmony.drlvm.tests.regression.h3027.AgentLibTest FAILED (timeout)
Test org.apache.harmony.drlvm.tests.regression.h3317.GetFieldDeclaringClassTest FAILED (timeout)
Test org.apache.harmony.drlvm.tests.regression.h3380.LongToBitsTest FAILED (timeout)
Test org.apache.harmony.drlvm.tests.regression.h3446.SubSubTest FAILED (timeout)
Test org.apache.harmony.drlvm.tests.regression.h3505.GetFieldModifiersTest FAILED (timeout)
Test org.apache.harmony.drlvm.tests.regression.h3652.Test FAILED
Configuration:
    classlib root = /export/cruise/trunk/cc/projects/classlib/trunk
               os = Linux
             arch = ia32
              cxx = gcc
              cfg = debug
     svn revision = ${svn.revision}
       components = deploy
[parsing started /export/cruise/trunk/cc/projects/drlvm/trunk/src/test/regression/H0000/DirectByteBufferTest.java]
[parsing completed 71ms]
[parsing started /export/cruise/trunk/cc/projects/drlvm/trunk/src/test/regression/H1578/NaNTest.java]
[parsing completed 1ms]
[parsing started /export/cruise/trunk/cc/projects/drlvm/trunk/src/test/regression/H1654/H1654Test.java]
[parsing completed 3ms]
[parsing started /export/cruise/trunk/cc/projects/drlvm/trunk/src/test/regression/H1694/H1694.java]
[parsing completed 8ms]
[parsing started /export/cruise/trunk/cc/projects/drlvm/trunk/src/test/regression/H1800/ExecTest.java]
[parsing completed 2ms]
[parsing started /export/cruise/trunk/cc/projects/drlvm/trunk/src/test/regression/H1802/UnresolvedHandlerTest.java]
[parsing completed 1ms]
[parsing started /export/cruise/trunk/cc/projects/drlvm/trunk/src/test/regression/H1802/UnresolvedParamTest.java]
[parsing completed 1ms]
[parsing started /export/cruise/trunk/cc/projects/drlvm/trunk/src/test/regression/H1857/Test.java]
[parsing completed 1ms]
[parsing started /export/cruise/trunk/cc/projects/drlvm/trunk/src/test/regression/H1863/H1863Test.java]
[parsing completed 4ms]
[parsing started /export/cruise/trunk/cc/projects/drlvm/trunk/src/test/regression/H2083/Test.java]
[parsing completed 1ms]
[parsing started /export/cruise/trunk/cc/projects/drlvm/trunk/src/test/regression/H2086/Test.java]
[parsing completed 2ms]
[parsing started /export/cruise/trunk/cc/projects/drlvm/trunk/src/test/regression/H2103/Test.java]
[parsing completed 1ms]
[parsing started /export/cruise/trunk/cc/projects/drlvm/trunk/src/test/regression/H2151/VMInit1Test.java]
[parsing completed 2ms]
[parsing started /export/cruise/trunk/cc/projects/drlvm/trunk/src/test/regression/H2259/H2259.java]
[parsing completed 2ms]
[parsing started /export/cruise/trunk/cc/projects/drlvm/trunk/src/test/regression/H2261/RCETest.java]
[parsing completed 1ms]
[parsing started /export/cruise/trunk/cc/projects/drlvm/trunk/src/test/regression/H2335/SimplestLibraryPathTest.java]
[parsing completed 1ms]
[parsing started /export/cruise/trunk/cc/projects/drlvm/trunk/src/test/regression/H2644/BootDelegationTest.java]
[parsing completed 1ms]
[parsing started /export/cruise/trunk/cc/projects/drlvm/trunk/src/test/regression/H2773/InfinityTest.java]
[parsing completed 2ms]
[parsing started /export/cruise/trunk/cc/projects/drlvm/trunk/src/test/regression/H2808/finTest.java]
[parsing completed 1ms]
[parsing started /export/cruise/trunk/cc/projects/drlvm/trunk/src/test/regression/H2846/NoVerifyTest.java]
[parsing completed 1ms]
[parsing started /export/cruise/trunk/cc/projects/drlvm/trunk/src/test/regression/H2873/RemTest.java]
[parsing completed 1ms]
[parsing started /export/cruise/trunk/cc/projects/drlvm/trunk/src/test/regression/H2874/Test.java]
[parsing completed 2ms]
[parsing started /export/cruise/trunk/cc/projects/drlvm/trunk/src/test/regression/H2899/ManyArgsTest.java]
[parsing completed 20ms]
[parsing started /export/cruise/trunk/cc/projects/drlvm/trunk/src/test/regression/H2926/MyException.java]
[parsing completed 1ms]
[parsing started /export/cruise/trunk/cc/projects/drlvm/trunk/src/test/regression/H2926/Test.java]
[parsing completed 1ms]
[parsing started /export/cruise/trunk/cc/projects/drlvm/trunk/src/test/regression/H3027/AgentLibTest.java]
[parsing completed 1ms]
[parsing started /export/cruise/trunk/cc/projects/drlvm/trunk/src/test/regression/H3048/H3048.java]
[parsing completed 1ms]
[parsing started /export/cruise/trunk/cc/projects/drlvm/trunk/src/test/regression/H3067/Test.java]
[parsing completed 6ms]
[parsing started /export/cruise/trunk/cc/projects/drlvm/trunk/src/test/regression/H3074/AnotherClass.java]
[parsing completed 21ms]
[parsing started /export/cruise/trunk/cc/projects/drlvm/trunk/src/test/regression/H3074/Test.java]
[parsing completed 1ms]
[parsing started /export/cruise/trunk/cc/projects/drlvm/trunk/src/test/regression/H3110/FieldTest.java]
[parsing completed 1ms]
[parsing started /export/cruise/trunk/cc/projects/drlvm/trunk/src/test/regression/H3121/H3121.java]
[parsing completed 3ms]
[parsing started /export/cruise/trunk/cc/projects/drlvm/trunk/src/test/regression/H3130/CallNativeTest.java]
[parsing completed 0ms]
[parsing started /export/cruise/trunk/cc/projects/drlvm/trunk/src/test/regression/H3150/Test.java]
[parsing completed 1ms]
[parsing started /export/cruise/trunk/cc/projects/drlvm/trunk/src/test/regression/H3175/Test.java]
[parsing completed 2ms]
[parsing started /export/cruise/trunk/cc/projects/drlvm/trunk/src/test/regression/H3216/ASETest.java]
[parsing completed 0ms]
[parsing started /export/cruise/trunk/cc/projects/drlvm/trunk/src/test/regression/H3225/NegativeJsrTest.java]
[parsing completed 2ms]
[parsing started /export/cruise/trunk/cc/projects/drlvm/trunk/src/test/regression/H3225/PerfTest.java]
[parsing completed 22ms]
[parsing started /export/cruise/trunk/cc/projects/drlvm/trunk/src/test/regression/H3228/H3228.java]
[parsing completed 1ms]
[parsing started /export/cruise/trunk/cc/projects/drlvm/trunk/src/test/regression/H3256/TestInterruptTimedWaiting.java]
[parsing completed 2ms]
[parsing started /export/cruise/trunk/cc/projects/drlvm/trunk/src/test/regression/H3283/JavaLibraryPathTest.java]
[parsing completed 1ms]
[parsing started /export/cruise/trunk/cc/projects/drlvm/trunk/src/test/regression/H3285/Test.java]
[parsing completed 1ms]
[parsing started /export/cruise/trunk/cc/projects/drlvm/trunk/src/test/regression/H3317/GetFieldDeclaringClassTest.java]
[parsing completed 1ms]
[parsing started /export/cruise/trunk/cc/projects/drlvm/trunk/src/test/regression/H3380/LongToBitsTest.java]
[parsing completed 1ms]
[parsing started /export/cruise/trunk/cc/projects/drlvm/trunk/src/test/regression/H3404/H3404.java]
[parsing completed 1ms]
[parsing started /export/cruise/trunk/cc/projects/drlvm/trunk/src/test/regression/H3505/GetFieldModifiersTest.java]
[parsing completed 0ms]
[parsing started /export/cruise/trunk/cc/projects/drlvm/trunk/src/test/regression/H3619/ObjectLongWaitTest.java]
[parsing completed 2ms]
[parsing started /export/cruise/trunk/cc/projects/drlvm/trunk/src/test/regression/H3652/Test.java]
[parsing completed 1ms]
[parsing started /export/cruise/trunk/cc/projects/drlvm/trunk/src/test/regression/H3691/Test.java]
[parsing completed 1ms]
[parsing started /export/cruise/trunk/cc/projects/drlvm/trunk/src/test/regression/H788/Test.java]
[parsing completed 1ms]
[search path for source files: [/export/cruise/trunk/cc/projects/drlvm/trunk/src/test/regression]]
[search path for class files: [/export/cruise/tools/jdk1.5.0_08/jre/lib/rt.jar, /export/cruise/tools/jdk1.5.0_08/jre/lib/jsse.jar, /export/cruise/tools/jdk1.5.0_08/jre/lib/jce.jar, /export/cruise/tools/jdk1.5.0_08/jre/lib/charsets.jar, /export/cruise/tools/jdk1.5.0_08/jre/lib/ext/dnsns.jar, /export/cruise/tools/jdk1.5.0_08/jre/lib/ext/sunpkcs11.jar, /export/cruise/tools/jdk1.5.0_08/jre/lib/ext/sunjce_provider.jar, /export/cruise/tools/jdk1.5.0_08/jre/lib/ext/localedata.jar, /export/cruise/trunk/cc/projects/drlvm/trunk/build/lnx_ia32_gcc_debug/semis/reg.tests/classes, /export/cruise/trunk/cc/lib/ant-launcher.jar, /export/cruise/tools/jdk1.5.0_08/lib/tools.jar, /export/cruise/trunk/cc/lib/cruisecontrol.jar, /export/cruise/trunk/cc/lib/../lib/activation.jar, /export/cruise/trunk/cc/lib/../lib/comm.jar, /export/cruise/trunk/cc/lib/../lib/commons-net-1.1.0.jar, /export/cruise/trunk/cc/lib/../lib/fast-md5.jar, /export/cruise/trunk/cc/lib/../lib/jakarta-oro-2.0.3.jar, /export/cruis!
 e/trunk/cc/lib/../lib/jdom.jar, /export/cruise/trunk/cc/lib/../lib/log4j.jar, /export/cruise/trunk/cc/lib/../lib/mail.jar, /export/cruise/trunk/cc/lib/../lib/mx4j-tools.jar, /export/cruise/trunk/cc/lib/../lib/mx4j-remote.jar, /export/cruise/trunk/cc/lib/../lib/mx4j.jar, /export/cruise/trunk/cc/lib/../lib/smack.jar, /export/cruise/trunk/cc/lib/../lib/x10.jar, /export/cruise/trunk/cc/lib/../lib/xmlrpc-2.0.1.jar, /export/cruise/trunk/cc/lib/log4j.jar, /export/cruise/trunk/cc/lib/jdom.jar, /export/cruise/trunk/cc/lib/ant.jar, /export/cruise/tools/apache-ant-1.6.5/lib/ant-apache-regexp.jar, /export/cruise/tools/apache-ant-1.6.5/lib/ecj_3.2.jar, /export/cruise/tools/apache-ant-1.6.5/lib/ant-nodeps.jar, /export/cruise/tools/apache-ant-1.6.5/lib/ant-xslp.jar, /export/cruise/tools/apache-ant-1.6.5/lib/ant-trax.jar, /export/cruise/trunk/cc/projects/drlvm/trunk/build/make/tmp/ant-contrib.jar, /export/cruise/trunk/cc/projects/drlvm/trunk/build/make/tmp/cpptasks.jar, /export/cruise/trun!
 k/cc/lib/jasper-compiler.jar, /export/cruise/trunk/cc/lib/jasper-runti
me.jar, /export/cruise/trunk/cc/lib/xercesImpl-2.8.0.jar, /export/cruise/trunk/cc/lib/xml-apis-2.8.0.jar, /export/cruise/trunk/cc/lib/xmlrpc-2.0.1.jar, /export/cruise/trunk/cc/lib/xalan-2.7.0.jar, /export/cruise/trunk/cc/lib/serializer-2.7.0.jar, /export/cruise/trunk/cc/lib/jakarta-oro-2.0.3.jar, /export/cruise/trunk/cc/lib/mail.jar, /export/cruise/trunk/cc/lib/junit.jar, /export/cruise/trunk/cc/lib/activation.jar, /export/cruise/trunk/cc/lib/commons-net-1.1.0.jar, /export/cruise/trunk/cc/lib/mx4j.jar, /export/cruise/trunk/cc/lib/mx4j-tools.jar, /export/cruise/trunk/cc/lib/mx4j-remote.jar, /export/cruise/trunk/cc/lib/smack.jar, /export/cruise/trunk/cc/lib/comm.jar, /export/cruise/trunk/cc/lib/x10.jar, /export/cruise/trunk/cc/lib/fast-md5.jar, /export/cruise/trunk/cc/lib/maven-embedder-2.0.3-dep.jar, /export/cruise/trunk/cc/lib/javax.servlet.jar, /export/cruise/trunk/cc/lib/org.mortbay.jetty.jar, /export/cruise/trunk/cc/lib/commons-logging.jar, /export/cruise/trunk/cc/lib/com!
 mons-el.jar, /export/cruise/trunk/cc/projects/drlvm/trunk/build/make, /export/cruise/trunk/cc/lib/smackx.jar, /export/cruise/trunk/cc/lib/emma.jar, /export/cruise/trunk/cc/lib/jaxen-1.1-beta-8.jar, /export/cruise/trunk/cc/lib/ant-junit-1.6.5.jar, /export/cruise/trunk/cc/lib/emma_ant.jar, /export/cruise/trunk/cc/lib/checkstyle-all-3.1.jar]]
[loading /export/cruise/tools/jdk1.5.0_08/jre/lib/rt.jar(java/nio/Buffer.class)]
[loading /export/cruise/tools/jdk1.5.0_08/jre/lib/rt.jar(java/nio/ByteBuffer.class)]
[loading /export/cruise/trunk/cc/lib/junit.jar(junit/framework/TestCase.class)]
[loading /export/cruise/trunk/cc/lib/junit.jar(junit/framework/Test.class)]
[loading /export/cruise/tools/jdk1.5.0_08/jre/lib/rt.jar(java/lang/Object.class)]
[loading /export/cruise/trunk/cc/lib/junit.jar(junit/framework/Assert.class)]
[loading /export/cruise/tools/jdk1.5.0_08/jre/lib/rt.jar(java/lang/String.class)]
[loading /export/cruise/tools/jdk1.5.0_08/jre/lib/rt.jar(java/lang/Exception.class)]
[loading /export/cruise/tools/jdk1.5.0_08/jre/lib/rt.jar(java/lang/Throwable.class)]
[loading /export/cruise/tools/jdk1.5.0_08/jre/lib/rt.jar(java/io/Serializable.class)]
[loading /export/cruise/tools/jdk1.5.0_08/jre/lib/rt.jar(java/lang/Thread.class)]
[loading /export/cruise/tools/jdk1.5.0_08/jre/lib/rt.jar(java/lang/Runnable.class)]
[loading /export/cruise/tools/jdk1.5.0_08/jre/lib/rt.jar(java/lang/reflect/InvocationHandler.class)]
[loading /export/cruise/tools/jdk1.5.0_08/jre/lib/rt.jar(java/lang/reflect/Method.class)]
[loading /export/cruise/tools/jdk1.5.0_08/jre/lib/rt.jar(java/lang/reflect/Proxy.class)]
[loading /export/cruise/tools/jdk1.5.0_08/jre/lib/rt.jar(java/lang/reflect/UndeclaredThrowableException.class)]
[loading /export/cruise/tools/jdk1.5.0_08/jre/lib/rt.jar(java/lang/ClassLoader.class)]
[loading /export/cruise/tools/jdk1.5.0_08/jre/lib/rt.jar(java/lang/Class.class)]
[loading /export/cruise/tools/jdk1.5.0_08/jre/lib/rt.jar(java/lang/ClassNotFoundException.class)]
[loading /export/cruise/tools/jdk1.5.0_08/jre/lib/rt.jar(java/io/File.class)]
[loading /export/cruise/tools/jdk1.5.0_08/jre/lib/rt.jar(java/io/IOException.class)]
[loading /export/cruise/tools/jdk1.5.0_08/jre/lib/rt.jar(java/util/Enumeration.class)]
[loading /export/cruise/tools/jdk1.5.0_08/jre/lib/rt.jar(java/util/Iterator.class)]
[loading /export/cruise/tools/jdk1.5.0_08/jre/lib/rt.jar(java/util/Set.class)]
[loading /export/cruise/tools/jdk1.5.0_08/jre/lib/rt.jar(java/util/StringTokenizer.class)]
[loading /export/cruise/tools/jdk1.5.0_08/jre/lib/rt.jar(java/util/TreeSet.class)]
[loading /export/cruise/tools/jdk1.5.0_08/jre/lib/rt.jar(java/util/jar/JarEntry.class)]
[loading /export/cruise/tools/jdk1.5.0_08/jre/lib/rt.jar(java/util/jar/JarFile.class)]
[loading /export/cruise/tools/jdk1.5.0_08/jre/lib/rt.jar(java/util/Formatter.class)]
[checking org.apache.harmony.drlvm.tests.regression.h0000.DirectByteBufferTest]
[loading /export/cruise/tools/jdk1.5.0_08/jre/lib/rt.jar(java/lang/System.class)]
[loading /export/cruise/tools/jdk1.5.0_08/jre/lib/rt.jar(java/lang/Comparable.class)]
[loading /export/cruise/tools/jdk1.5.0_08/jre/lib/rt.jar(java/nio/CharBuffer.class)]
[loading /export/cruise/tools/jdk1.5.0_08/jre/lib/rt.jar(java/nio/ShortBuffer.class)]
[loading /export/cruise/tools/jdk1.5.0_08/jre/lib/rt.jar(java/nio/IntBuffer.class)]
[loading /export/cruise/tools/jdk1.5.0_08/jre/lib/rt.jar(java/nio/FloatBuffer.class)]
[loading /export/cruise/tools/jdk1.5.0_08/jre/lib/rt.jar(java/nio/DoubleBuffer.class)]
[loading /export/cruise/tools/jdk1.5.0_08/jre/lib/rt.jar(java/nio/LongBuffer.class)]
[loading /export/cruise/tools/jdk1.5.0_08/jre/lib/rt.jar(java/lang/StringBuilder.class)]
[loading /export/cruise/tools/jdk1.5.0_08/jre/lib/rt.jar(java/lang/AbstractStringBuilder.class)]
[loading /export/cruise/tools/jdk1.5.0_08/jre/lib/rt.jar(java/lang/CharSequence.class)]
[loading /export/cruise/tools/jdk1.5.0_08/jre/lib/rt.jar(java/lang/StringBuffer.class)]
[wrote /export/cruise/trunk/cc/projects/drlvm/trunk/build/lnx_ia32_gcc_debug/semis/reg.tests/classes/org/apache/harmony/drlvm/tests/regression/h0000/DirectByteBufferTest.class]
[checking org.apache.harmony.drlvm.tests.regression.H1578.NaNTest]
[loading /export/cruise/trunk/cc/projects/drlvm/trunk/build/lnx_ia32_gcc_debug/semis/reg.tests/classes/org/apache/harmony/drlvm/tests/regression/H1578/dcmp1.class]
[loading /export/cruise/trunk/cc/projects/drlvm/trunk/build/lnx_ia32_gcc_debug/semis/reg.tests/classes/org/apache/harmony/drlvm/tests/regression/H1578/fcmp1.class]
[loading /export/cruise/tools/jdk1.5.0_08/jre/lib/rt.jar(java/lang/Float.class)]
[loading /export/cruise/tools/jdk1.5.0_08/jre/lib/rt.jar(java/lang/Number.class)]
[loading /export/cruise/tools/jdk1.5.0_08/jre/lib/rt.jar(java/lang/Double.class)]
[wrote /export/cruise/trunk/cc/projects/drlvm/trunk/build/lnx_ia32_gcc_debug/semis/reg.tests/classes/org/apache/harmony/drlvm/tests/regression/H1578/NaNTest.class]
[checking org.apache.harmony.drlvm.tests.regression.h1654.H1654Test]
[loading /export/cruise/tools/jdk1.5.0_08/jre/lib/rt.jar(java/security/ProtectionDomain.class)]
[loading /export/cruise/tools/jdk1.5.0_08/jre/lib/rt.jar(java/security/PermissionCollection.class)]
[loading /export/cruise/tools/jdk1.5.0_08/jre/lib/rt.jar(java/io/PrintStream.class)]
[loading /export/cruise/tools/jdk1.5.0_08/jre/lib/rt.jar(java/io/FilterOutputStream.class)]
[loading /export/cruise/tools/jdk1.5.0_08/jre/lib/rt.jar(java/io/OutputStream.class)]
[loading /export/cruise/tools/jdk1.5.0_08/jre/lib/rt.jar(java/lang/RuntimePermission.class)]
[loading /export/cruise/tools/jdk1.5.0_08/jre/lib/rt.jar(java/security/BasicPermission.class)]
[loading /export/cruise/tools/jdk1.5.0_08/jre/lib/rt.jar(java/security/Permission.class)]
[wrote /export/cruise/trunk/cc/projects/drlvm/trunk/build/lnx_ia32_gcc_debug/semis/reg.tests/classes/org/apache/harmony/drlvm/tests/regression/h1654/H1654Test.class]
[checking org.apache.harmony.drlvm.tests.regression.h1694.H1694]
[loading /export/cruise/tools/jdk1.5.0_08/jre/lib/rt.jar(java/lang/OutOfMemoryError.class)]
[loading /export/cruise/tools/jdk1.5.0_08/jre/lib/rt.jar(java/lang/VirtualMachineError.class)]
[loading /export/cruise/tools/jdk1.5.0_08/jre/lib/rt.jar(java/lang/Error.class)]
[wrote /export/cruise/trunk/cc/projects/drlvm/trunk/build/lnx_ia32_gcc_debug/semis/reg.tests/classes/org/apache/harmony/drlvm/tests/regression/h1694/H1694.class]
[checking org.apache.harmony.drlvm.tests.regression.h1694.StressTest01Object1]
[wrote /export/cruise/trunk/cc/projects/drlvm/trunk/build/lnx_ia32_gcc_debug/semis/reg.tests/classes/org/apache/harmony/drlvm/tests/regression/h1694/StressTest01Object1.class]
[checking org.apache.harmony.drlvm.tests.regression.h1800.ExecTest]
[loading /export/cruise/tools/jdk1.5.0_08/jre/lib/rt.jar(java/lang/Process.class)]
[loading /export/cruise/tools/jdk1.5.0_08/jre/lib/rt.jar(java/lang/Runtime.class)]
[loading /export/cruise/tools/jdk1.5.0_08/jre/lib/rt.jar(java/io/InputStream.class)]
[loading /export/cruise/tools/jdk1.5.0_08/jre/lib/rt.jar(java/io/Closeable.class)]
[loading /export/cruise/tools/jdk1.5.0_08/jre/lib/rt.jar(java/lang/NullPointerException.class)]
[loading /export/cruise/tools/jdk1.5.0_08/jre/lib/rt.jar(java/lang/RuntimeException.class)]
[loading /export/cruise/tools/jdk1.5.0_08/jre/lib/rt.jar(java/lang/InterruptedException.class)]
[wrote /export/cruise/trunk/cc/projects/drlvm/trunk/build/lnx_ia32_gcc_debug/semis/reg.tests/classes/org/apache/harmony/drlvm/tests/regression/h1800/ExecTest.class]
[checking org.apache.harmony.drlvm.tests.regression.h1802.UnresolvedHandlerTest]
[loading /export/cruise/tools/jdk1.5.0_08/jre/lib/rt.jar(java/lang/NoClassDefFoundError.class)]
[loading /export/cruise/tools/jdk1.5.0_08/jre/lib/rt.jar(java/lang/LinkageError.class)]
[wrote /export/cruise/trunk/cc/projects/drlvm/trunk/build/lnx_ia32_gcc_debug/semis/reg.tests/classes/org/apache/harmony/drlvm/tests/regression/h1802/UnresolvedHandlerTest$X.class]
[wrote /export/cruise/trunk/cc/projects/drlvm/trunk/build/lnx_ia32_gcc_debug/semis/reg.tests/classes/org/apache/harmony/drlvm/tests/regression/h1802/UnresolvedHandlerTest.class]
[checking org.apache.harmony.drlvm.tests.regression.h1802.MissedThrowable]
[wrote /export/cruise/trunk/cc/projects/drlvm/trunk/build/lnx_ia32_gcc_debug/semis/reg.tests/classes/org/apache/harmony/drlvm/tests/regression/h1802/MissedThrowable.class]
[checking org.apache.harmony.drlvm.tests.regression.h1802.UnresolvedParamTest]
[wrote /export/cruise/trunk/cc/projects/drlvm/trunk/build/lnx_ia32_gcc_debug/semis/reg.tests/classes/org/apache/harmony/drlvm/tests/regression/h1802/UnresolvedParamTest$X.class]
[wrote /export/cruise/trunk/cc/projects/drlvm/trunk/build/lnx_ia32_gcc_debug/semis/reg.tests/classes/org/apache/harmony/drlvm/tests/regression/h1802/UnresolvedParamTest.class]
[checking org.apache.harmony.drlvm.tests.regression.h1802.Missed]
[wrote /export/cruise/trunk/cc/projects/drlvm/trunk/build/lnx_ia32_gcc_debug/semis/reg.tests/classes/org/apache/harmony/drlvm/tests/regression/h1802/Missed.class]
[checking org.apache.harmony.drlvm.tests.regression.h1857.Test]
[wrote /export/cruise/trunk/cc/projects/drlvm/trunk/build/lnx_ia32_gcc_debug/semis/reg.tests/classes/org/apache/harmony/drlvm/tests/regression/h1857/Test.class]
[checking org.apache.harmony.drlvm.tests.regression.h1857.MissedThrowable]
[wrote /export/cruise/trunk/cc/projects/drlvm/trunk/build/lnx_ia32_gcc_debug/semis/reg.tests/classes/org/apache/harmony/drlvm/tests/regression/h1857/MissedThrowable.class]
[checking org.apache.harmony.drlvm.tests.regression.h1857.TestClass]
[wrote /export/cruise/trunk/cc/projects/drlvm/trunk/build/lnx_ia32_gcc_debug/semis/reg.tests/classes/org/apache/harmony/drlvm/tests/regression/h1857/TestClass.class]
[checking org.apache.harmony.drlvm.tests.regression.h1863.H1863Test]
[loading /export/cruise/tools/jdk1.5.0_08/jre/lib/rt.jar(java/lang/Integer.class)]
[loading /export/cruise/tools/jdk1.5.0_08/jre/lib/rt.jar(java/net/URL.class)]
[loading /export/cruise/tools/jdk1.5.0_08/jre/lib/rt.jar(java/net/URI.class)]
[loading /export/cruise/tools/jdk1.5.0_08/jre/lib/rt.jar(java/net/URISyntaxException.class)]
[wrote /export/cruise/trunk/cc/projects/drlvm/trunk/build/lnx_ia32_gcc_debug/semis/reg.tests/classes/org/apache/harmony/drlvm/tests/regression/h1863/H1863Test.class]
[checking org.apache.harmony.drlvm.tests.regression.h1863.testExec2_App]
[wrote /export/cruise/trunk/cc/projects/drlvm/trunk/build/lnx_ia32_gcc_debug/semis/reg.tests/classes/org/apache/harmony/drlvm/tests/regression/h1863/testExec2_App.class]
[checking org.apache.harmony.drlvm.tests.regression.h2083.Test]
[wrote /export/cruise/trunk/cc/projects/drlvm/trunk/build/lnx_ia32_gcc_debug/semis/reg.tests/classes/org/apache/harmony/drlvm/tests/regression/h2083/Test.class]
[checking org.apache.harmony.drlvm.tests.regression.h2083.TestThread]
[wrote /export/cruise/trunk/cc/projects/drlvm/trunk/build/lnx_ia32_gcc_debug/semis/reg.tests/classes/org/apache/harmony/drlvm/tests/regression/h2083/TestThread.class]
[checking org.apache.harmony.drlvm.tests.regression.h2083.Missed]
[wrote /export/cruise/trunk/cc/projects/drlvm/trunk/build/lnx_ia32_gcc_debug/semis/reg.tests/classes/org/apache/harmony/drlvm/tests/regression/h2083/Missed.class]
[checking org.apache.harmony.drlvm.tests.regression.h2086.Test]
[loading /export/cruise/tools/jdk1.5.0_08/jre/lib/rt.jar(java/util/concurrent/atomic/AtomicLong.class)]
[wrote /export/cruise/trunk/cc/projects/drlvm/trunk/build/lnx_ia32_gcc_debug/semis/reg.tests/classes/org/apache/harmony/drlvm/tests/regression/h2086/Test.class]
[checking org.apache.harmony.drlvm.tests.regression.h2103.Test]
[loading /export/cruise/trunk/cc/projects/drlvm/trunk/build/lnx_ia32_gcc_debug/semis/reg.tests/classes/org/apache/harmony/drlvm/tests/regression/h2103/SupClass.class]
[loading /export/cruise/tools/jdk1.5.0_08/jre/lib/rt.jar(java/lang/VerifyError.class)]
[wrote /export/cruise/trunk/cc/projects/drlvm/trunk/build/lnx_ia32_gcc_debug/semis/reg.tests/classes/org/apache/harmony/drlvm/tests/regression/h2103/Test.class]
[checking org.apache.harmony.drlvm.tests.regression.h2151.VMInit1Test]
[wrote /export/cruise/trunk/cc/projects/drlvm/trunk/build/lnx_ia32_gcc_debug/semis/reg.tests/classes/org/apache/harmony/drlvm/tests/regression/h2151/VMInit1Test.class]
[checking org.apache.harmony.drlvm.tests.regression.h2151.Status]
[wrote /export/cruise/trunk/cc/projects/drlvm/trunk/build/lnx_ia32_gcc_debug/semis/reg.tests/classes/org/apache/harmony/drlvm/tests/regression/h2151/Status.class]
[checking org.apache.harmony.drlvm.tests.regression.h2259.I1]
[wrote /export/cruise/trunk/cc/projects/drlvm/trunk/build/lnx_ia32_gcc_debug/semis/reg.tests/classes/org/apache/harmony/drlvm/tests/regression/h2259/I1.class]
[checking org.apache.harmony.drlvm.tests.regression.h2259.ParentException]
[wrote /export/cruise/trunk/cc/projects/drlvm/trunk/build/lnx_ia32_gcc_debug/semis/reg.tests/classes/org/apache/harmony/drlvm/tests/regression/h2259/ParentException.class]
[checking org.apache.harmony.drlvm.tests.regression.h2259.I2]
[wrote /export/cruise/trunk/cc/projects/drlvm/trunk/build/lnx_ia32_gcc_debug/semis/reg.tests/classes/org/apache/harmony/drlvm/tests/regression/h2259/I2.class]
[checking org.apache.harmony.drlvm.tests.regression.h2259.SubException]
[wrote /export/cruise/trunk/cc/projects/drlvm/trunk/build/lnx_ia32_gcc_debug/semis/reg.tests/classes/org/apache/harmony/drlvm/tests/regression/h2259/SubException.class]
[checking org.apache.harmony.drlvm.tests.regression.h2259.H2259]
[loading /export/cruise/tools/jdk1.5.0_08/jre/lib/rt.jar(java/lang/ArrayStoreException.class)]
[loading /export/cruise/tools/jdk1.5.0_08/jre/lib/rt.jar(java/lang/IllegalArgumentException.class)]
[wrote /export/cruise/trunk/cc/projects/drlvm/trunk/build/lnx_ia32_gcc_debug/semis/reg.tests/classes/org/apache/harmony/drlvm/tests/regression/h2259/H2259$1.class]
[wrote /export/cruise/trunk/cc/projects/drlvm/trunk/build/lnx_ia32_gcc_debug/semis/reg.tests/classes/org/apache/harmony/drlvm/tests/regression/h2259/H2259.class]
[checking org.apache.harmony.drlvm.tests.regression.h2261.RCETest]
[loading /export/cruise/tools/jdk1.5.0_08/jre/lib/rt.jar(java/lang/Math.class)]
[wrote /export/cruise/trunk/cc/projects/drlvm/trunk/build/lnx_ia32_gcc_debug/semis/reg.tests/classes/org/apache/harmony/drlvm/tests/regression/h2261/RCETest.class]
[checking org.apache.harmony.drlvm.tests.regression.h2335.SimplestLibraryPathTest]
[wrote /export/cruise/trunk/cc/projects/drlvm/trunk/build/lnx_ia32_gcc_debug/semis/reg.tests/classes/org/apache/harmony/drlvm/tests/regression/h2335/SimplestLibraryPathTest.class]
[checking org.apache.harmony.drlvm.tests.regression.h2644.BootDelegationTest]
[wrote /export/cruise/trunk/cc/projects/drlvm/trunk/build/lnx_ia32_gcc_debug/semis/reg.tests/classes/org/apache/harmony/drlvm/tests/regression/h2644/BootDelegationTest.class]
[checking org.apache.harmony.drlvm.tests.regression.h2644.SuperClass]
[wrote /export/cruise/trunk/cc/projects/drlvm/trunk/build/lnx_ia32_gcc_debug/semis/reg.tests/classes/org/apache/harmony/drlvm/tests/regression/h2644/SuperClass.class]
[checking org.apache.harmony.drlvm.tests.regression.h2644.SubClass]
[wrote /export/cruise/trunk/cc/projects/drlvm/trunk/build/lnx_ia32_gcc_debug/semis/reg.tests/classes/org/apache/harmony/drlvm/tests/regression/h2644/SubClass.class]
[checking org.apache.harmony.drlvm.tests.regression.H2773.InfinityTest]
[loading /export/cruise/tools/jdk1.5.0_08/jre/lib/rt.jar(java/lang/Byte.class)]
[loading /export/cruise/tools/jdk1.5.0_08/jre/lib/rt.jar(java/lang/Character.class)]
[loading /export/cruise/tools/jdk1.5.0_08/jre/lib/rt.jar(java/lang/Short.class)]
[loading /export/cruise/tools/jdk1.5.0_08/jre/lib/rt.jar(java/lang/Long.class)]
[loading /export/cruise/tools/jdk1.5.0_08/jre/lib/rt.jar(java/lang/Boolean.class)]
[loading /export/cruise/tools/jdk1.5.0_08/jre/lib/rt.jar(java/lang/Void.class)]
[wrote /export/cruise/trunk/cc/projects/drlvm/trunk/build/lnx_ia32_gcc_debug/semis/reg.tests/classes/org/apache/harmony/drlvm/tests/regression/H2773/InfinityTest.class]
[checking org.apache.harmony.drlvm.tests.regression.h2808.finTest]
[loading /export/cruise/trunk/cc/projects/drlvm/trunk/build/lnx_ia32_gcc_debug/semis/reg.tests/classes/org/apache/harmony/drlvm/tests/regression/h2808/finTest1.class]
[wrote /export/cruise/trunk/cc/projects/drlvm/trunk/build/lnx_ia32_gcc_debug/semis/reg.tests/classes/org/apache/harmony/drlvm/tests/regression/h2808/finTest.class]
[checking org.apache.harmony.drlvm.tests.regression.h2846.NoVerifyTest]
[wrote /export/cruise/trunk/cc/projects/drlvm/trunk/build/lnx_ia32_gcc_debug/semis/reg.tests/classes/org/apache/harmony/drlvm/tests/regression/h2846/NoVerifyTest.class]
[checking org.apache.harmony.drlvm.tests.regression.H2873.RemTest]
[wrote /export/cruise/trunk/cc/projects/drlvm/trunk/build/lnx_ia32_gcc_debug/semis/reg.tests/classes/org/apache/harmony/drlvm/tests/regression/H2873/RemTest.class]
[checking org.apache.harmony.drlvm.tests.regression.H2874.aeo0]
[wrote /export/cruise/trunk/cc/projects/drlvm/trunk/build/lnx_ia32_gcc_debug/semis/reg.tests/classes/org/apache/harmony/drlvm/tests/regression/H2874/aeo0.class]
[checking org.apache.harmony.drlvm.tests.regression.H2874.aeo1]
[wrote /export/cruise/trunk/cc/projects/drlvm/trunk/build/lnx_ia32_gcc_debug/semis/reg.tests/classes/org/apache/harmony/drlvm/tests/regression/H2874/aeo1.class]
[checking org.apache.harmony.drlvm.tests.regression.H2874.Test]
[wrote /export/cruise/trunk/cc/projects/drlvm/trunk/build/lnx_ia32_gcc_debug/semis/reg.tests/classes/org/apache/harmony/drlvm/tests/regression/H2874/Test.class]
[checking org.apache.harmony.drlvm.tests.regression.h2899.ManyArgsTest]
[wrote /export/cruise/trunk/cc/projects/drlvm/trunk/build/lnx_ia32_gcc_debug/semis/reg.tests/classes/org/apache/harmony/drlvm/tests/regression/h2899/ManyArgsTest.class]
[checking org.apache.harmony.drlvm.tests.regression.h2926.MyException]
[wrote /export/cruise/trunk/cc/projects/drlvm/trunk/build/lnx_ia32_gcc_debug/semis/reg.tests/classes/org/apache/harmony/drlvm/tests/regression/h2926/MyException.class]
[checking org.apache.harmony.drlvm.tests.regression.h2926.Test]
[loading /export/cruise/trunk/cc/projects/drlvm/trunk/build/lnx_ia32_gcc_debug/semis/reg.tests/classes/org/apache/harmony/drlvm/tests/regression/h2926/TestClass.class]
[wrote /export/cruise/trunk/cc/projects/drlvm/trunk/build/lnx_ia32_gcc_debug/semis/reg.tests/classes/org/apache/harmony/drlvm/tests/regression/h2926/Test.class]
[checking org.apache.harmony.drlvm.tests.regression.h2926.Status]
[wrote /export/cruise/trunk/cc/projects/drlvm/trunk/build/lnx_ia32_gcc_debug/semis/reg.tests/classes/org/apache/harmony/drlvm/tests/regression/h2926/Status.class]
[checking org.apache.harmony.drlvm.tests.regression.h3027.AgentLibTest]
[wrote /export/cruise/trunk/cc/projects/drlvm/trunk/build/lnx_ia32_gcc_debug/semis/reg.tests/classes/org/apache/harmony/drlvm/tests/regression/h3027/AgentLibTest.class]
[checking org.apache.harmony.drlvm.tests.regression.h3027.Status]
[wrote /export/cruise/trunk/cc/projects/drlvm/trunk/build/lnx_ia32_gcc_debug/semis/reg.tests/classes/org/apache/harmony/drlvm/tests/regression/h3027/Status.class]
[checking org.apache.harmony.drlvm.tests.regression.h3048.H3048]
[wrote /export/cruise/trunk/cc/projects/drlvm/trunk/build/lnx_ia32_gcc_debug/semis/reg.tests/classes/org/apache/harmony/drlvm/tests/regression/h3048/H3048.class]
[checking org.apache.harmony.drlvm.tests.regression.h3048.MyTest]
[wrote /export/cruise/trunk/cc/projects/drlvm/trunk/build/lnx_ia32_gcc_debug/semis/reg.tests/classes/org/apache/harmony/drlvm/tests/regression/h3048/MyTest.class]
[checking org.apache.harmony.drlvm.tests.regression.h3048.MyTestSuper]
[wrote /export/cruise/trunk/cc/projects/drlvm/trunk/build/lnx_ia32_gcc_debug/semis/reg.tests/classes/org/apache/harmony/drlvm/tests/regression/h3048/MyTestSuper.class]
[checking org.apache.harmony.drlvm.tests.regression.h3048.MyException]
[wrote /export/cruise/trunk/cc/projects/drlvm/trunk/build/lnx_ia32_gcc_debug/semis/reg.tests/classes/org/apache/harmony/drlvm/tests/regression/h3048/MyException.class]
[checking org.apache.harmony.drlvm.tests.regression.h3067.Test]
[loading /export/cruise/tools/jdk1.5.0_08/jre/lib/rt.jar(java/lang/Package.class)]
[loading /export/cruise/tools/jdk1.5.0_08/jre/lib/rt.jar(java/lang/ClassFormatError.class)]
[loading /export/cruise/tools/jdk1.5.0_08/jre/lib/rt.jar(java/lang/InstantiationException.class)]
[loading /export/cruise/tools/jdk1.5.0_08/jre/lib/rt.jar(java/lang/IllegalAccessException.class)]
[wrote /export/cruise/trunk/cc/projects/drlvm/trunk/build/lnx_ia32_gcc_debug/semis/reg.tests/classes/org/apache/harmony/drlvm/tests/regression/h3067/Test$Loader.class]
[wrote /export/cruise/trunk/cc/projects/drlvm/trunk/build/lnx_ia32_gcc_debug/semis/reg.tests/classes/org/apache/harmony/drlvm/tests/regression/h3067/Test.class]
[checking org.apache.harmony.drlvm.tests.regression.h3074.AnotherClass]
[wrote /export/cruise/trunk/cc/projects/drlvm/trunk/build/lnx_ia32_gcc_debug/semis/reg.tests/classes/org/apache/harmony/drlvm/tests/regression/h3074/AnotherClass.class]
[checking org.apache.harmony.drlvm.tests.regression.h3074.Test]
[wrote /export/cruise/trunk/cc/projects/drlvm/trunk/build/lnx_ia32_gcc_debug/semis/reg.tests/classes/org/apache/harmony/drlvm/tests/regression/h3074/Test.class]
[checking org.apache.harmony.drlvm.tests.regression.H3110.FieldTest]
[loading /export/cruise/tools/jdk1.5.0_08/jre/lib/rt.jar(java/lang/reflect/Field.class)]
[loading /export/cruise/tools/jdk1.5.0_08/jre/lib/rt.jar(java/lang/NoSuchFieldException.class)]
[loading /export/cruise/tools/jdk1.5.0_08/jre/lib/rt.jar(java/lang/SecurityException.class)]
[loading /export/cruise/tools/jdk1.5.0_08/jre/lib/rt.jar(java/lang/reflect/AccessibleObject.class)]
[wrote /export/cruise/trunk/cc/projects/drlvm/trunk/build/lnx_ia32_gcc_debug/semis/reg.tests/classes/org/apache/harmony/drlvm/tests/regression/H3110/FieldTest.class]
[checking org.apache.harmony.drlvm.tests.regression.h3121.H3121]
[wrote /export/cruise/trunk/cc/projects/drlvm/trunk/build/lnx_ia32_gcc_debug/semis/reg.tests/classes/org/apache/harmony/drlvm/tests/regression/h3121/H3121.class]
[checking org.apache.harmony.drlvm.tests.regression.h3121.Intf]
[wrote /export/cruise/trunk/cc/projects/drlvm/trunk/build/lnx_ia32_gcc_debug/semis/reg.tests/classes/org/apache/harmony/drlvm/tests/regression/h3121/Intf.class]
[checking org.apache.harmony.drlvm.tests.regression.h3121.IntfClass]
[wrote /export/cruise/trunk/cc/projects/drlvm/trunk/build/lnx_ia32_gcc_debug/semis/reg.tests/classes/org/apache/harmony/drlvm/tests/regression/h3121/IntfClass.class]
[checking org.apache.harmony.drlvm.tests.regression.h3130.CallNativeTest]
[wrote /export/cruise/trunk/cc/projects/drlvm/trunk/build/lnx_ia32_gcc_debug/semis/reg.tests/classes/org/apache/harmony/drlvm/tests/regression/h3130/CallNativeTest.class]
[checking org.apache.harmony.drlvm.tests.regression.h3150.Test]
[wrote /export/cruise/trunk/cc/projects/drlvm/trunk/build/lnx_ia32_gcc_debug/semis/reg.tests/classes/org/apache/harmony/drlvm/tests/regression/h3150/Test.class]
[checking org.apache.harmony.drlvm.tests.regression.h3150.classToDelete]
[wrote /export/cruise/trunk/cc/projects/drlvm/trunk/build/lnx_ia32_gcc_debug/semis/reg.tests/classes/org/apache/harmony/drlvm/tests/regression/h3150/classToDelete.class]
[checking org.apache.harmony.drlvm.tests.regression.h3175.Test]
[wrote /export/cruise/trunk/cc/projects/drlvm/trunk/build/lnx_ia32_gcc_debug/semis/reg.tests/classes/org/apache/harmony/drlvm/tests/regression/h3175/Test.class]
[checking org.apache.harmony.drlvm.tests.regression.h3216.ASETest]
[wrote /export/cruise/trunk/cc/projects/drlvm/trunk/build/lnx_ia32_gcc_debug/semis/reg.tests/classes/org/apache/harmony/drlvm/tests/regression/h3216/ASETest.class]
[checking org.apache.harmony.drlvm.tests.regression.h3225.NegativeJsrTest]
[loading /export/cruise/trunk/cc/projects/drlvm/trunk/build/lnx_ia32_gcc_debug/semis/reg.tests/classes/org/apache/harmony/drlvm/tests/regression/h3225/MergeExecutionNegativeTest.class]
[loading /export/cruise/trunk/cc/projects/drlvm/trunk/build/lnx_ia32_gcc_debug/semis/reg.tests/classes/org/apache/harmony/drlvm/tests/regression/h3225/MergeEmptyStackNegativeTest.class]
[loading /export/cruise/trunk/cc/projects/drlvm/trunk/build/lnx_ia32_gcc_debug/semis/reg.tests/classes/org/apache/harmony/drlvm/tests/regression/h3225/MergeIntFloatNegativeTest.class]
[loading /export/cruise/trunk/cc/projects/drlvm/trunk/build/lnx_ia32_gcc_debug/semis/reg.tests/classes/org/apache/harmony/drlvm/tests/regression/h3225/MergeStackNegativeTest.class]
[wrote /export/cruise/trunk/cc/projects/drlvm/trunk/build/lnx_ia32_gcc_debug/semis/reg.tests/classes/org/apache/harmony/drlvm/tests/regression/h3225/NegativeJsrTest.class]
[checking org.apache.harmony.drlvm.tests.regression.h3225.PerfTest]
[loading /export/cruise/tools/jdk1.5.0_08/jre/lib/rt.jar(java/io/PrintWriter.class)]
[loading /export/cruise/tools/jdk1.5.0_08/jre/lib/rt.jar(java/util/SortedSet.class)]
[loading /export/cruise/tools/jdk1.5.0_08/jre/lib/rt.jar(java/util/Collection.class)]
[loading /export/cruise/tools/jdk1.5.0_08/jre/lib/rt.jar(java/util/Comparator.class)]
[loading /export/cruise/tools/jdk1.5.0_08/jre/lib/rt.jar(java/util/SortedMap.class)]
[loading /export/cruise/tools/jdk1.5.0_08/jre/lib/rt.jar(java/util/AbstractSet.class)]
[loading /export/cruise/tools/jdk1.5.0_08/jre/lib/rt.jar(java/util/AbstractCollection.class)]
[loading /export/cruise/tools/jdk1.5.0_08/jre/lib/rt.jar(java/lang/Iterable.class)]
[loading /export/cruise/tools/jdk1.5.0_08/jre/lib/rt.jar(java/util/zip/ZipFile.class)]
[loading /export/cruise/tools/jdk1.5.0_08/jre/lib/rt.jar(java/util/zip/ZipEntry.class)]
[loading /export/cruise/tools/jdk1.5.0_08/jre/lib/rt.jar(java/lang/reflect/Constructor.class)]
[wrote /export/cruise/trunk/cc/projects/drlvm/trunk/build/lnx_ia32_gcc_debug/semis/reg.tests/classes/org/apache/harmony/drlvm/tests/regression/h3225/PerfTest$Loader.class]
[wrote /export/cruise/trunk/cc/projects/drlvm/trunk/build/lnx_ia32_gcc_debug/semis/reg.tests/classes/org/apache/harmony/drlvm/tests/regression/h3225/PerfTest.class]
[checking org.apache.harmony.drlvm.tests.regression.h3228.H3228]
[wrote /export/cruise/trunk/cc/projects/drlvm/trunk/build/lnx_ia32_gcc_debug/semis/reg.tests/classes/org/apache/harmony/drlvm/tests/regression/h3228/H3228.class]
[checking TestInterruptTimedWaiting]
[loading /export/cruise/tools/jdk1.5.0_08/jre/lib/rt.jar(java/lang/Thread$State.class)]
[loading /export/cruise/tools/jdk1.5.0_08/jre/lib/rt.jar(java/lang/Enum.class)]
[wrote /export/cruise/trunk/cc/projects/drlvm/trunk/build/lnx_ia32_gcc_debug/semis/reg.tests/classes/TestInterruptTimedWaiting$ThreadWaiting.class]
[wrote /export/cruise/trunk/cc/projects/drlvm/trunk/build/lnx_ia32_gcc_debug/semis/reg.tests/classes/TestInterruptTimedWaiting.class]
[checking org.apache.harmony.drlvm.tests.regression.h3283.JavaLibraryPathTest]
[wrote /export/cruise/trunk/cc/projects/drlvm/trunk/build/lnx_ia32_gcc_debug/semis/reg.tests/classes/org/apache/harmony/drlvm/tests/regression/h3283/JavaLibraryPathTest.class]
[checking org.apache.harmony.drlvm.tests.regression.h3285.Test]
[wrote /export/cruise/trunk/cc/projects/drlvm/trunk/build/lnx_ia32_gcc_debug/semis/reg.tests/classes/org/apache/harmony/drlvm/tests/regression/h3285/Test.class]
[checking org.apache.harmony.drlvm.tests.regression.h3317.GetFieldDeclaringClassTest]
[wrote /export/cruise/trunk/cc/projects/drlvm/trunk/build/lnx_ia32_gcc_debug/semis/reg.tests/classes/org/apache/harmony/drlvm/tests/regression/h3317/GetFieldDeclaringClassTest.class]
[checking org.apache.harmony.drlvm.tests.regression.h3317.Status]
[wrote /export/cruise/trunk/cc/projects/drlvm/trunk/build/lnx_ia32_gcc_debug/semis/reg.tests/classes/org/apache/harmony/drlvm/tests/regression/h3317/Status.class]
[checking org.apache.harmony.drlvm.tests.regression.h3317.Parent]
[wrote /export/cruise/trunk/cc/projects/drlvm/trunk/build/lnx_ia32_gcc_debug/semis/reg.tests/classes/org/apache/harmony/drlvm/tests/regression/h3317/Parent.class]
[checking org.apache.harmony.drlvm.tests.regression.h3317.Child]
[wrote /export/cruise/trunk/cc/projects/drlvm/trunk/build/lnx_ia32_gcc_debug/semis/reg.tests/classes/org/apache/harmony/drlvm/tests/regression/h3317/Child.class]
[checking org.apache.harmony.drlvm.tests.regression.h3380.LongToBitsTest]
[loading /export/cruise/tools/jdk1.5.0_08/jre/lib/rt.jar(java/lang/Appendable.class)]
[loading /export/cruise/tools/jdk1.5.0_08/jre/lib/rt.jar(java/util/Locale.class)]
[wrote /export/cruise/trunk/cc/projects/drlvm/trunk/build/lnx_ia32_gcc_debug/semis/reg.tests/classes/org/apache/harmony/drlvm/tests/regression/h3380/LongToBitsTest.class]
[checking org.apache.harmony.drlvm.tests.regression.h3404.H3404]
[wrote /export/cruise/trunk/cc/projects/drlvm/trunk/build/lnx_ia32_gcc_debug/semis/reg.tests/classes/org/apache/harmony/drlvm/tests/regression/h3404/H3404.class]
[checking org.apache.harmony.drlvm.tests.regression.h3404.MyException]
[wrote /export/cruise/trunk/cc/projects/drlvm/trunk/build/lnx_ia32_gcc_debug/semis/reg.tests/classes/org/apache/harmony/drlvm/tests/regression/h3404/MyException.class]
[checking org.apache.harmony.drlvm.tests.regression.h3505.GetFieldModifiersTest]
[wrote /export/cruise/trunk/cc/projects/drlvm/trunk/build/lnx_ia32_gcc_debug/semis/reg.tests/classes/org/apache/harmony/drlvm/tests/regression/h3505/GetFieldModifiersTest.class]
[checking org.apache.harmony.drlvm.tests.regression.h3505.Status]
[wrote /export/cruise/trunk/cc/projects/drlvm/trunk/build/lnx_ia32_gcc_debug/semis/reg.tests/classes/org/apache/harmony/drlvm/tests/regression/h3505/Status.class]
[checking org.apache.harmony.drlvm.tests.regression.h3505.Parent]
[wrote /export/cruise/trunk/cc/projects/drlvm/trunk/build/lnx_ia32_gcc_debug/semis/reg.tests/classes/org/apache/harmony/drlvm/tests/regression/h3505/Parent.class]
[checking org.apache.harmony.drlvm.tests.regression.h3505.Child]
[wrote /export/cruise/trunk/cc/projects/drlvm/trunk/build/lnx_ia32_gcc_debug/semis/reg.tests/classes/org/apache/harmony/drlvm/tests/regression/h3505/Child.class]
[checking org.apache.harmony.drlvm.tests.regression.h3619.ObjectLongWaitTest]
[wrote /export/cruise/trunk/cc/projects/drlvm/trunk/build/lnx_ia32_gcc_debug/semis/reg.tests/classes/org/apache/harmony/drlvm/tests/regression/h3619/ObjectLongWaitTest.class]
[checking org.apache.harmony.drlvm.tests.regression.h3619.TestThread]
[wrote /export/cruise/trunk/cc/projects/drlvm/trunk/build/lnx_ia32_gcc_debug/semis/reg.tests/classes/org/apache/harmony/drlvm/tests/regression/h3619/TestThread.class]
[checking org.apache.harmony.drlvm.tests.regression.h3652.Test]
[wrote /export/cruise/trunk/cc/projects/drlvm/trunk/build/lnx_ia32_gcc_debug/semis/reg.tests/classes/org/apache/harmony/drlvm/tests/regression/h3652/Test.class]
[checking org.apache.harmony.drlvm.tests.regression.h3691.Test]
[wrote /export/cruise/trunk/cc/projects/drlvm/trunk/build/lnx_ia32_gcc_debug/semis/reg.tests/classes/org/apache/harmony/drlvm/tests/regression/h3691/Test.class]
[checking org.apache.harmony.drlvm.tests.regression.h788.Test]
[wrote /export/cruise/trunk/cc/projects/drlvm/trunk/build/lnx_ia32_gcc_debug/semis/reg.tests/classes/org/apache/harmony/drlvm/tests/regression/h788/Test.class]
[total 2512ms]
## Compiling reg native ${outname}
## Compiling reg native ${outname}
## Compiling reg native ${outname}
## Compiling reg native ${outname}
## Compiling reg native ${outname}
## Compiling reg native ${outname}
## Compiling reg native ${outname}
## Compiling reg native ${outname}
## Compiling reg native ${outname}
## Compiling reg native ${outname}

=====================================
DRLVM Regression Testing on platform: linux.x86
=====================================
        
Jitrino crashed
SSE instruction found: CMOVNZ
vf_debug: verifying class org/apache/harmony/drlvm/tests/regression/h1857/TestClass (method tryMe()V) couldn't load class "org/apache/harmony/drlvm/tests/regression/h1857/MissedThrowable"
vf_debug: VerifyError: Couldn't load class: org/apache/harmony/drlvm/tests/regression/h1857/MissedThrowable
Running on JET
vf_debug: VerifyError: (class: org/apache/harmony/drlvm/tests/regression/h2103/SupClass, method: test()I) Incompatible object argument for invokespecial
vf_debug: verifying class org/apache/harmony/drlvm/tests/regression/h2808/finTest1 (method test()V) couldn't load class "org/apache/harmony/drlvm/tests/regression/h2808/finTest2"
vf_debug: VerifyError: Couldn't load class: org/apache/harmony/drlvm/tests/regression/h2808/finTest2
Running on JIT
vf_debug: verifying class org/apache/harmony/drlvm/tests/regression/h3048/MyTestSuper (method <clinit>()V) couldn't load class "org/apache/harmony/drlvm/tests/regression/h3048/MyException"
vf_debug: VerifyError: Couldn't load class: org/apache/harmony/drlvm/tests/regression/h3048/MyException
Running on OPT
Running on OPT
Operand live at entry: t9(XMM0S):single
This means there is a use of the operand when it is not yet defined
Operand live at entry: o40(FP1S):single
This means there is a use of the operand when it is not yet defined
Liveness verification failure
Verification failure after i586
[Fatal Error] :-1:-1: Premature end of file.
The file /export/cruise/trunk/cc/projects/drlvm/trunk/build/lnx_ia32_gcc_debug/semis/reg.tests/reports/TEST-org.apache.harmony.drlvm.tests.regression.H1578.NaNTest.xml is not a valid XML document. It is possibly corrupted.
========================================
Regression testing report was stored in:
========================================
/export/cruise/trunk/cc/projects/drlvm/trunk/build/lnx_ia32_gcc_debug/semis/reg.tests/reports/html
========================================

***********************************************************
Unit Tests: (55)
        
error: unknown org.apache.harmony.drlvm.tests.regression.h1840.SimplestTest
error: unknown org.apache.harmony.drlvm.tests.regression.h2083.Test
error: unknown org.apache.harmony.drlvm.tests.regression.h2151.VMInit1Test
error: unknown org.apache.harmony.drlvm.tests.regression.h2926.Test
error: unknown org.apache.harmony.drlvm.tests.regression.h3027.AgentLibTest
error: unknown org.apache.harmony.drlvm.tests.regression.h3317.GetFieldDeclaringClassTest
error: unknown org.apache.harmony.drlvm.tests.regression.h3380.LongToBitsTest
error: unknown org.apache.harmony.drlvm.tests.regression.h3446.SubSubTest
error: unknown org.apache.harmony.drlvm.tests.regression.h3505.GetFieldModifiersTest
Unit Test Error Details:	(9)
                
Test: unknownClass: org.apache.harmony.drlvm.tests.regression.h1840.SimplestTestjunit.framework.AssertionFailedError: Timeout occurred
	at net.sf.antcontrib.logic.TryCatchTask.execute(TryCatchTask.java:206)
	at net.sf.antcontrib.logic.IfTask.execute(IfTask.java:197)
	at net.sf.antcontrib.logic.ForDelegate.doSequentialIteration(ForDelegate.java:228)
	at net.sf.antcontrib.logic.ForDelegate.doTheTasks(ForDelegate.java:281)
	at net.sf.antcontrib.logic.ForDelegate.execute(ForDelegate.java:213)
	at net.sf.antcontrib.logic.For.execute(For.java:166)

Test: unknownClass: org.apache.harmony.drlvm.tests.regression.h2083.Testjunit.framework.AssertionFailedError: Timeout occurred
	at net.sf.antcontrib.logic.TryCatchTask.execute(TryCatchTask.java:206)
	at net.sf.antcontrib.logic.IfTask.execute(IfTask.java:197)
	at net.sf.antcontrib.logic.ForDelegate.doSequentialIteration(ForDelegate.java:228)
	at net.sf.antcontrib.logic.ForDelegate.doTheTasks(ForDelegate.java:281)
	at net.sf.antcontrib.logic.ForDelegate.execute(ForDelegate.java:213)
	at net.sf.antcontrib.logic.For.execute(For.java:166)

Test: unknownClass: org.apache.harmony.drlvm.tests.regression.h2151.VMInit1Testjunit.framework.AssertionFailedError: Timeout occurred
	at net.sf.antcontrib.logic.TryCatchTask.execute(TryCatchTask.java:206)
	at net.sf.antcontrib.logic.IfTask.execute(IfTask.java:197)
	at net.sf.antcontrib.logic.ForDelegate.doSequentialIteration(ForDelegate.java:228)
	at net.sf.antcontrib.logic.ForDelegate.doTheTasks(ForDelegate.java:281)
	at net.sf.antcontrib.logic.ForDelegate.execute(ForDelegate.java:213)
	at net.sf.antcontrib.logic.For.execute(For.java:166)

Test: unknownClass: org.apache.harmony.drlvm.tests.regression.h2926.Testjunit.framework.AssertionFailedError: Timeout occurred
	at net.sf.antcontrib.logic.TryCatchTask.execute(TryCatchTask.java:206)
	at net.sf.antcontrib.logic.IfTask.execute(IfTask.java:197)
	at net.sf.antcontrib.logic.ForDelegate.doSequentialIteration(ForDelegate.java:228)
	at net.sf.antcontrib.logic.ForDelegate.doTheTasks(ForDelegate.java:281)
	at net.sf.antcontrib.logic.ForDelegate.execute(ForDelegate.java:213)
	at net.sf.antcontrib.logic.For.execute(For.java:166)

Test: unknownClass: org.apache.harmony.drlvm.tests.regression.h3027.AgentLibTestjunit.framework.AssertionFailedError: Timeout occurred
	at net.sf.antcontrib.logic.TryCatchTask.execute(TryCatchTask.java:206)
	at net.sf.antcontrib.logic.IfTask.execute(IfTask.java:197)
	at net.sf.antcontrib.logic.ForDelegate.doSequentialIteration(ForDelegate.java:228)
	at net.sf.antcontrib.logic.ForDelegate.doTheTasks(ForDelegate.java:281)
	at net.sf.antcontrib.logic.ForDelegate.execute(ForDelegate.java:213)
	at net.sf.antcontrib.logic.For.execute(For.java:166)

Test: unknownClass: org.apache.harmony.drlvm.tests.regression.h3317.GetFieldDeclaringClassTestjunit.framework.AssertionFailedError: Timeout occurred
	at net.sf.antcontrib.logic.TryCatchTask.execute(TryCatchTask.java:206)
	at net.sf.antcontrib.logic.IfTask.execute(IfTask.java:197)
	at net.sf.antcontrib.logic.ForDelegate.doSequentialIteration(ForDelegate.java:228)
	at net.sf.antcontrib.logic.ForDelegate.doTheTasks(ForDelegate.java:281)
	at net.sf.antcontrib.logic.ForDelegate.execute(ForDelegate.java:213)
	at net.sf.antcontrib.logic.For.execute(For.java:166)

Test: unknownClass: org.apache.harmony.drlvm.tests.regression.h3380.LongToBitsTestjunit.framework.AssertionFailedError: Timeout occurred
	at net.sf.antcontrib.logic.TryCatchTask.execute(TryCatchTask.java:206)
	at net.sf.antcontrib.logic.IfTask.execute(IfTask.java:197)
	at net.sf.antcontrib.logic.ForDelegate.doSequentialIteration(ForDelegate.java:228)
	at net.sf.antcontrib.logic.ForDelegate.doTheTasks(ForDelegate.java:281)
	at net.sf.antcontrib.logic.ForDelegate.execute(ForDelegate.java:213)
	at net.sf.antcontrib.logic.For.execute(For.java:166)

Test: unknownClass: org.apache.harmony.drlvm.tests.regression.h3446.SubSubTestjunit.framework.AssertionFailedError: Timeout occurred
	at net.sf.antcontrib.logic.TryCatchTask.execute(TryCatchTask.java:206)
	at net.sf.antcontrib.logic.IfTask.execute(IfTask.java:197)
	at net.sf.antcontrib.logic.ForDelegate.doSequentialIteration(ForDelegate.java:228)
	at net.sf.antcontrib.logic.ForDelegate.doTheTasks(ForDelegate.java:281)
	at net.sf.antcontrib.logic.ForDelegate.execute(ForDelegate.java:213)
	at net.sf.antcontrib.logic.For.execute(For.java:166)

Test: unknownClass: org.apache.harmony.drlvm.tests.regression.h3505.GetFieldModifiersTestjunit.framework.AssertionFailedError: Timeout occurred
	at net.sf.antcontrib.logic.TryCatchTask.execute(TryCatchTask.java:206)
	at net.sf.antcontrib.logic.IfTask.execute(IfTask.java:197)
	at net.sf.antcontrib.logic.ForDelegate.doSequentialIteration(ForDelegate.java:228)
	at net.sf.antcontrib.logic.ForDelegate.doTheTasks(ForDelegate.java:281)
	at net.sf.antcontrib.logic.ForDelegate.execute(ForDelegate.java:213)
	at net.sf.antcontrib.logic.For.execute(For.java:166)


***********************************************************
Modifications since last successful build:	(3)
            
modified ndbeyer  /harmony/enhanced/drlvm/trunk/vm/vmcore/src/thread/win/atomics.cpp 04/23/2007 08:52:31 Add locks, mfence and sfence instructions to align windows with linux
modified ndbeyer  /harmony/enhanced/drlvm/trunk/vm/port/src/thread/win/apr_thread_ext.c 04/23/2007 08:52:31 Add locks, mfence and sfence instructions to align windows with linux
modified xli  /harmony/enhanced/drlvm/trunk/vm/vmcore/src/init/vm_properties.cpp 04/21/2007 21:43:01 [DRLVM][GC] switch to GCv5 as default GC for one-week trial

Mime
View raw message