harmony-alerts mailing list archives

Site index · List index
Message view « Date » · « Thread »
Top « Date » · « Thread »
From nom...@intel.com
Subject [build-test alert] BUILD FAILED LINUX SUSE 9 x86_64: harmony HDK
Date Tue, 17 Apr 2007 05:45:21 GMT
BUILD FAILED:
	Ant Error Message:
/export/users/tst/cc/projects/trunk/build.xml:349: exec returned: 1

Date of build:	04/17/2007 12:15:45
Time to build:	27 minutes 0 seconds
Last changed:	04/17/2007 12:08:00
Last log entry:	Rework atomics code so that it will work on P3 processors.

***********************************************************
Execution log (errors/warnings messages):	

                   Apache Harmony Federated Build
            ==========================================
            svn rev          :  r529487
            operating system :  linux
            architecture     :  x86_64-64
            ant os name/arch :  Linux/amd64
            build mode       :  release
            output location  :  target
            DRLVM classlib   :  ../../../working_classlib
        
Checking depends/jars/yoko_M2-20070130/yoko.jar
Checksum verified (true)
Checking depends/jars/yoko_M2-20070130/yoko-core.jar
Checksum verified (true)
Checking depends/jars/yoko_M2-20070130/yoko-rmi-impl.jar
Checksum verified (true)
Checking depends/jars/yoko_M2-20070130/yoko-rmi-spec.jar
Checksum verified (true)
Checking depends/jars/bcel-5.2/bcel-5.2.jar
Checksum verified (true)
Checking depends/jars/xalan-j_2.7.0/xalan.jar
Checksum verified (true)
Checking depends/jars/xerces_2.9.0/xerces.zip
Checksum verified (true)
Checking depends/jars/junit_3.8.2/junit.jar
Checksum verified (true)
Checking depends/jars/bcprov-jdk15-134/bcprov.jar
Checksum verified (true)
Checking depends/jars/icu4j_3.4.4/icu4j_3_4_4.jar
Checksum verified (true)
Checking depends/jars/mx4j_3.0.2/mx4j.zip
Checksum verified (true)
Checking depends/jars/ecj_3.2/ecj_3.2.jar
Checksum verified (true)
Checking depends/jars/jetty/jetty-6.0.0.jar
Checksum verified (true)
Checking depends/jars/jetty/jetty-util-6.0.0.jar
Checksum verified (true)
Checking depends/jars/jetty/servlet-api-2.5-6.0.0.jar
Checksum verified (true)
/export/users/tst/cc/projects/trunk/working_classlib/modules/accessibility/bin/test not found.
/export/users/tst/cc/projects/trunk/working_classlib/modules/annotation/bin/test not found.
/export/users/tst/cc/projects/trunk/working_classlib/modules/applet/bin/test not found.
/export/users/tst/cc/projects/trunk/working_classlib/modules/archive/bin/test not found.
/export/users/tst/cc/projects/trunk/working_classlib/modules/auth/bin/test not found.
/export/users/tst/cc/projects/trunk/working_classlib/modules/awt/bin/test not found.
/export/users/tst/cc/projects/trunk/working_classlib/modules/beans/bin/test not found.
/export/users/tst/cc/projects/trunk/working_classlib/modules/concurrent/bin/test not found.
/export/users/tst/cc/projects/trunk/working_classlib/modules/crypto/bin/test not found.
/export/users/tst/cc/projects/trunk/working_classlib/modules/imageio/bin/test not found.
/export/users/tst/cc/projects/trunk/working_classlib/modules/instrument/bin/test not found.
/export/users/tst/cc/projects/trunk/working_classlib/modules/jndi/bin/test not found.
/export/users/tst/cc/projects/trunk/working_classlib/modules/lang-management/bin/api not found.
/export/users/tst/cc/projects/trunk/working_classlib/modules/lang-management/bin/impl not
found.
/export/users/tst/cc/projects/trunk/working_classlib/modules/logging/bin/test not found.
/export/users/tst/cc/projects/trunk/working_classlib/modules/luni/bin/test not found.
/export/users/tst/cc/projects/trunk/working_classlib/modules/math/bin/test not found.
/export/users/tst/cc/projects/trunk/working_classlib/modules/misc/bin/test not found.
/export/users/tst/cc/projects/trunk/working_classlib/modules/nio/bin/test not found.
/export/users/tst/cc/projects/trunk/working_classlib/modules/nio_char/bin/test not found.
/export/users/tst/cc/projects/trunk/working_classlib/modules/pack200/bin/test not found.
/export/users/tst/cc/projects/trunk/working_classlib/modules/prefs/bin/test not found.
/export/users/tst/cc/projects/trunk/working_classlib/modules/print/bin/test not found.
/export/users/tst/cc/projects/trunk/working_classlib/modules/regex/bin/test not found.
/export/users/tst/cc/projects/trunk/working_classlib/modules/rmi/bin/test not found.
/export/users/tst/cc/projects/trunk/working_classlib/modules/security/bin/test not found.
/export/users/tst/cc/projects/trunk/working_classlib/modules/sound/bin/test not found.
/export/users/tst/cc/projects/trunk/working_classlib/modules/sql/bin/test not found.
/export/users/tst/cc/projects/trunk/working_classlib/modules/suncompat/bin/test not found.
/export/users/tst/cc/projects/trunk/working_classlib/modules/swing/bin/test not found.
/export/users/tst/cc/projects/trunk/working_classlib/modules/text/bin/test not found.
/export/users/tst/cc/projects/trunk/working_classlib/modules/tools/bin/test not found.
/export/users/tst/cc/projects/trunk/working_classlib/modules/x-net/bin/test not found.
/export/users/tst/cc/projects/trunk/working_classlib/deploy/jdk/include not found.

========================================
Building Java component archives...
========================================
        
Checking for depends/jars/yoko_M2-20070130/yoko.jar
Checking for depends/jars/yoko_M2-20070130/yoko-core.jar
Checking for depends/jars/yoko_M2-20070130/yoko-rmi-impl.jar
Checking for depends/jars/yoko_M2-20070130/yoko-rmi-spec.jar
Checking for depends/jars/bcel-5.2/bcel-5.2.jar
Checking for depends/jars/xalan-j_2.7.0/xalan.jar
Checking for depends/jars/xerces_2.9.0/xerces.zip
Checking for depends/jars/junit_3.8.2/junit.jar
Checking for depends/jars/bcprov-jdk15-134/bcprov.jar
Checking for depends/jars/icu4j_3.4.4/icu4j_3_4_4.jar
Checking for depends/jars/mx4j_3.0.2/mx4j.zip
Checking for depends/jars/ecj_3.2/ecj_3.2.jar
Checking for depends/jars/jetty/jetty-6.0.0.jar
Checking for depends/jars/jetty/jetty-util-6.0.0.jar
Checking for depends/jars/jetty/servlet-api-2.5-6.0.0.jar
Checking for depends/libs/build/lcms/icc34.h
Checking for depends/libs/build/lcms/lcms.h
Checking for depends/libs/build/png/pngconf.h
Checking for depends/libs/build/png/png.h
Checking for depends/libs/build/jpeg/jconfig.lnx
Checking for depends/libs/build/jpeg/jpeglib.h
Checking for depends/libs/build/jpeg/jmorecfg.h
Checking for depends/libs/build/jpeg/jerror.h
Checking for depends/libs/build/lcms/liblcms.linux.x86_64
Checking for depends/libs/build/png/libpng.linux.x86_64
Checking for depends/libs/build/jpeg/libjpeg.linux.x86_64
Compiling ACCESSIBILITY classes
Compiling ANNOTATION classes
Compiling APPLET classes
Compiling ARCHIVE classes
Compiling AUTH classes
Compiling AWT classes
Compiling BEANS classes
Compiling CONCURRENT classes
Compiling CRYPTO classes
Compiling ImageIO classes
Compiling INSTRUMENT classes
Compiling JNDI classes
Compiling LANG-MANAGEMENT classes
Compiling LOGGING classes
Compiling LUNI classes
Compiling MATH classes
Compiling MISC classes
Compiling NIO classes
Compiling NIO_CHAR classes
Compiling PACK200 classes
Since fork is false, ignoring memoryMaximumSize setting
Since fork is false, ignoring memoryMaximumSize setting
Compiling PREFS classes
Compiling PRINT classes
Compiling REGEX classes
Compiling RMI classes
Compiling SECURITY classes
Compiling SOUND classes
Since fork is false, ignoring memoryMaximumSize setting
Compiling SQL classes
Compiling Sun Compat classes
Compiling SWING classes
Compiling TEXT classes
Compiling TOOLS classes
Compiling X-NET classes

========================================
Building native libs and executables...
========================================
        
../shared/hyport.c: In function `initNLSCatalog':
../shared/hyport.c:616: warning: passing arg 2 of pointer to function from incompatible pointer
type
../shared/OSNetworkSystem.c: In function `Java_org_apache_harmony_luni_platform_OSNetworkSystem_writeSocketImpl':
../shared/OSNetworkSystem.c:496: warning: unused variable `sent'
../shared/OSNetworkSystem.c: In function `Java_org_apache_harmony_luni_platform_OSNetworkSystem_availableStreamImpl':
../shared/OSNetworkSystem.c:861: warning: unused variable `loopFlag'
../shared/cmmio.c: In function `cmmOpenProfile':
../shared/cmmio.c:473: warning: assignment from incompatible pointer type
../shared/cmmio.c:475: warning: assignment from incompatible pointer type
../shared/cmmio.c:477: warning: assignment from incompatible pointer type
../shared/cmmio.c:479: warning: assignment from incompatible pointer type
../shared/cmmio.c:481: warning: assignment from incompatible pointer type
../shared/cmmxforms.c: In function `cmmCreateMultiprofileTransform':
../shared/cmmxforms.c:181: warning: passing arg 2 of `cmsSample3DGrid' from incompatible pointer
type
../shared/pngdecoder.c: In function `gl_info_callback':
../shared/pngdecoder.c:171: warning: passing arg 3 of `png_get_IHDR' from incompatible pointer
type
../shared/pngdecoder.c:171: warning: passing arg 4 of `png_get_IHDR' from incompatible pointer
type
../shared/JpegEncoder.c: In function `Java_org_apache_harmony_x_imageio_plugins_jpeg_JPEGImageWriter_encode':
../shared/JpegEncoder.c:374: warning: passing arg 1 of pointer to function from incompatible
pointer type
Checking for depends/jars/yoko_M2-20070130/yoko.jar
Checking for depends/jars/yoko_M2-20070130/yoko-core.jar
Checking for depends/jars/yoko_M2-20070130/yoko-rmi-impl.jar
Checking for depends/jars/yoko_M2-20070130/yoko-rmi-spec.jar
Checking for depends/jars/bcel-5.2/bcel-5.2.jar
Checking for depends/jars/xalan-j_2.7.0/xalan.jar
Checking for depends/jars/xerces_2.9.0/xerces.zip
Checking for depends/jars/junit_3.8.2/junit.jar
Checking for depends/jars/bcprov-jdk15-134/bcprov.jar
Checking for depends/jars/icu4j_3.4.4/icu4j_3_4_4.jar
Checking for depends/jars/mx4j_3.0.2/mx4j.zip
Checking for depends/jars/ecj_3.2/ecj_3.2.jar
Checking for depends/jars/jetty/jetty-6.0.0.jar
Checking for depends/jars/jetty/jetty-util-6.0.0.jar
Checking for depends/jars/jetty/servlet-api-2.5-6.0.0.jar
Checking for depends/libs/build/lcms/icc34.h
Checking for depends/libs/build/lcms/lcms.h
Checking for depends/libs/build/png/pngconf.h
Checking for depends/libs/build/png/png.h
Checking for depends/libs/build/jpeg/jconfig.lnx
Checking for depends/libs/build/jpeg/jpeglib.h
Checking for depends/libs/build/jpeg/jmorecfg.h
Checking for depends/libs/build/jpeg/jerror.h
Checking for depends/libs/build/lcms/liblcms.linux.x86_64
Checking for depends/libs/build/png/libpng.linux.x86_64
Checking for depends/libs/build/jpeg/libjpeg.linux.x86_64
       [cc] /usr/bin/ar: creating libaprutil-1.a
       [cc] /usr/bin/ar: creating liblog4cxx.a
       [cc] /usr/bin/ar: creating libencoder.a
       [cc] /usr/bin/ar: creating libport.a
       [cc] /export/users/tst/cc/projects/trunk/working_vm/vm/thread/src/thread_native_interrupt.c:
In function `hythread_interrupt':
       [cc] /export/users/tst/cc/projects/trunk/working_vm/vm/thread/src/thread_native_interrupt.c:60:
warning: passing arg 5 of `hythread_create' from incompatible pointer type
       [cc] /export/users/tst/cc/projects/trunk/working_vm/vm/thread/src/linux/os_thread.c:
In function `os_thread_exit':
       [cc] /export/users/tst/cc/projects/trunk/working_vm/vm/thread/src/linux/os_thread.c:146:
warning: cast to pointer from integer of different size
       [cc] /export/users/tst/cc/projects/trunk/working_vm/vm/thread/src/thread_java_basic.c:
In function `jthread_create_with_function':
       [cc] /export/users/tst/cc/projects/trunk/working_vm/vm/thread/src/thread_java_basic.c:179:
warning: passing arg 5 of `hythread_create' from incompatible pointer type
       [cc] /usr/bin/ar: creating libjthread.a
       [cc] /tmp/ccdMrBs8.s: Assembler messages:
       [cc] /tmp/ccdMrBs8.s:24: Error: `0(%esp)' is not a valid 64 bit base/index expression
       [cc] /export/users/tst/cc/projects/trunk/working_vm/vm/vmcore/src/jni/jni.cpp: In 
       [cc]    function `jint jni_init()':
       [cc] /export/users/tst/cc/projects/trunk/working_vm/vm/vmcore/src/jni/jni.cpp:387:
warning: invalid
       [cc]    access to non-static data member `JavaVM_Internal::link' of NULL object
       [cc] /export/users/tst/cc/projects/trunk/working_vm/vm/vmcore/src/jni/jni.cpp:387:
warning: (perhaps
       [cc]    the `offsetof' macro was used incorrectly)
       [cc] /export/users/tst/cc/projects/trunk/working_vm/vm/vmcore/src/jni/jni.cpp:387:
warning: invalid
       [cc]    access to non-static data member `JavaVM_Internal::link' of NULL object
       [cc] /export/users/tst/cc/projects/trunk/working_vm/vm/vmcore/src/jni/jni.cpp:387:
warning: (perhaps
       [cc]    the `offsetof' macro was used incorrectly)
       [cc] /export/users/tst/cc/projects/trunk/working_vm/vm/vmcore/src/jni/jni.cpp: In 
       [cc]    function `jint JNI_GetCreatedJavaVMs(JavaVM**, int, jsize*)':
       [cc] /export/users/tst/cc/projects/trunk/working_vm/vm/vmcore/src/jni/jni.cpp:427:
warning: invalid
       [cc]    access to non-static data member `JavaVM_Internal::link' of NULL object
       [cc] /export/users/tst/cc/projects/trunk/working_vm/vm/vmcore/src/jni/jni.cpp:427:
warning: (perhaps
       [cc]    the `offsetof' macro was used incorrectly)
       [cc] /export/users/tst/cc/projects/trunk/working_vm/vm/vmcore/src/jni/jni.cpp: In 
       [cc]    function `jint JNI_CreateJavaVM(JavaVM**, JNIEnv**, void*)':
       [cc] /export/users/tst/cc/projects/trunk/working_vm/vm/vmcore/src/jni/jni.cpp:457:
warning: invalid
       [cc]    access to non-static data member `JavaVM_Internal::link' of NULL object
       [cc] /export/users/tst/cc/projects/trunk/working_vm/vm/vmcore/src/jni/jni.cpp:457:
warning: (perhaps
       [cc]    the `offsetof' macro was used incorrectly)
       [cc] /export/users/tst/cc/projects/trunk/working_vm/vm/vmcore/src/jni/jni.cpp:544:
warning: invalid
       [cc]    access to non-static data member `JavaVM_Internal::link' of NULL object
       [cc] /export/users/tst/cc/projects/trunk/working_vm/vm/vmcore/src/jni/jni.cpp:544:
warning: (perhaps
       [cc]    the `offsetof' macro was used incorrectly)
       [cc] /export/users/tst/cc/projects/trunk/working_vm/vm/vmcore/src/jni/jni.cpp:544:
warning: invalid
       [cc]    access to non-static data member `JavaVM_Internal::link' of NULL object
       [cc] /export/users/tst/cc/projects/trunk/working_vm/vm/vmcore/src/jni/jni.cpp:544:
warning: (perhaps
       [cc]    the `offsetof' macro was used incorrectly)
       [cc] /export/users/tst/cc/projects/trunk/working_vm/vm/vmcore/src/jni/jni.cpp:544:
warning: invalid
       [cc]    access to non-static data member `JavaVM_Internal::link' of NULL object
       [cc] /export/users/tst/cc/projects/trunk/working_vm/vm/vmcore/src/jni/jni.cpp:544:
warning: (perhaps
       [cc]    the `offsetof' macro was used incorrectly)
       [cc] /export/users/tst/cc/projects/trunk/working_vm/vm/vmcore/src/jni/jni.cpp:544:
warning: invalid
       [cc]    access to non-static data member `JavaVM_Internal::link' of NULL object
       [cc] /export/users/tst/cc/projects/trunk/working_vm/vm/vmcore/src/jni/jni.cpp:544:
warning: (perhaps
       [cc]    the `offsetof' macro was used incorrectly)
BUILD FAILED
/export/users/tst/cc/projects/trunk/working_vm/build/make/build.xml:452: The following error
occurred while executing this line:
/export/users/tst/cc/projects/trunk/working_vm/build/make/build.xml:459: The following error
occurred while executing this line:
/export/users/tst/cc/projects/trunk/working_vm/build/make/build_component.xml:72: The following
error occurred while executing this line:
/export/users/tst/cc/projects/trunk/working_vm/build/lnx_em64t_gcc_release/semis/build/targets/build.native.xml:81:
gcc failed with return code 1
Total time: 8 minutes 3 seconds

***********************************************************
Unit Tests: (0)
        
No Tests Run: This project doesn't have any tests or tests were not run

***********************************************************
Modifications since last successful build:	(8)
            
added ndbeyer  /harmony/enhanced/drlvm/trunk/vm/vmcore/src/thread/win 04/17/2007 12:08:00
Rework atomics code so that it will work on P3 processors.
added ndbeyer  /harmony/enhanced/drlvm/trunk/vm/vmcore/src/thread/win/atomics.cpp 04/17/2007
12:08:00 Rework atomics code so that it will work on P3 processors.
added ndbeyer  /harmony/enhanced/drlvm/trunk/vm/vmcore/src/thread/linux 04/17/2007 12:08:00
Rework atomics code so that it will work on P3 processors.
added ndbeyer  /harmony/enhanced/drlvm/trunk/vm/vmcore/src/thread/linux/atomics.cpp 04/17/2007
12:08:00 Rework atomics code so that it will work on P3 processors.
deleted ndbeyer  /harmony/enhanced/drlvm/trunk/vm/vmcore/src/thread/atomics.cpp 04/17/2007
12:08:00 Rework atomics code so that it will work on P3 processors.
modified ndbeyer  /harmony/enhanced/drlvm/trunk/build/make/components/vm/vmcore.xml 04/17/2007
12:08:00 Rework atomics code so that it will work on P3 processors.
added ndbeyer  /harmony/enhanced/drlvm/trunk/vm/vmcore/src/thread/atomics_common.cpp 04/17/2007
12:08:00 Rework atomics code so that it will work on P3 processors.
modified ndbeyer  /harmony/enhanced/drlvm/trunk/vm/vmcore/include/atomics.h 04/17/2007 12:08:00
Rework atomics code so that it will work on P3 processors.

Mime
View raw message