harmony-alerts mailing list archives

Site index · List index
Message view « Date » · « Thread »
Top « Date » · « Thread »
From nom...@hursley.ibm.com
Subject [continuum] BUILD FAILURE: Classlib/linux.ia32 Build/Test
Date Fri, 13 Apr 2007 05:49:25 GMT
Online report : http://people.apache.org/~hindessm/continuum/classlib/linux.ia32/2007/04/13/20070413-054925.failure.log.gz
Build statistics:
  State: Failed
  Previous State: Failed
  Started at: Fri, 13 Apr 2007 05:30:39 +0100
  Finished at: Fri, 13 Apr 2007 06:49:22 +0100
  Total time: 1h 18m 43s
  Build Trigger: Schedule
  Exit code: 1
  Building machine hostname: hy2
  Operating system : Linux(unknown)
  Java version : 1.5.0_06(Sun Microsystems Inc.)

Changes
                            classlib/modules/luni/src/test/java/tests/api/java/io/OutputStreamWriterTest.java
        
****************************************************************************
Output:
****************************************************************************
Buildfile: build.xml

svn-prop:

build:
   [delete] Deleting directory /home/hybld/continuum-working-directory/6/classlib/deploy
     [echo] Classlib revision is 528350
     [echo] Post process: true
     [echo] JAPI: true
     [echo] Building with reference jdk/javac
     [exec] Buildfile: build.xml

     [exec] -init-hdk-for-clean:
     [exec]     [mkdir] Created dir: /home/hybld/continuum-working-directory/6/classlib/deploy/build/ant
     [exec]      [copy] Copying 1 file to /home/hybld/continuum-working-directory/6/classlib/deploy/build/ant

     [exec] clean-java:

     [exec] -modules-clean-bin:

     [exec] clean:
     [exec]    [delete] Deleting 30 files from /home/hybld/continuum-working-directory/6/classlib/build/classes
     [exec]    [delete] Deleting 12 files from /home/hybld/continuum-working-directory/6/classlib/modules/accessibility/bin/test

     [exec] clean:
     [exec]    [delete] Deleting 13 files from /home/hybld/continuum-working-directory/6/classlib/build/classes
     [exec]    [delete] Deleting 5 files from /home/hybld/continuum-working-directory/6/classlib/modules/annotation/bin/test

     [exec] clean:
     [exec]    [delete] Deleting 35 files from /home/hybld/continuum-working-directory/6/classlib/build/classes
     [exec]    [delete] Deleting 1 files from /home/hybld/continuum-working-directory/6/classlib/modules/applet/bin/test

     [exec] clean:
     [exec]    [delete] Deleting 42 files from /home/hybld/continuum-working-directory/6/classlib/build/classes
     [exec]    [delete] Deleting 36 files from /home/hybld/continuum-working-directory/6/classlib/modules/archive/bin/test

     [exec] clean-native-includes:
     [exec]    [delete] /home/hybld/continuum-working-directory/6/classlib/deploy/include not found.

     [exec] clean:
     [exec]    [delete] Deleting 112 files from /home/hybld/continuum-working-directory/6/classlib/build/classes
     [exec]    [delete] Deleting 226 files from /home/hybld/continuum-working-directory/6/classlib/modules/auth/bin/test

     [exec] clean:
     [exec]    [delete] Deleting 908 files from /home/hybld/continuum-working-directory/6/classlib/build/classes
     [exec]    [delete] Deleting 537 files from /home/hybld/continuum-working-directory/6/classlib/modules/awt/bin/test

     [exec] clean:
     [exec]    [delete] Deleting 107 files from /home/hybld/continuum-working-directory/6/classlib/build/classes
     [exec]    [delete] Deleting 238 files from /home/hybld/continuum-working-directory/6/classlib/modules/beans/bin/test

     [exec] clean:
     [exec]    [delete] Deleting 125 files from /home/hybld/continuum-working-directory/6/classlib/build/classes
     [exec]    [delete] /home/hybld/continuum-working-directory/6/classlib/modules/concurrent/bin/test not found.

     [exec] clean:
     [exec]    [delete] Deleting 48 files from /home/hybld/continuum-working-directory/6/classlib/build/classes
     [exec]    [delete] Deleting 90 files from /home/hybld/continuum-working-directory/6/classlib/modules/crypto/bin/test

     [exec] clean:
     [exec]    [delete] Deleting 93 files from /home/hybld/continuum-working-directory/6/classlib/build/classes
     [exec]    [delete] Deleting 3 files from /home/hybld/continuum-working-directory/6/classlib/modules/imageio/bin/test

     [exec] clean:
     [exec]    [delete] Deleting 9 files from /home/hybld/continuum-working-directory/6/classlib/build/classes
     [exec]    [delete] Deleting 20 files from /home/hybld/continuum-working-directory/6/classlib/modules/instrument/bin/test

     [exec] clean:
     [exec]    [delete] Deleting 177 files from /home/hybld/continuum-working-directory/6/classlib/build/classes
     [exec]    [delete] Deleting 192 files from /home/hybld/continuum-working-directory/6/classlib/modules/jndi/bin/test

     [exec] clean:
     [exec]    [delete] Deleting 43 files from /home/hybld/continuum-working-directory/6/classlib/build/classes
     [exec]    [delete] Deleting 18 files from /home/hybld/continuum-working-directory/6/classlib/modules/lang-management/bin/api
     [exec]    [delete] Deleting 16 files from /home/hybld/continuum-working-directory/6/classlib/modules/lang-management/bin/impl

     [exec] clean:
     [exec]    [delete] Deleting 34 files from /home/hybld/continuum-working-directory/6/classlib/build/classes
     [exec]    [delete] Deleting 100 files from /home/hybld/continuum-working-directory/6/classlib/modules/logging/bin/test

     [exec] clean:
     [exec]    [delete] Deleting 969 files from /home/hybld/continuum-working-directory/6/classlib/build/classes
     [exec]    [delete] Deleting 926 files from /home/hybld/continuum-working-directory/6/classlib/modules/luni/bin/test

     [exec] clean-native-includes:
     [exec]    [delete] /home/hybld/continuum-working-directory/6/classlib/deploy/include not found.
     [exec]    [delete] /home/hybld/continuum-working-directory/6/classlib/deploy/jdk/include not found.

     [exec] clean:
     [exec]    [delete] Deleting 29 files from /home/hybld/continuum-working-directory/6/classlib/build/classes

     [exec] clean:
     [exec]    [delete] Deleting 14 files from /home/hybld/continuum-working-directory/6/classlib/build/classes
     [exec]    [delete] Deleting 25 files from /home/hybld/continuum-working-directory/6/classlib/modules/math/bin/test

     [exec] clean:
     [exec]    [delete] Deleting 14 files from /home/hybld/continuum-working-directory/6/classlib/build/classes
     [exec]    [delete] Deleting 1 files from /home/hybld/continuum-working-directory/6/classlib/modules/misc/bin/test

     [exec] clean:
     [exec]    [delete] Deleting 142 files from /home/hybld/continuum-working-directory/6/classlib/build/classes
     [exec]    [delete] Deleted 5 directories from /home/hybld/continuum-working-directory/6/classlib/build/classes
     [exec]    [delete] Deleting 157 files from /home/hybld/continuum-working-directory/6/classlib/modules/nio/bin/test
     [exec]    [delete] Deleted 19 directories from /home/hybld/continuum-working-directory/6/classlib/modules/nio/bin/test

     [exec] clean:
     [exec]    [delete] Deleting 20 files from /home/hybld/continuum-working-directory/6/classlib/build/classes
     [exec]    [delete] Deleting 79 files from /home/hybld/continuum-working-directory/6/classlib/modules/nio_char/bin/test

     [exec] clean:
     [exec]    [delete] Deleting 44 files from /home/hybld/continuum-working-directory/6/classlib/build/classes
     [exec]    [delete] Deleting 19 files from /home/hybld/continuum-working-directory/6/classlib/modules/pack200/bin/test

     [exec] clean-native-includes:
     [exec]    [delete] /home/hybld/continuum-working-directory/6/classlib/deploy/include not found.

     [exec] clean:

     [exec] clean:
     [exec]    [delete] Deleting 32 files from /home/hybld/continuum-working-directory/6/classlib/build/classes
     [exec]    [delete] Deleting 34 files from /home/hybld/continuum-working-directory/6/classlib/modules/prefs/bin/test

     [exec] clean:
     [exec]    [delete] Deleting 205 files from /home/hybld/continuum-working-directory/6/classlib/build/classes
     [exec]    [delete] Deleting 60 files from /home/hybld/continuum-working-directory/6/classlib/modules/print/bin/test

     [exec] clean:
     [exec]    [delete] Deleting 177 files from /home/hybld/continuum-working-directory/6/classlib/build/classes
     [exec]    [delete] Deleting 13 files from /home/hybld/continuum-working-directory/6/classlib/modules/regex/bin/test

     [exec] clean:
     [exec]    [delete] Deleting 230 files from /home/hybld/continuum-working-directory/6/classlib/build/classes
     [exec]    [delete] Deleting 53 files from /home/hybld/continuum-working-directory/6/classlib/modules/rmi/bin/test

     [exec] clean:
     [exec]    [delete] Deleting 429 files from /home/hybld/continuum-working-directory/6/classlib/build/classes
     [exec]    [delete] Deleting 622 files from /home/hybld/continuum-working-directory/6/classlib/modules/security/bin/test

     [exec] clean:
     [exec]    [delete] Deleting 2 files from /home/hybld/continuum-working-directory/6/classlib/build/classes

     [exec] clean:
     [exec]    [delete] Deleting 74 files from /home/hybld/continuum-working-directory/6/classlib/build/classes
     [exec]    [delete] Deleting 54 files from /home/hybld/continuum-working-directory/6/classlib/modules/sound/bin/test

     [exec] clean:
     [exec]    [delete] Deleting 79 files from /home/hybld/continuum-working-directory/6/classlib/build/classes
     [exec]    [delete] Deleting 61 files from /home/hybld/continuum-working-directory/6/classlib/modules/sql/bin/test

     [exec] clean:
     [exec]    [delete] Deleting 6 files from /home/hybld/continuum-working-directory/6/classlib/build/classes

     [exec] clean:
     [exec]    [delete] Deleting 1626 files from /home/hybld/continuum-working-directory/6/classlib/build/classes
     [exec]    [delete] Deleting 4 files from /home/hybld/continuum-working-directory/6/classlib/build/classes
     [exec]    [delete] Deleting 1588 files from /home/hybld/continuum-working-directory/6/classlib/modules/swing/bin/test

     [exec] clean:
     [exec]    [delete] Deleting 40 files from /home/hybld/continuum-working-directory/6/classlib/build/classes
     [exec]    [delete] Deleting 32 files from /home/hybld/continuum-working-directory/6/classlib/modules/text/bin/test

     [exec] clean:
     [exec]    [delete] Deleting 35 files from /home/hybld/continuum-working-directory/6/classlib/build/classes

...

     [exec]     [javac] ----------
     [exec]     [javac] 1. WARNING in /home/hybld/continuum-working-directory/6/classlib/modules/annotation/src/test/java/org/apache/harmony/annotation/tests/java/lang/annotation/IncompleteAnnotationExceptionTest.java
     [exec]     [javac]  (at line 53)
     [exec]     [javac] 	clazz, elementName);
     [exec]     [javac] 	^^^^^
     [exec]     [javac] Type safety: The expression of type Class needs unchecked conversion to conform to Class<? extends Annotation>
     [exec]     [javac] ----------
     [exec]     [javac] 1 problem (1 warning)

     [exec] prepare-exclude:

...

     [exec]     [junit] Tests run: 43, Failures: 0, Errors: 0, Time elapsed: 0.097 sec
     [exec]     [junit] 2007-04-13 05:48:30.042::INFO:  jetty-6.0.x
     [exec]     [junit] 2007-04-13 05:48:30.044::INFO:  Started SocketConnector @ 0.0.0.0:37746
     [exec]     [junit] Tests run: 44, Failures: 0, Errors: 2, Time elapsed: 383.043 sec
     [exec]     [junit] TEST tests.api.java.net.URLConnectionTest FAILED
     [exec]     [junit] Tests run: 3, Failures: 0, Errors: 0, Time elapsed: 0.005 sec
     [exec]     [junit] Tests run: 1, Failures: 0, Errors: 0, Time elapsed: 0.004 sec
     [exec]     [junit] 2007-04-13 05:54:53.004::INFO:  jetty-6.0.x
     [exec]     [junit] 2007-04-13 05:54:53.005::INFO:  Started SocketConnector @ 0.0.0.0:37755
     [exec]     [junit] Tests run: 29, Failures: 0, Errors: 0, Time elapsed: 0.07 sec

...

     [exec]     [junit] Tests run: 2, Failures: 0, Errors: 0, Time elapsed: 0.004 sec
     [exec]     [junit] Tests run: 8, Failures: 0, Errors: 0, Time elapsed: 0.008 sec
     [exec]     [junit] Tests run: 40, Failures: 0, Errors: 0, Time elapsed: 0.026 sec
     [exec]     [junit] Tests run: 16, Failures: 0, Errors: 2, Time elapsed: 0.247 sec
     [exec]     [junit] TEST tests.api.java.util.PropertiesTest FAILED
     [exec]     [junit] Tests run: 6, Failures: 0, Errors: 0, Time elapsed: 0.005 sec
     [exec]     [junit] Tests run: 3, Failures: 0, Errors: 0, Time elapsed: 0.004 sec
     [exec]     [junit] Tests run: 11, Failures: 0, Errors: 0, Time elapsed: 0.006 sec
     [exec]     [junit] Tests run: 4, Failures: 0, Errors: 0, Time elapsed: 0.028 sec
     [exec]     [junit] Tests run: 67, Failures: 0, Errors: 0, Time elapsed: 1.535 sec

...

     [exec]     [junit] Tests run: 23, Failures: 0, Errors: 0, Time elapsed: 0.118 sec
     [exec]     [junit] Tests run: 19, Failures: 0, Errors: 0, Time elapsed: 0.059 sec
     [exec]     [junit] Tests run: 48, Failures: 0, Errors: 0, Time elapsed: 0.272 sec
     [exec]     [junit] Tests run: 16, Failures: 0, Errors: 0, Time elapsed: 0.353 sec
     [exec]     [junit] Tests FAILED

     [exec] touch-failures-file:

     [exec] touch-errors-file:


...

     [exec]     [junit] org.apache.harmony.rmi.test.MyException: MyRemoteObject.test_Exception
     [exec]     [junit] Done.

     [exec]     [junit] Testing test_Error...
     [exec]     [junit] java.rmi.ServerError: Error occurred while remote method invocation; nested exception is:
     [exec]     [junit] 	java.lang.Error: MyRemoteObject.test_Error
     [exec]     [junit] Done.

     [exec]     [junit] Testing test_RuntimeException...
     [exec]     [junit] java.lang.RuntimeException: MyRemoteObject.text_RuntimeException
     [exec]     [junit] Done.

...

     [exec]     [junit] org.apache.harmony.rmi.test.MyException: MyRemoteObject.test_Exception
     [exec]     [junit] Done.

     [exec]     [junit] Testing test_Error...
     [exec]     [junit] java.rmi.ServerError: Error occurred while remote method invocation; nested exception is:
     [exec]     [junit] 	java.lang.Error: MyRemoteObject.test_Error
     [exec]     [junit] Done.

     [exec]     [junit] Testing test_RuntimeException...
     [exec]     [junit] java.lang.RuntimeException: MyRemoteObject.text_RuntimeException
     [exec]     [junit] Done.

...

     [exec] gen-report:

     [exec] check-test-result:

     [exec] BUILD FAILED
     [exec] /home/hybld/continuum-working-directory/6/classlib/build.xml:169: The following error occurred while executing this line:
     [exec] /home/hybld/continuum-working-directory/6/classlib/make/build-test.xml:147: There were test errors.

     [exec] Total time: 60 minutes 59 seconds
     [exec] Result: 1
     [echo] Tests.failed is set to true

japi:

     [exec] Processing class java.lang,Object:+
     [exec] Processing package java.lang,:=============================================================================+-+++++++++++-+++++++++++++-+++++++++++++++++-+++++-+++++++++++++++++++++++-++++--^+^+++++++++--++++++++++

...

     [exec] Processing package java.lang.management,:=============================================================================++++-+++++++++++
     [exec] Processing package java.lang.ref,:=============================================================================+++++
     [exec] Processing package java.lang.reflect,:=============================================================================+++++++++++++++++++++
     [exec] Processing class ,java:
     [exec] Failed to Japize java: java.lang.RuntimeException: NoClassDefFoundError: java
     [exec] java.lang.RuntimeException: NoClassDefFoundError: java
     [exec] 	at net.wuffies.japi.ClassFile.forName(ClassFile.java:163)
     [exec] 	at net.wuffies.japi.Japize.getClassWrapper(Japize.java:1425)
     [exec] 	at net.wuffies.japi.Japize.japizeClass(Japize.java:748)
     [exec] 	at net.wuffies.japi.Japize.processClass(Japize.java:516)

...

     [exec] 	at net.wuffies.japi.Japize.doJapize(Japize.java:443)
     [exec] 	at net.wuffies.japi.Japize.main(Japize.java:316)

     [exec] Processing class ,javax:
     [exec] Failed to Japize javax: java.lang.RuntimeException: NoClassDefFoundError: javax
     [exec] java.lang.RuntimeException: NoClassDefFoundError: javax
     [exec] 	at net.wuffies.japi.ClassFile.forName(ClassFile.java:163)
     [exec] 	at net.wuffies.japi.Japize.getClassWrapper(Japize.java:1425)
     [exec] 	at net.wuffies.japi.Japize.japizeClass(Japize.java:748)
     [exec] 	at net.wuffies.japi.Japize.processClass(Japize.java:516)

...

     [exec] 	at net.wuffies.japi.Japize.doJapize(Japize.java:443)
     [exec] 	at net.wuffies.japi.Japize.main(Japize.java:316)

     [exec] Processing class ,org:
     [exec] Failed to Japize org: java.lang.RuntimeException: NoClassDefFoundError: org
     [exec] java.lang.RuntimeException: NoClassDefFoundError: org
     [exec] 	at net.wuffies.japi.ClassFile.forName(ClassFile.java:163)
     [exec] 	at net.wuffies.japi.Japize.getClassWrapper(Japize.java:1425)
     [exec] 	at net.wuffies.japi.Japize.japizeClass(Japize.java:748)
     [exec] 	at net.wuffies.japi.Japize.processClass(Japize.java:516)

...

     [exec] Processing package javax.sql.rowset,:=============================================================================+++++++++
     [exec] Processing package javax.sql.rowset.serial,:=============================================================================++++++++++
     [exec] Processing package javax.sql.rowset.spi,:=============================================================================++++++++
     [exec] Processing package javax.swing,:=============================================================================++--+-++++++--++++++++++++++++--------------------------------+++---++++++++--++++---+++++++
     [exec] Failed to Japize javax.swing.JApplet$AccessibleJApplet: java.lang.ArrayIndexOutOfBoundsException
     [exec] java.lang.ArrayIndexOutOfBoundsException
     [exec] 	at java.util.Arrays.mergeSort(Arrays.java:2452)
     [exec] 	at java.util.Arrays.mergeSort(Arrays.java:2432)
     [exec] 	at java.util.Arrays.sort(Arrays.java:2369)
     [exec] 	at java.util.Arrays.sort(Arrays.java:2329)

...

     [exec] 	at net.wuffies.japi.Japize.processRootSet(Japize.java:471)
     [exec] 	at net.wuffies.japi.Japize.doJapize(Japize.java:443)
     [exec] 	at net.wuffies.japi.Japize.main(Japize.java:316)

     [exec] Failed to Japize javax.swing.JButton: java.lang.ArrayIndexOutOfBoundsException
     [exec] java.lang.ArrayIndexOutOfBoundsException
     [exec] 	at java.util.Arrays.mergeSort(Arrays.java:2458)
     [exec] 	at java.util.Arrays.mergeSort(Arrays.java:2432)
     [exec] 	at java.util.Arrays.sort(Arrays.java:2369)
     [exec] 	at java.util.Arrays.sort(Arrays.java:2329)

...

     [exec] 	at net.wuffies.japi.Japize.processRootSet(Japize.java:471)
     [exec] 	at net.wuffies.japi.Japize.doJapize(Japize.java:443)
     [exec] 	at net.wuffies.japi.Japize.main(Japize.java:316)

     [exec] Failed to Japize javax.swing.JButton$AccessibleJButton: java.lang.ArrayIndexOutOfBoundsException
     [exec] java.lang.ArrayIndexOutOfBoundsException
     [exec] 	at java.util.Arrays.mergeSort(Arrays.java:2452)
     [exec] 	at java.util.Arrays.sort(Arrays.java:2369)
     [exec] 	at java.util.Arrays.sort(Arrays.java:2329)
     [exec] 	at net.wuffies.japi.BoundMemberSet.getCalls(BoundMemberSet.java:46)

...

     [exec] 	at net.wuffies.japi.Japize.processRootSet(Japize.java:471)
     [exec] 	at net.wuffies.japi.Japize.doJapize(Japize.java:443)
     [exec] 	at net.wuffies.japi.Japize.main(Japize.java:316)

     [exec] Failed to Japize javax.swing.JCheckBox: java.lang.ArrayIndexOutOfBoundsException
     [exec] java.lang.ArrayIndexOutOfBoundsException
     [exec] 	at java.util.Arrays.mergeSort(Arrays.java:2458)
     [exec] 	at java.util.Arrays.mergeSort(Arrays.java:2432)
     [exec] 	at java.util.Arrays.sort(Arrays.java:2369)
     [exec] 	at java.util.Arrays.sort(Arrays.java:2329)

...

     [exec] 	at net.wuffies.japi.Japize.processRootSet(Japize.java:471)
     [exec] 	at net.wuffies.japi.Japize.doJapize(Japize.java:443)
     [exec] 	at net.wuffies.japi.Japize.main(Japize.java:316)

     [exec] Failed to Japize javax.swing.JCheckBox$AccessibleJCheckBox: java.lang.ArrayIndexOutOfBoundsException
     [exec] java.lang.ArrayIndexOutOfBoundsException
     [exec] 	at java.util.Arrays.mergeSort(Arrays.java:2452)
     [exec] 	at java.util.Arrays.sort(Arrays.java:2369)
     [exec] 	at java.util.Arrays.sort(Arrays.java:2329)
     [exec] 	at net.wuffies.japi.BoundMemberSet.getCalls(BoundMemberSet.java:46)

...

     [exec] 	at net.wuffies.japi.Japize.processRootSet(Japize.java:471)
     [exec] 	at net.wuffies.japi.Japize.doJapize(Japize.java:443)
     [exec] 	at net.wuffies.japi.Japize.main(Japize.java:316)

     [exec] Failed to Japize javax.swing.JCheckBoxMenuItem: java.lang.ArrayIndexOutOfBoundsException
     [exec] java.lang.ArrayIndexOutOfBoundsException
     [exec] 	at java.util.Arrays.mergeSort(Arrays.java:2458)
     [exec] 	at java.util.Arrays.mergeSort(Arrays.java:2432)
     [exec] 	at java.util.Arrays.sort(Arrays.java:2369)
     [exec] 	at java.util.Arrays.sort(Arrays.java:2329)

...

     [exec] 	at net.wuffies.japi.Japize.processRootSet(Japize.java:471)
     [exec] 	at net.wuffies.japi.Japize.doJapize(Japize.java:443)
     [exec] 	at net.wuffies.japi.Japize.main(Japize.java:316)

     [exec] Failed to Japize javax.swing.JCheckBoxMenuItem$AccessibleJCheckBoxMenuItem: java.lang.ArrayIndexOutOfBoundsException
     [exec] java.lang.ArrayIndexOutOfBoundsException
     [exec] 	at java.util.Arrays.mergeSort(Arrays.java:2452)
     [exec] 	at java.util.Arrays.sort(Arrays.java:2369)
     [exec] 	at java.util.Arrays.sort(Arrays.java:2329)
     [exec] 	at net.wuffies.japi.BoundMemberSet.getCalls(BoundMemberSet.java:46)

...

     [exec] 	at net.wuffies.japi.Japize.processRootSet(Japize.java:471)
     [exec] 	at net.wuffies.japi.Japize.doJapize(Japize.java:443)
     [exec] 	at net.wuffies.japi.Japize.main(Japize.java:316)

     [exec] Failed to Japize javax.swing.JColorChooser: java.lang.ArrayIndexOutOfBoundsException
     [exec] java.lang.ArrayIndexOutOfBoundsException
     [exec] 	at java.util.Arrays.mergeSort(Arrays.java:2460)
     [exec] 	at java.util.Arrays.sort(Arrays.java:2369)
     [exec] 	at java.util.Arrays.sort(Arrays.java:2329)
     [exec] 	at net.wuffies.japi.BoundMemberSet.getFields(BoundMemberSet.java:33)

...

     [exec] 	at net.wuffies.japi.Japize.processRootSet(Japize.java:471)
     [exec] 	at net.wuffies.japi.Japize.doJapize(Japize.java:443)
     [exec] 	at net.wuffies.japi.Japize.main(Japize.java:316)
     [exec] -----
     [exec] Failed to Japize javax.swing.JColorChooser$AccessibleJColorChooser: java.lang.ArrayIndexOutOfBoundsException
     [exec] java.lang.ArrayIndexOutOfBoundsException
     [exec] 	at java.util.Arrays.mergeSort(Arrays.java:2452)
     [exec] 	at java.util.Arrays.mergeSort(Arrays.java:2432)
     [exec] 	at java.util.Arrays.sort(Arrays.java:2369)
     [exec] 	at java.util.Arrays.sort(Arrays.java:2329)

...

     [exec] 	at net.wuffies.japi.Japize.processRootSet(Japize.java:471)
     [exec] 	at net.wuffies.japi.Japize.doJapize(Japize.java:443)
     [exec] 	at net.wuffies.japi.Japize.main(Japize.java:316)

     [exec] Failed to Japize javax.swing.JComboBox: java.lang.ArrayIndexOutOfBoundsException
     [exec] java.lang.ArrayIndexOutOfBoundsException
     [exec] 	at java.util.Arrays.mergeSort(Arrays.java:2460)
     [exec] 	at java.util.Arrays.sort(Arrays.java:2369)
     [exec] 	at java.util.Arrays.sort(Arrays.java:2329)
     [exec] 	at net.wuffies.japi.BoundMemberSet.getFields(BoundMemberSet.java:33)

...

     [exec] 	at net.wuffies.japi.Japize.processRootSet(Japize.java:471)
     [exec] 	at net.wuffies.japi.Japize.doJapize(Japize.java:443)
     [exec] 	at net.wuffies.japi.Japize.main(Japize.java:316)
     [exec] -
     [exec] Failed to Japize javax.swing.JComboBox$AccessibleJComboBox: java.lang.ArrayIndexOutOfBoundsException
     [exec] java.lang.ArrayIndexOutOfBoundsException
     [exec] 	at java.util.Arrays.mergeSort(Arrays.java:2452)
     [exec] 	at java.util.Arrays.mergeSort(Arrays.java:2432)
     [exec] 	at java.util.Arrays.sort(Arrays.java:2369)
     [exec] 	at java.util.Arrays.sort(Arrays.java:2329)

...

     [exec] 	at net.wuffies.japi.Japize.processRootSet(Japize.java:471)
     [exec] 	at net.wuffies.japi.Japize.doJapize(Japize.java:443)
     [exec] 	at net.wuffies.japi.Japize.main(Japize.java:316)
     [exec] --+
     [exec] Failed to Japize javax.swing.JComponent: java.lang.ArrayIndexOutOfBoundsException
     [exec] java.lang.ArrayIndexOutOfBoundsException
     [exec] 	at java.util.Arrays.mergeSort(Arrays.java:2460)
     [exec] 	at java.util.Arrays.sort(Arrays.java:2369)
     [exec] 	at java.util.Arrays.sort(Arrays.java:2329)
     [exec] 	at net.wuffies.japi.BoundMemberSet.getFields(BoundMemberSet.java:33)

...

     [exec] 	at net.wuffies.japi.Japize.processRootSet(Japize.java:471)
     [exec] 	at net.wuffies.japi.Japize.doJapize(Japize.java:443)
     [exec] 	at net.wuffies.japi.Japize.main(Japize.java:316)
     [exec] -
     [exec] Failed to Japize javax.swing.JComponent$AccessibleJComponent: java.lang.ArrayIndexOutOfBoundsException
     [exec] java.lang.ArrayIndexOutOfBoundsException
     [exec] 	at java.util.Arrays.mergeSort(Arrays.java:2452)
     [exec] 	at java.util.Arrays.mergeSort(Arrays.java:2432)
     [exec] 	at java.util.Arrays.sort(Arrays.java:2369)
     [exec] 	at java.util.Arrays.sort(Arrays.java:2329)

...

     [exec] 	at net.wuffies.japi.Japize.processRootSet(Japize.java:471)
     [exec] 	at net.wuffies.japi.Japize.doJapize(Japize.java:443)
     [exec] 	at net.wuffies.japi.Japize.main(Japize.java:316)

     [exec] Failed to Japize javax.swing.JComponent$AccessibleJComponent$AccessibleContainerHandler: java.lang.ArrayIndexOutOfBoundsException
     [exec] java.lang.ArrayIndexOutOfBoundsException
     [exec] 	at java.util.Arrays.mergeSort(Arrays.java:2452)
     [exec] 	at java.util.Arrays.sort(Arrays.java:2369)
     [exec] 	at java.util.Arrays.sort(Arrays.java:2329)
     [exec] 	at net.wuffies.japi.BoundMemberSet.getCalls(BoundMemberSet.java:46)

...

     [exec] 	at net.wuffies.japi.Japize.processRootSet(Japize.java:471)
     [exec] 	at net.wuffies.japi.Japize.doJapize(Japize.java:443)
     [exec] 	at net.wuffies.japi.Japize.main(Japize.java:316)

     [exec] Failed to Japize javax.swing.JComponent$AccessibleJComponent$AccessibleFocusHandler: java.lang.ArrayIndexOutOfBoundsException
     [exec] java.lang.ArrayIndexOutOfBoundsException
     [exec] 	at java.util.Arrays.mergeSort(Arrays.java:2450)
     [exec] 	at java.util.Arrays.sort(Arrays.java:2369)
     [exec] 	at java.util.Arrays.sort(Arrays.java:2329)
     [exec] 	at net.wuffies.japi.BoundMemberSet.getCalls(BoundMemberSet.java:46)

...

     [exec] 	at net.wuffies.japi.Japize.processRootSet(Japize.java:471)
     [exec] 	at net.wuffies.japi.Japize.doJapize(Japize.java:443)
     [exec] 	at net.wuffies.japi.Japize.main(Japize.java:316)
     [exec] -
     [exec] Failed to Japize javax.swing.JDesktopPane: java.lang.ArrayIndexOutOfBoundsException
     [exec] java.lang.ArrayIndexOutOfBoundsException
     [exec] 	at java.util.Arrays.mergeSort(Arrays.java:2460)
     [exec] 	at java.util.Arrays.sort(Arrays.java:2369)
     [exec] 	at java.util.Arrays.sort(Arrays.java:2329)
     [exec] 	at net.wuffies.japi.BoundMemberSet.getFields(BoundMemberSet.java:33)

...

     [exec] 	at net.wuffies.japi.Japize.processRootSet(Japize.java:471)
     [exec] 	at net.wuffies.japi.Japize.doJapize(Japize.java:443)
     [exec] 	at net.wuffies.japi.Japize.main(Japize.java:316)

     [exec] Failed to Japize javax.swing.JDesktopPane$AccessibleJDesktopPane: java.lang.ArrayIndexOutOfBoundsException
     [exec] java.lang.ArrayIndexOutOfBoundsException
     [exec] 	at java.util.Arrays.mergeSort(Arrays.java:2452)
     [exec] 	at java.util.Arrays.mergeSort(Arrays.java:2432)
     [exec] 	at java.util.Arrays.sort(Arrays.java:2369)
     [exec] 	at java.util.Arrays.sort(Arrays.java:2329)

...

     [exec] 	at net.wuffies.japi.Japize.processRootSet(Japize.java:471)
     [exec] 	at net.wuffies.japi.Japize.doJapize(Japize.java:443)
     [exec] 	at net.wuffies.japi.Japize.main(Japize.java:316)

     [exec] Failed to Japize javax.swing.JDialog: java.lang.ArrayIndexOutOfBoundsException
     [exec] java.lang.ArrayIndexOutOfBoundsException
     [exec] 	at java.util.Arrays.mergeSort(Arrays.java:2460)
     [exec] 	at java.util.Arrays.sort(Arrays.java:2369)
     [exec] 	at java.util.Arrays.sort(Arrays.java:2329)
     [exec] 	at net.wuffies.japi.BoundMemberSet.getFields(BoundMemberSet.java:33)

...

     [exec] 	at net.wuffies.japi.Japize.processRootSet(Japize.java:471)
     [exec] 	at net.wuffies.japi.Japize.doJapize(Japize.java:443)
     [exec] 	at net.wuffies.japi.Japize.main(Japize.java:316)

     [exec] Failed to Japize javax.swing.JDialog$AccessibleJDialog: java.lang.ArrayIndexOutOfBoundsException
     [exec] java.lang.ArrayIndexOutOfBoundsException
     [exec] 	at java.util.Arrays.mergeSort(Arrays.java:2452)
     [exec] 	at java.util.Arrays.mergeSort(Arrays.java:2432)
     [exec] 	at java.util.Arrays.sort(Arrays.java:2369)
     [exec] 	at java.util.Arrays.sort(Arrays.java:2329)

...

     [exec] 	at net.wuffies.japi.Japize.processRootSet(Japize.java:471)
     [exec] 	at net.wuffies.japi.Japize.doJapize(Japize.java:443)
     [exec] 	at net.wuffies.japi.Japize.main(Japize.java:316)

     [exec] Failed to Japize javax.swing.JEditorPane: java.lang.ArrayIndexOutOfBoundsException
     [exec] java.lang.ArrayIndexOutOfBoundsException
     [exec] 	at java.util.Arrays.mergeSort(Arrays.java:2460)
     [exec] 	at java.util.Arrays.sort(Arrays.java:2369)
     [exec] 	at java.util.Arrays.sort(Arrays.java:2329)
     [exec] 	at net.wuffies.japi.BoundMemberSet.getFields(BoundMemberSet.java:33)

...

     [exec] 	at net.wuffies.japi.Japize.processRootSet(Japize.java:471)
     [exec] 	at net.wuffies.japi.Japize.doJapize(Japize.java:443)
     [exec] 	at net.wuffies.japi.Japize.main(Japize.java:316)

     [exec] Failed to Japize javax.swing.JEditorPane$AccessibleJEditorPane: java.lang.ArrayIndexOutOfBoundsException
     [exec] java.lang.ArrayIndexOutOfBoundsException
     [exec] 	at java.util.Arrays.mergeSort(Arrays.java:2452)
     [exec] 	at java.util.Arrays.sort(Arrays.java:2369)
     [exec] 	at java.util.Arrays.sort(Arrays.java:2329)
     [exec] 	at net.wuffies.japi.BoundMemberSet.getCalls(BoundMemberSet.java:46)

...

     [exec] 	at net.wuffies.japi.Japize.processRootSet(Japize.java:471)
     [exec] 	at net.wuffies.japi.Japize.doJapize(Japize.java:443)
     [exec] 	at net.wuffies.japi.Japize.main(Japize.java:316)

     [exec] Failed to Japize javax.swing.JEditorPane$AccessibleJEditorPaneHTML: java.lang.ArrayIndexOutOfBoundsException
     [exec] java.lang.ArrayIndexOutOfBoundsException
     [exec] 	at java.util.Arrays.mergeSort(Arrays.java:2452)
     [exec] 	at java.util.Arrays.sort(Arrays.java:2369)
     [exec] 	at java.util.Arrays.sort(Arrays.java:2329)
     [exec] 	at net.wuffies.japi.BoundMemberSet.getCalls(BoundMemberSet.java:46)

...

     [exec] 	at net.wuffies.japi.Japize.processRootSet(Japize.java:471)
     [exec] 	at net.wuffies.japi.Japize.doJapize(Japize.java:443)
     [exec] 	at net.wuffies.japi.Japize.main(Japize.java:316)
     [exec] --
     [exec] Failed to Japize javax.swing.JEditorPane$JEditorPaneAccessibleHypertextSupport: java.lang.ArrayIndexOutOfBoundsException
     [exec] java.lang.ArrayIndexOutOfBoundsException
     [exec] 	at java.util.Arrays.mergeSort(Arrays.java:2452)
     [exec] 	at java.util.Arrays.sort(Arrays.java:2369)
     [exec] 	at java.util.Arrays.sort(Arrays.java:2329)
     [exec] 	at net.wuffies.japi.BoundMemberSet.getCalls(BoundMemberSet.java:46)

...

     [exec] 	at net.wuffies.japi.Japize.processRootSet(Japize.java:471)
     [exec] 	at net.wuffies.japi.Japize.doJapize(Japize.java:443)
     [exec] 	at net.wuffies.japi.Japize.main(Japize.java:316)

     [exec] Failed to Japize javax.swing.JEditorPane$JEditorPaneAccessibleHypertextSupport$HTMLLink: java.lang.ArrayIndexOutOfBoundsException
     [exec] java.lang.ArrayIndexOutOfBoundsException
     [exec] 	at java.util.Arrays.mergeSort(Arrays.java:2452)
     [exec] 	at java.util.Arrays.sort(Arrays.java:2369)
     [exec] 	at java.util.Arrays.sort(Arrays.java:2329)
     [exec] 	at net.wuffies.japi.BoundMemberSet.getCalls(BoundMemberSet.java:46)

...

     [exec] 	at net.wuffies.japi.Japize.processRootSet(Japize.java:471)
     [exec] 	at net.wuffies.japi.Japize.doJapize(Japize.java:443)
     [exec] 	at net.wuffies.japi.Japize.main(Japize.java:316)
     [exec] -
     [exec] Failed to Japize javax.swing.JFileChooser: java.lang.ArrayIndexOutOfBoundsException
     [exec] java.lang.ArrayIndexOutOfBoundsException
     [exec] 	at java.util.Arrays.mergeSort(Arrays.java:2460)
     [exec] 	at java.util.Arrays.sort(Arrays.java:2369)
     [exec] 	at java.util.Arrays.sort(Arrays.java:2329)
     [exec] 	at net.wuffies.japi.BoundMemberSet.getFields(BoundMemberSet.java:33)

...

     [exec] 	at net.wuffies.japi.Japize.processRootSet(Japize.java:471)
     [exec] 	at net.wuffies.japi.Japize.doJapize(Japize.java:443)
     [exec] 	at net.wuffies.japi.Japize.main(Japize.java:316)

     [exec] Failed to Japize javax.swing.JFileChooser$AccessibleJFileChooser: java.lang.ArrayIndexOutOfBoundsException
     [exec] java.lang.ArrayIndexOutOfBoundsException
     [exec] 	at java.util.Arrays.mergeSort(Arrays.java:2452)
     [exec] 	at java.util.Arrays.mergeSort(Arrays.java:2432)
     [exec] 	at java.util.Arrays.sort(Arrays.java:2369)
     [exec] 	at java.util.Arrays.sort(Arrays.java:2329)

...

     [exec] 	at net.wuffies.japi.Japize.processRootSet(Japize.java:471)
     [exec] 	at net.wuffies.japi.Japize.doJapize(Japize.java:443)
     [exec] 	at net.wuffies.japi.Japize.main(Japize.java:316)

     [exec] Failed to Japize javax.swing.JFormattedTextField: java.lang.ArrayIndexOutOfBoundsException
     [exec] java.lang.ArrayIndexOutOfBoundsException
     [exec] 	at java.util.Arrays.mergeSort(Arrays.java:2458)
     [exec] 	at java.util.Arrays.mergeSort(Arrays.java:2432)
     [exec] 	at java.util.Arrays.sort(Arrays.java:2369)
     [exec] 	at java.util.Arrays.sort(Arrays.java:2329)

...

     [exec] 	at net.wuffies.japi.Japize.processRootSet(Japize.java:471)
     [exec] 	at net.wuffies.japi.Japize.doJapize(Japize.java:443)
     [exec] 	at net.wuffies.japi.Japize.main(Japize.java:316)

     [exec] Failed to Japize javax.swing.JFormattedTextField$AbstractFormatter: java.lang.ArrayIndexOutOfBoundsException
     [exec] java.lang.ArrayIndexOutOfBoundsException
     [exec] 	at java.util.Arrays.mergeSort(Arrays.java:2452)
     [exec] 	at java.util.Arrays.mergeSort(Arrays.java:2432)
     [exec] 	at java.util.Arrays.mergeSort(Arrays.java:2432)
     [exec] 	at java.util.Arrays.sort(Arrays.java:2369)

...

     [exec] 	at net.wuffies.japi.Japize.processRootSet(Japize.java:471)
     [exec] 	at net.wuffies.japi.Japize.doJapize(Japize.java:443)
     [exec] 	at net.wuffies.japi.Japize.main(Japize.java:316)
     [exec] -
     [exec] Failed to Japize javax.swing.JFormattedTextField$AbstractFormatterFactory: java.lang.ArrayIndexOutOfBoundsException
     [exec] java.lang.ArrayIndexOutOfBoundsException
     [exec] 	at java.util.Arrays.mergeSort(Arrays.java:2452)
     [exec] 	at java.util.Arrays.sort(Arrays.java:2369)
     [exec] 	at java.util.Arrays.sort(Arrays.java:2329)
     [exec] 	at net.wuffies.japi.BoundMemberSet.getCalls(BoundMemberSet.java:46)

...

     [exec] 	at net.wuffies.japi.Japize.processRootSet(Japize.java:471)
     [exec] 	at net.wuffies.japi.Japize.doJapize(Japize.java:443)
     [exec] 	at net.wuffies.japi.Japize.main(Japize.java:316)
     [exec] ------
     [exec] Failed to Japize javax.swing.JFrame: java.lang.ArrayIndexOutOfBoundsException
     [exec] java.lang.ArrayIndexOutOfBoundsException
     [exec] 	at java.util.Arrays.mergeSort(Arrays.java:2460)
     [exec] 	at java.util.Arrays.sort(Arrays.java:2369)
     [exec] 	at java.util.Arrays.sort(Arrays.java:2329)
     [exec] 	at net.wuffies.japi.BoundMemberSet.getFields(BoundMemberSet.java:33)

...

     [exec] 	at net.wuffies.japi.Japize.processRootSet(Japize.java:471)
     [exec] 	at net.wuffies.japi.Japize.doJapize(Japize.java:443)
     [exec] 	at net.wuffies.japi.Japize.main(Japize.java:316)

     [exec] Failed to Japize javax.swing.JFrame$AccessibleJFrame: java.lang.ArrayIndexOutOfBoundsException
     [exec] java.lang.ArrayIndexOutOfBoundsException
     [exec] 	at java.util.Arrays.mergeSort(Arrays.java:2452)
     [exec] 	at java.util.Arrays.mergeSort(Arrays.java:2432)
     [exec] 	at java.util.Arrays.sort(Arrays.java:2369)
     [exec] 	at java.util.Arrays.sort(Arrays.java:2329)

...

     [exec] 	at net.wuffies.japi.Japize.processRootSet(Japize.java:471)
     [exec] 	at net.wuffies.japi.Japize.doJapize(Japize.java:443)
     [exec] 	at net.wuffies.japi.Japize.main(Japize.java:316)

     [exec] Failed to Japize javax.swing.JInternalFrame: java.lang.ArrayIndexOutOfBoundsException
     [exec] java.lang.ArrayIndexOutOfBoundsException
     [exec] 	at java.util.Arrays.mergeSort(Arrays.java:2460)
     [exec] 	at java.util.Arrays.sort(Arrays.java:2369)
     [exec] 	at java.util.Arrays.sort(Arrays.java:2329)
     [exec] 	at net.wuffies.japi.BoundMemberSet.getFields(BoundMemberSet.java:33)

...

     [exec] 	at net.wuffies.japi.Japize.processRootSet(Japize.java:471)
     [exec] 	at net.wuffies.japi.Japize.doJapize(Japize.java:443)
     [exec] 	at net.wuffies.japi.Japize.main(Japize.java:316)

     [exec] Failed to Japize javax.swing.JInternalFrame$AccessibleJInternalFrame: java.lang.ArrayIndexOutOfBoundsException
     [exec] java.lang.ArrayIndexOutOfBoundsException
     [exec] 	at java.util.Arrays.mergeSort(Arrays.java:2452)
     [exec] 	at java.util.Arrays.mergeSort(Arrays.java:2432)
     [exec] 	at java.util.Arrays.sort(Arrays.java:2369)
     [exec] 	at java.util.Arrays.sort(Arrays.java:2329)

...

     [exec] 	at net.wuffies.japi.Japize.processRootSet(Japize.java:471)
     [exec] 	at net.wuffies.japi.Japize.doJapize(Japize.java:443)
     [exec] 	at net.wuffies.japi.Japize.main(Japize.java:316)

     [exec] Failed to Japize javax.swing.JInternalFrame$JDesktopIcon: java.lang.ArrayIndexOutOfBoundsException
     [exec] java.lang.ArrayIndexOutOfBoundsException
     [exec] 	at java.util.Arrays.mergeSort(Arrays.java:2460)
     [exec] 	at java.util.Arrays.sort(Arrays.java:2369)
     [exec] 	at java.util.Arrays.sort(Arrays.java:2329)
     [exec] 	at net.wuffies.japi.BoundMemberSet.getFields(BoundMemberSet.java:33)

...

     [exec] 	at net.wuffies.japi.Japize.processRootSet(Japize.java:471)
     [exec] 	at net.wuffies.japi.Japize.doJapize(Japize.java:443)
     [exec] 	at net.wuffies.japi.Japize.main(Japize.java:316)

     [exec] Failed to Japize javax.swing.JInternalFrame$JDesktopIcon$AccessibleJDesktopIcon: java.lang.ArrayIndexOutOfBoundsException
     [exec] java.lang.ArrayIndexOutOfBoundsException
     [exec] 	at java.util.Arrays.mergeSort(Arrays.java:2452)
     [exec] 	at java.util.Arrays.mergeSort(Arrays.java:2432)
     [exec] 	at java.util.Arrays.sort(Arrays.java:2369)
     [exec] 	at java.util.Arrays.sort(Arrays.java:2329)

...

     [exec] 	at net.wuffies.japi.Japize.processRootSet(Japize.java:471)
     [exec] 	at net.wuffies.japi.Japize.doJapize(Japize.java:443)
     [exec] 	at net.wuffies.japi.Japize.main(Japize.java:316)

     [exec] Failed to Japize javax.swing.JLabel: java.lang.ArrayIndexOutOfBoundsException
     [exec] java.lang.ArrayIndexOutOfBoundsException
     [exec] 	at java.util.Arrays.mergeSort(Arrays.java:2458)
     [exec] 	at java.util.Arrays.mergeSort(Arrays.java:2432)
     [exec] 	at java.util.Arrays.sort(Arrays.java:2369)
     [exec] 	at java.util.Arrays.sort(Arrays.java:2329)

...

     [exec] 	at net.wuffies.japi.Japize.processRootSet(Japize.java:471)
     [exec] 	at net.wuffies.japi.Japize.doJapize(Japize.java:443)
     [exec] 	at net.wuffies.japi.Japize.main(Japize.java:316)
     [exec] -
     [exec] Failed to Japize javax.swing.JLabel$AccessibleJLabel: java.lang.ArrayIndexOutOfBoundsException
     [exec] java.lang.ArrayIndexOutOfBoundsException
     [exec] 	at java.util.Arrays.mergeSort(Arrays.java:2452)
     [exec] 	at java.util.Arrays.sort(Arrays.java:2369)
     [exec] 	at java.util.Arrays.sort(Arrays.java:2329)
     [exec] 	at net.wuffies.japi.BoundMemberSet.getCalls(BoundMemberSet.java:46)

...

     [exec] 	at net.wuffies.japi.Japize.processRootSet(Japize.java:471)
     [exec] 	at net.wuffies.japi.Japize.doJapize(Japize.java:443)
     [exec] 	at net.wuffies.japi.Japize.main(Japize.java:316)

     [exec] Failed to Japize javax.swing.JLayeredPane: java.lang.ArrayIndexOutOfBoundsException
     [exec] java.lang.ArrayIndexOutOfBoundsException
     [exec] 	at java.util.Arrays.mergeSort(Arrays.java:2460)
     [exec] 	at java.util.Arrays.sort(Arrays.java:2369)
     [exec] 	at java.util.Arrays.sort(Arrays.java:2329)
     [exec] 	at net.wuffies.japi.BoundMemberSet.getFields(BoundMemberSet.java:33)

...

     [exec] 	at net.wuffies.japi.Japize.processRootSet(Japize.java:471)
     [exec] 	at net.wuffies.japi.Japize.doJapize(Japize.java:443)
     [exec] 	at net.wuffies.japi.Japize.main(Japize.java:316)

     [exec] Failed to Japize javax.swing.JLayeredPane$AccessibleJLayeredPane: java.lang.ArrayIndexOutOfBoundsException
     [exec] java.lang.ArrayIndexOutOfBoundsException
     [exec] 	at java.util.Arrays.mergeSort(Arrays.java:2452)
     [exec] 	at java.util.Arrays.mergeSort(Arrays.java:2432)
     [exec] 	at java.util.Arrays.sort(Arrays.java:2369)
     [exec] 	at java.util.Arrays.sort(Arrays.java:2329)

...

     [exec] 	at net.wuffies.japi.Japize.processRootSet(Japize.java:471)
     [exec] 	at net.wuffies.japi.Japize.doJapize(Japize.java:443)
     [exec] 	at net.wuffies.japi.Japize.main(Japize.java:316)

     [exec] Failed to Japize javax.swing.JList: java.lang.ArrayIndexOutOfBoundsException
     [exec] java.lang.ArrayIndexOutOfBoundsException
     [exec] 	at java.util.Arrays.mergeSort(Arrays.java:2460)
     [exec] 	at java.util.Arrays.sort(Arrays.java:2369)
     [exec] 	at java.util.Arrays.sort(Arrays.java:2329)
     [exec] 	at net.wuffies.japi.BoundMemberSet.getFields(BoundMemberSet.java:33)

...

     [exec] 	at net.wuffies.japi.Japize.processRootSet(Japize.java:471)
     [exec] 	at net.wuffies.japi.Japize.doJapize(Japize.java:443)
     [exec] 	at net.wuffies.japi.Japize.main(Japize.java:316)
     [exec] -
     [exec] Failed to Japize javax.swing.JList$AccessibleJList: java.lang.ArrayIndexOutOfBoundsException
     [exec] java.lang.ArrayIndexOutOfBoundsException
     [exec] 	at java.util.Arrays.mergeSort(Arrays.java:2452)
     [exec] 	at java.util.Arrays.mergeSort(Arrays.java:2432)
     [exec] 	at java.util.Arrays.sort(Arrays.java:2369)
     [exec] 	at java.util.Arrays.sort(Arrays.java:2329)

...

     [exec] 	at net.wuffies.japi.Japize.processRootSet(Japize.java:471)
     [exec] 	at net.wuffies.japi.Japize.doJapize(Japize.java:443)
     [exec] 	at net.wuffies.japi.Japize.main(Japize.java:316)

     [exec] Failed to Japize javax.swing.JList$AccessibleJList$AccessibleJListChild: java.lang.ArrayIndexOutOfBoundsException
     [exec] java.lang.ArrayIndexOutOfBoundsException
     [exec] 	at java.util.Arrays.mergeSort(Arrays.java:2452)
     [exec] 	at java.util.Arrays.mergeSort(Arrays.java:2432)
     [exec] 	at java.util.Arrays.sort(Arrays.java:2369)
     [exec] 	at java.util.Arrays.sort(Arrays.java:2329)

...

     [exec] 	at net.wuffies.japi.Japize.processRootSet(Japize.java:471)
     [exec] 	at net.wuffies.japi.Japize.doJapize(Japize.java:443)
     [exec] 	at net.wuffies.japi.Japize.main(Japize.java:316)
     [exec] -
     [exec] Failed to Japize javax.swing.JMenu: java.lang.ArrayIndexOutOfBoundsException
     [exec] java.lang.ArrayIndexOutOfBoundsException
     [exec] 	at java.util.Arrays.mergeSort(Arrays.java:2458)
     [exec] 	at java.util.Arrays.mergeSort(Arrays.java:2432)
     [exec] 	at java.util.Arrays.sort(Arrays.java:2369)
     [exec] 	at java.util.Arrays.sort(Arrays.java:2329)

...

     [exec] 	at net.wuffies.japi.Japize.processRootSet(Japize.java:471)
     [exec] 	at net.wuffies.japi.Japize.doJapize(Japize.java:443)
     [exec] 	at net.wuffies.japi.Japize.main(Japize.java:316)
     [exec] -
     [exec] Failed to Japize javax.swing.JMenu$AccessibleJMenu: java.lang.ArrayIndexOutOfBoundsException
     [exec] java.lang.ArrayIndexOutOfBoundsException
     [exec] 	at java.util.Arrays.mergeSort(Arrays.java:2452)
     [exec] 	at java.util.Arrays.sort(Arrays.java:2369)
     [exec] 	at java.util.Arrays.sort(Arrays.java:2329)
     [exec] 	at net.wuffies.japi.BoundMemberSet.getCalls(BoundMemberSet.java:46)

...

     [exec] 	at net.wuffies.japi.Japize.processRootSet(Japize.java:471)
     [exec] 	at net.wuffies.japi.Japize.doJapize(Japize.java:443)
     [exec] 	at net.wuffies.japi.Japize.main(Japize.java:316)

     [exec] Failed to Japize javax.swing.JMenu$WinListener: java.lang.ArrayIndexOutOfBoundsException
     [exec] java.lang.ArrayIndexOutOfBoundsException
     [exec] 	at java.util.Arrays.mergeSort(Arrays.java:2452)
     [exec] 	at java.util.Arrays.mergeSort(Arrays.java:2432)
     [exec] 	at java.util.Arrays.sort(Arrays.java:2369)
     [exec] 	at java.util.Arrays.sort(Arrays.java:2329)

...

     [exec] 	at net.wuffies.japi.Japize.processRootSet(Japize.java:471)
     [exec] 	at net.wuffies.japi.Japize.doJapize(Japize.java:443)
     [exec] 	at net.wuffies.japi.Japize.main(Japize.java:316)

     [exec] Failed to Japize javax.swing.JMenuBar: java.lang.ArrayIndexOutOfBoundsException
     [exec] java.lang.ArrayIndexOutOfBoundsException
     [exec] 	at java.util.Arrays.mergeSort(Arrays.java:2460)
     [exec] 	at java.util.Arrays.sort(Arrays.java:2369)
     [exec] 	at java.util.Arrays.sort(Arrays.java:2329)
     [exec] 	at net.wuffies.japi.BoundMemberSet.getFields(BoundMemberSet.java:33)

...

     [exec] 	at net.wuffies.japi.Japize.processRootSet(Japize.java:471)
     [exec] 	at net.wuffies.japi.Japize.doJapize(Japize.java:443)
     [exec] 	at net.wuffies.japi.Japize.main(Japize.java:316)

     [exec] Failed to Japize javax.swing.JMenuBar$AccessibleJMenuBar: java.lang.ArrayIndexOutOfBoundsException
     [exec] java.lang.ArrayIndexOutOfBoundsException
     [exec] 	at java.util.Arrays.mergeSort(Arrays.java:2452)
     [exec] 	at java.util.Arrays.mergeSort(Arrays.java:2432)
     [exec] 	at java.util.Arrays.sort(Arrays.java:2369)
     [exec] 	at java.util.Arrays.sort(Arrays.java:2329)

...

     [exec] 	at net.wuffies.japi.Japize.processRootSet(Japize.java:471)
     [exec] 	at net.wuffies.japi.Japize.doJapize(Japize.java:443)
     [exec] 	at net.wuffies.japi.Japize.main(Japize.java:316)

     [exec] Failed to Japize javax.swing.JMenuItem: java.lang.ArrayIndexOutOfBoundsException
     [exec] java.lang.ArrayIndexOutOfBoundsException
     [exec] 	at java.util.Arrays.mergeSort(Arrays.java:2458)
     [exec] 	at java.util.Arrays.mergeSort(Arrays.java:2432)
     [exec] 	at java.util.Arrays.sort(Arrays.java:2369)
     [exec] 	at java.util.Arrays.sort(Arrays.java:2329)

...

     [exec] 	at net.wuffies.japi.Japize.processRootSet(Japize.java:471)
     [exec] 	at net.wuffies.japi.Japize.doJapize(Japize.java:443)
     [exec] 	at net.wuffies.japi.Japize.main(Japize.java:316)

     [exec] Failed to Japize javax.swing.JMenuItem$AccessibleJMenuItem: java.lang.ArrayIndexOutOfBoundsException
     [exec] java.lang.ArrayIndexOutOfBoundsException
     [exec] 	at java.util.Arrays.mergeSort(Arrays.java:2452)
     [exec] 	at java.util.Arrays.sort(Arrays.java:2369)
     [exec] 	at java.util.Arrays.sort(Arrays.java:2329)
     [exec] 	at net.wuffies.japi.BoundMemberSet.getCalls(BoundMemberSet.java:46)

...

     [exec] 	at net.wuffies.japi.Japize.processRootSet(Japize.java:471)
     [exec] 	at net.wuffies.japi.Japize.doJapize(Japize.java:443)
     [exec] 	at net.wuffies.japi.Japize.main(Japize.java:316)

     [exec] Failed to Japize javax.swing.JOptionPane: java.lang.ArrayIndexOutOfBoundsException
     [exec] java.lang.ArrayIndexOutOfBoundsException
     [exec] 	at java.util.Arrays.mergeSort(Arrays.java:2460)
     [exec] 	at java.util.Arrays.sort(Arrays.java:2369)
     [exec] 	at java.util.Arrays.sort(Arrays.java:2329)
     [exec] 	at net.wuffies.japi.BoundMemberSet.getFields(BoundMemberSet.java:33)

...

     [exec] 	at net.wuffies.japi.Japize.processRootSet(Japize.java:471)
     [exec] 	at net.wuffies.japi.Japize.doJapize(Japize.java:443)
     [exec] 	at net.wuffies.japi.Japize.main(Japize.java:316)

     [exec] Failed to Japize javax.swing.JOptionPane$AccessibleJOptionPane: java.lang.ArrayIndexOutOfBoundsException
     [exec] java.lang.ArrayIndexOutOfBoundsException
     [exec] 	at java.util.Arrays.mergeSort(Arrays.java:2452)
     [exec] 	at java.util.Arrays.mergeSort(Arrays.java:2432)
     [exec] 	at java.util.Arrays.sort(Arrays.java:2369)
     [exec] 	at java.util.Arrays.sort(Arrays.java:2329)

...

     [exec] 	at net.wuffies.japi.Japize.processRootSet(Japize.java:471)
     [exec] 	at net.wuffies.japi.Japize.doJapize(Japize.java:443)
     [exec] 	at net.wuffies.japi.Japize.main(Japize.java:316)
     [exec] ---
     [exec] Failed to Japize javax.swing.JPanel: java.lang.ArrayIndexOutOfBoundsException
     [exec] java.lang.ArrayIndexOutOfBoundsException
     [exec] 	at java.util.Arrays.mergeSort(Arrays.java:2460)
     [exec] 	at java.util.Arrays.sort(Arrays.java:2369)
     [exec] 	at java.util.Arrays.sort(Arrays.java:2329)
     [exec] 	at net.wuffies.japi.BoundMemberSet.getFields(BoundMemberSet.java:33)

...

     [exec] 	at net.wuffies.japi.Japize.processRootSet(Japize.java:471)
     [exec] 	at net.wuffies.japi.Japize.doJapize(Japize.java:443)
     [exec] 	at net.wuffies.japi.Japize.main(Japize.java:316)

     [exec] Failed to Japize javax.swing.JPanel$AccessibleJPanel: java.lang.ArrayIndexOutOfBoundsException
     [exec] java.lang.ArrayIndexOutOfBoundsException
     [exec] 	at java.util.Arrays.mergeSort(Arrays.java:2452)
     [exec] 	at java.util.Arrays.mergeSort(Arrays.java:2432)
     [exec] 	at java.util.Arrays.sort(Arrays.java:2369)
     [exec] 	at java.util.Arrays.sort(Arrays.java:2329)

...

     [exec] 	at net.wuffies.japi.Japize.processRootSet(Japize.java:471)
     [exec] 	at net.wuffies.japi.Japize.doJapize(Japize.java:443)
     [exec] 	at net.wuffies.japi.Japize.main(Japize.java:316)

     [exec] Failed to Japize javax.swing.JPasswordField: java.lang.ArrayIndexOutOfBoundsException
     [exec] java.lang.ArrayIndexOutOfBoundsException
     [exec] 	at java.util.Arrays.mergeSort(Arrays.java:2458)
     [exec] 	at java.util.Arrays.mergeSort(Arrays.java:2432)
     [exec] 	at java.util.Arrays.sort(Arrays.java:2369)
     [exec] 	at java.util.Arrays.sort(Arrays.java:2329)

...

     [exec] 	at net.wuffies.japi.Japize.processRootSet(Japize.java:471)
     [exec] 	at net.wuffies.japi.Japize.doJapize(Japize.java:443)
     [exec] 	at net.wuffies.japi.Japize.main(Japize.java:316)

     [exec] Failed to Japize javax.swing.JPasswordField$AccessibleJPasswordField: java.lang.ArrayIndexOutOfBoundsException
     [exec] java.lang.ArrayIndexOutOfBoundsException
     [exec] 	at java.util.Arrays.mergeSort(Arrays.java:2452)
     [exec] 	at java.util.Arrays.sort(Arrays.java:2369)
     [exec] 	at java.util.Arrays.sort(Arrays.java:2329)
     [exec] 	at net.wuffies.japi.BoundMemberSet.getCalls(BoundMemberSet.java:46)

...

     [exec] 	at net.wuffies.japi.Japize.processRootSet(Japize.java:471)
     [exec] 	at net.wuffies.japi.Japize.doJapize(Japize.java:443)
     [exec] 	at net.wuffies.japi.Japize.main(Japize.java:316)
     [exec] -
     [exec] Failed to Japize javax.swing.JPopupMenu: java.lang.ArrayIndexOutOfBoundsException
     [exec] java.lang.ArrayIndexOutOfBoundsException
     [exec] 	at java.util.Arrays.mergeSort(Arrays.java:2460)
     [exec] 	at java.util.Arrays.sort(Arrays.java:2369)
     [exec] 	at java.util.Arrays.sort(Arrays.java:2329)
     [exec] 	at net.wuffies.japi.BoundMemberSet.getFields(BoundMemberSet.java:33)

...

     [exec] 	at net.wuffies.japi.Japize.processRootSet(Japize.java:471)
     [exec] 	at net.wuffies.japi.Japize.doJapize(Japize.java:443)
     [exec] 	at net.wuffies.japi.Japize.main(Japize.java:316)
     [exec] -
     [exec] Failed to Japize javax.swing.JPopupMenu$AccessibleJPopupMenu: java.lang.ArrayIndexOutOfBoundsException
     [exec] java.lang.ArrayIndexOutOfBoundsException
     [exec] 	at java.util.Arrays.mergeSort(Arrays.java:2452)
     [exec] 	at java.util.Arrays.mergeSort(Arrays.java:2432)
     [exec] 	at java.util.Arrays.sort(Arrays.java:2369)
     [exec] 	at java.util.Arrays.sort(Arrays.java:2329)

...

     [exec] 	at net.wuffies.japi.Japize.processRootSet(Japize.java:471)
     [exec] 	at net.wuffies.japi.Japize.doJapize(Japize.java:443)
     [exec] 	at net.wuffies.japi.Japize.main(Japize.java:316)
     [exec] -
     [exec] Failed to Japize javax.swing.JPopupMenu$Separator: java.lang.ArrayIndexOutOfBoundsException
     [exec] java.lang.ArrayIndexOutOfBoundsException
     [exec] 	at java.util.Arrays.mergeSort(Arrays.java:2458)
     [exec] 	at java.util.Arrays.mergeSort(Arrays.java:2432)
     [exec] 	at java.util.Arrays.sort(Arrays.java:2369)
     [exec] 	at java.util.Arrays.sort(Arrays.java:2329)

...

     [exec] 	at net.wuffies.japi.Japize.processRootSet(Japize.java:471)
     [exec] 	at net.wuffies.japi.Japize.doJapize(Japize.java:443)
     [exec] 	at net.wuffies.japi.Japize.main(Japize.java:316)

     [exec] Failed to Japize javax.swing.JProgressBar: java.lang.ArrayIndexOutOfBoundsException
     [exec] java.lang.ArrayIndexOutOfBoundsException
     [exec] 	at java.util.Arrays.mergeSort(Arrays.java:2458)
     [exec] 	at java.util.Arrays.mergeSort(Arrays.java:2432)
     [exec] 	at java.util.Arrays.sort(Arrays.java:2369)
     [exec] 	at java.util.Arrays.sort(Arrays.java:2329)

...

     [exec] 	at net.wuffies.japi.Japize.processRootSet(Japize.java:471)
     [exec] 	at net.wuffies.japi.Japize.doJapize(Japize.java:443)
     [exec] 	at net.wuffies.japi.Japize.main(Japize.java:316)

     [exec] Failed to Japize javax.swing.JProgressBar$AccessibleJProgressBar: java.lang.ArrayIndexOutOfBoundsException
     [exec] java.lang.ArrayIndexOutOfBoundsException
     [exec] 	at java.util.Arrays.mergeSort(Arrays.java:2452)
     [exec] 	at java.util.Arrays.mergeSort(Arrays.java:2432)
     [exec] 	at java.util.Arrays.sort(Arrays.java:2369)
     [exec] 	at java.util.Arrays.sort(Arrays.java:2329)

...

     [exec] 	at net.wuffies.japi.Japize.processRootSet(Japize.java:471)
     [exec] 	at net.wuffies.japi.Japize.doJapize(Japize.java:443)
     [exec] 	at net.wuffies.japi.Japize.main(Japize.java:316)
     [exec] -
     [exec] Failed to Japize javax.swing.JRadioButton: java.lang.ArrayIndexOutOfBoundsException
     [exec] java.lang.ArrayIndexOutOfBoundsException
     [exec] 	at java.util.Arrays.mergeSort(Arrays.java:2458)
     [exec] 	at java.util.Arrays.mergeSort(Arrays.java:2432)
     [exec] 	at java.util.Arrays.sort(Arrays.java:2369)
     [exec] 	at java.util.Arrays.sort(Arrays.java:2329)

...

     [exec] 	at net.wuffies.japi.Japize.processRootSet(Japize.java:471)
     [exec] 	at net.wuffies.japi.Japize.doJapize(Japize.java:443)
     [exec] 	at net.wuffies.japi.Japize.main(Japize.java:316)
     [exec] -
     [exec] Failed to Japize javax.swing.JRadioButton$AccessibleJRadioButton: java.lang.ArrayIndexOutOfBoundsException
     [exec] java.lang.ArrayIndexOutOfBoundsException
     [exec] 	at java.util.Arrays.mergeSort(Arrays.java:2452)
     [exec] 	at java.util.Arrays.sort(Arrays.java:2369)
     [exec] 	at java.util.Arrays.sort(Arrays.java:2329)
     [exec] 	at net.wuffies.japi.BoundMemberSet.getCalls(BoundMemberSet.java:46)

...

     [exec] 	at net.wuffies.japi.Japize.processRootSet(Japize.java:471)
     [exec] 	at net.wuffies.japi.Japize.doJapize(Japize.java:443)
     [exec] 	at net.wuffies.japi.Japize.main(Japize.java:316)

     [exec] Failed to Japize javax.swing.JRadioButtonMenuItem: java.lang.ArrayIndexOutOfBoundsException
     [exec] java.lang.ArrayIndexOutOfBoundsException
     [exec] 	at java.util.Arrays.mergeSort(Arrays.java:2458)
     [exec] 	at java.util.Arrays.mergeSort(Arrays.java:2432)
     [exec] 	at java.util.Arrays.sort(Arrays.java:2369)
     [exec] 	at java.util.Arrays.sort(Arrays.java:2329)

...

     [exec] 	at net.wuffies.japi.Japize.processRootSet(Japize.java:471)
     [exec] 	at net.wuffies.japi.Japize.doJapize(Japize.java:443)
     [exec] 	at net.wuffies.japi.Japize.main(Japize.java:316)

     [exec] Failed to Japize javax.swing.JRadioButtonMenuItem$AccessibleJRadioButtonMenuItem: java.lang.ArrayIndexOutOfBoundsException
     [exec] java.lang.ArrayIndexOutOfBoundsException
     [exec] 	at java.util.Arrays.mergeSort(Arrays.java:2452)
     [exec] 	at java.util.Arrays.sort(Arrays.java:2369)
     [exec] 	at java.util.Arrays.sort(Arrays.java:2329)
     [exec] 	at net.wuffies.japi.BoundMemberSet.getCalls(BoundMemberSet.java:46)

...

     [exec] 	at net.wuffies.japi.Japize.processRootSet(Japize.java:471)
     [exec] 	at net.wuffies.japi.Japize.doJapize(Japize.java:443)
     [exec] 	at net.wuffies.japi.Japize.main(Japize.java:316)

     [exec] Failed to Japize javax.swing.JRootPane: java.lang.ArrayIndexOutOfBoundsException
     [exec] java.lang.ArrayIndexOutOfBoundsException
     [exec] 	at java.util.Arrays.mergeSort(Arrays.java:2460)
     [exec] 	at java.util.Arrays.sort(Arrays.java:2369)
     [exec] 	at java.util.Arrays.sort(Arrays.java:2329)
     [exec] 	at net.wuffies.japi.BoundMemberSet.getFields(BoundMemberSet.java:33)

...

     [exec] 	at net.wuffies.japi.Japize.processRootSet(Japize.java:471)
     [exec] 	at net.wuffies.japi.Japize.doJapize(Japize.java:443)
     [exec] 	at net.wuffies.japi.Japize.main(Japize.java:316)

     [exec] Failed to Japize javax.swing.JRootPane$AccessibleJRootPane: java.lang.ArrayIndexOutOfBoundsException
     [exec] java.lang.ArrayIndexOutOfBoundsException
     [exec] 	at java.util.Arrays.mergeSort(Arrays.java:2452)
     [exec] 	at java.util.Arrays.mergeSort(Arrays.java:2432)
     [exec] 	at java.util.Arrays.sort(Arrays.java:2369)
     [exec] 	at java.util.Arrays.sort(Arrays.java:2329)

...

     [exec] 	at net.wuffies.japi.Japize.processRootSet(Japize.java:471)
     [exec] 	at net.wuffies.japi.Japize.doJapize(Japize.java:443)
     [exec] 	at net.wuffies.japi.Japize.main(Japize.java:316)
     [exec] -
     [exec] Failed to Japize javax.swing.JRootPane$RootLayout: java.lang.ArrayIndexOutOfBoundsException
     [exec] java.lang.ArrayIndexOutOfBoundsException
     [exec] 	at java.util.Arrays.mergeSort(Arrays.java:2458)
     [exec] 	at java.util.Arrays.sort(Arrays.java:2369)
     [exec] 	at java.util.Arrays.sort(Arrays.java:2329)
     [exec] 	at net.wuffies.japi.BoundMemberSet.getCalls(BoundMemberSet.java:46)

...

     [exec] 	at net.wuffies.japi.Japize.processRootSet(Japize.java:471)
     [exec] 	at net.wuffies.japi.Japize.doJapize(Japize.java:443)
     [exec] 	at net.wuffies.japi.Japize.main(Japize.java:316)

     [exec] Failed to Japize javax.swing.JScrollBar: java.lang.ArrayIndexOutOfBoundsException
     [exec] java.lang.ArrayIndexOutOfBoundsException
     [exec] 	at java.util.Arrays.mergeSort(Arrays.java:2452)
     [exec] 	at java.util.Arrays.mergeSort(Arrays.java:2432)
     [exec] 	at java.util.Arrays.sort(Arrays.java:2369)
     [exec] 	at java.util.Arrays.sort(Arrays.java:2329)

...

     [exec] 	at net.wuffies.japi.Japize.processRootSet(Japize.java:471)
     [exec] 	at net.wuffies.japi.Japize.doJapize(Japize.java:443)
     [exec] 	at net.wuffies.japi.Japize.main(Japize.java:316)
     [exec] -
     [exec] Failed to Japize javax.swing.JScrollBar$AccessibleJScrollBar: java.lang.ArrayIndexOutOfBoundsException
     [exec] java.lang.ArrayIndexOutOfBoundsException
     [exec] 	at java.util.Arrays.mergeSort(Arrays.java:2452)
     [exec] 	at java.util.Arrays.mergeSort(Arrays.java:2432)
     [exec] 	at java.util.Arrays.sort(Arrays.java:2369)
     [exec] 	at java.util.Arrays.sort(Arrays.java:2329)

...

     [exec] 	at net.wuffies.japi.Japize.processRootSet(Japize.java:471)
     [exec] 	at net.wuffies.japi.Japize.doJapize(Japize.java:443)
     [exec] 	at net.wuffies.japi.Japize.main(Japize.java:316)

     [exec] Failed to Japize javax.swing.JScrollPane: java.lang.ArrayIndexOutOfBoundsException
     [exec] java.lang.ArrayIndexOutOfBoundsException
     [exec] 	at java.util.Arrays.mergeSort(Arrays.java:2452)
     [exec] 	at java.util.Arrays.mergeSort(Arrays.java:2432)
     [exec] 	at java.util.Arrays.sort(Arrays.java:2369)
     [exec] 	at java.util.Arrays.sort(Arrays.java:2329)

...

     [exec] 	at net.wuffies.japi.Japize.processRootSet(Japize.java:471)
     [exec] 	at net.wuffies.japi.Japize.doJapize(Japize.java:443)
     [exec] 	at net.wuffies.japi.Japize.main(Japize.java:316)

     [exec] Failed to Japize javax.swing.JScrollPane$AccessibleJScrollPane: java.lang.ArrayIndexOutOfBoundsException
     [exec] java.lang.ArrayIndexOutOfBoundsException
     [exec] 	at java.util.Arrays.mergeSort(Arrays.java:2452)
     [exec] 	at java.util.Arrays.mergeSort(Arrays.java:2432)
     [exec] 	at java.util.Arrays.sort(Arrays.java:2369)
     [exec] 	at java.util.Arrays.sort(Arrays.java:2329)

...

     [exec] 	at net.wuffies.japi.Japize.processRootSet(Japize.java:471)
     [exec] 	at net.wuffies.japi.Japize.doJapize(Japize.java:443)
     [exec] 	at net.wuffies.japi.Japize.main(Japize.java:316)

     [exec] Failed to Japize javax.swing.JScrollPane$ScrollBar: java.lang.ArrayIndexOutOfBoundsException
     [exec] java.lang.ArrayIndexOutOfBoundsException
     [exec] 	at java.util.Arrays.mergeSort(Arrays.java:2452)
     [exec] 	at java.util.Arrays.mergeSort(Arrays.java:2432)
     [exec] 	at java.util.Arrays.sort(Arrays.java:2369)
     [exec] 	at java.util.Arrays.sort(Arrays.java:2329)

...

     [exec] 	at net.wuffies.japi.Japize.processRootSet(Japize.java:471)
     [exec] 	at net.wuffies.japi.Japize.doJapize(Japize.java:443)
     [exec] 	at net.wuffies.japi.Japize.main(Japize.java:316)

     [exec] Failed to Japize javax.swing.JSeparator: java.lang.ArrayIndexOutOfBoundsException
     [exec] java.lang.ArrayIndexOutOfBoundsException
     [exec] 	at java.util.Arrays.mergeSort(Arrays.java:2458)
     [exec] 	at java.util.Arrays.mergeSort(Arrays.java:2432)
     [exec] 	at java.util.Arrays.sort(Arrays.java:2369)
     [exec] 	at java.util.Arrays.sort(Arrays.java:2329)

...

     [exec] 	at net.wuffies.japi.Japize.processRootSet(Japize.java:471)
     [exec] 	at net.wuffies.japi.Japize.doJapize(Japize.java:443)
     [exec] 	at net.wuffies.japi.Japize.main(Japize.java:316)

     [exec] Failed to Japize javax.swing.JSeparator$AccessibleJSeparator: java.lang.ArrayIndexOutOfBoundsException
     [exec] java.lang.ArrayIndexOutOfBoundsException
     [exec] 	at java.util.Arrays.mergeSort(Arrays.java:2452)
     [exec] 	at java.util.Arrays.mergeSort(Arrays.java:2432)
     [exec] 	at java.util.Arrays.sort(Arrays.java:2369)
     [exec] 	at java.util.Arrays.sort(Arrays.java:2329)

...

     [exec] 	at net.wuffies.japi.Japize.processRootSet(Japize.java:471)
     [exec] 	at net.wuffies.japi.Japize.doJapize(Japize.java:443)
     [exec] 	at net.wuffies.japi.Japize.main(Japize.java:316)

     [exec] Failed to Japize javax.swing.JSlider: java.lang.ArrayIndexOutOfBoundsException
     [exec] java.lang.ArrayIndexOutOfBoundsException
     [exec] 	at java.util.Arrays.mergeSort(Arrays.java:2458)
     [exec] 	at java.util.Arrays.mergeSort(Arrays.java:2432)
     [exec] 	at java.util.Arrays.sort(Arrays.java:2369)
     [exec] 	at java.util.Arrays.sort(Arrays.java:2329)

...

     [exec] 	at net.wuffies.japi.Japize.processRootSet(Japize.java:471)
     [exec] 	at net.wuffies.japi.Japize.doJapize(Japize.java:443)
     [exec] 	at net.wuffies.japi.Japize.main(Japize.java:316)
     [exec] -
     [exec] Failed to Japize javax.swing.JSlider$AccessibleJSlider: java.lang.ArrayIndexOutOfBoundsException
     [exec] java.lang.ArrayIndexOutOfBoundsException
     [exec] 	at java.util.Arrays.mergeSort(Arrays.java:2452)
     [exec] 	at java.util.Arrays.mergeSort(Arrays.java:2432)
     [exec] 	at java.util.Arrays.sort(Arrays.java:2369)
     [exec] 	at java.util.Arrays.sort(Arrays.java:2329)

...

     [exec] 	at net.wuffies.japi.Japize.processRootSet(Japize.java:471)
     [exec] 	at net.wuffies.japi.Japize.doJapize(Japize.java:443)
     [exec] 	at net.wuffies.japi.Japize.main(Japize.java:316)
     [exec] -
     [exec] Failed to Japize javax.swing.JSpinner: java.lang.ArrayIndexOutOfBoundsException
     [exec] java.lang.ArrayIndexOutOfBoundsException
     [exec] 	at java.util.Arrays.mergeSort(Arrays.java:2460)
     [exec] 	at java.util.Arrays.sort(Arrays.java:2369)
     [exec] 	at java.util.Arrays.sort(Arrays.java:2329)
     [exec] 	at net.wuffies.japi.BoundMemberSet.getFields(BoundMemberSet.java:33)

...

     [exec] 	at net.wuffies.japi.Japize.processRootSet(Japize.java:471)
     [exec] 	at net.wuffies.japi.Japize.doJapize(Japize.java:443)
     [exec] 	at net.wuffies.japi.Japize.main(Japize.java:316)
     [exec] -
     [exec] Failed to Japize javax.swing.JSpinner$AccessibleJSpinner: java.lang.ArrayIndexOutOfBoundsException
     [exec] java.lang.ArrayIndexOutOfBoundsException
     [exec] 	at java.util.Arrays.mergeSort(Arrays.java:2452)
     [exec] 	at java.util.Arrays.sort(Arrays.java:2369)
     [exec] 	at java.util.Arrays.sort(Arrays.java:2329)
     [exec] 	at net.wuffies.japi.BoundMemberSet.getCalls(BoundMemberSet.java:46)

...

     [exec] 	at net.wuffies.japi.Japize.processRootSet(Japize.java:471)
     [exec] 	at net.wuffies.japi.Japize.doJapize(Japize.java:443)
     [exec] 	at net.wuffies.japi.Japize.main(Japize.java:316)

     [exec] Failed to Japize javax.swing.JSpinner$DateEditor: java.lang.ArrayIndexOutOfBoundsException
     [exec] java.lang.ArrayIndexOutOfBoundsException
     [exec] 	at java.util.Arrays.mergeSort(Arrays.java:2460)
     [exec] 	at java.util.Arrays.sort(Arrays.java:2369)
     [exec] 	at java.util.Arrays.sort(Arrays.java:2329)
     [exec] 	at net.wuffies.japi.BoundMemberSet.getFields(BoundMemberSet.java:33)

...

     [exec] 	at net.wuffies.japi.Japize.processRootSet(Japize.java:471)
     [exec] 	at net.wuffies.japi.Japize.doJapize(Japize.java:443)
     [exec] 	at net.wuffies.japi.Japize.main(Japize.java:316)

     [exec] Failed to Japize javax.swing.JSpinner$DefaultEditor: java.lang.ArrayIndexOutOfBoundsException
     [exec] java.lang.ArrayIndexOutOfBoundsException
     [exec] 	at java.util.Arrays.mergeSort(Arrays.java:2460)
     [exec] 	at java.util.Arrays.sort(Arrays.java:2369)
     [exec] 	at java.util.Arrays.sort(Arrays.java:2329)
     [exec] 	at net.wuffies.japi.BoundMemberSet.getFields(BoundMemberSet.java:33)

...

     [exec] 	at net.wuffies.japi.Japize.processRootSet(Japize.java:471)
     [exec] 	at net.wuffies.japi.Japize.doJapize(Japize.java:443)
     [exec] 	at net.wuffies.japi.Japize.main(Japize.java:316)

     [exec] Failed to Japize javax.swing.JSpinner$ListEditor: java.lang.ArrayIndexOutOfBoundsException
     [exec] java.lang.ArrayIndexOutOfBoundsException
     [exec] 	at java.util.Arrays.mergeSort(Arrays.java:2460)
     [exec] 	at java.util.Arrays.sort(Arrays.java:2369)
     [exec] 	at java.util.Arrays.sort(Arrays.java:2329)
     [exec] 	at net.wuffies.japi.BoundMemberSet.getFields(BoundMemberSet.java:33)

...

     [exec] 	at net.wuffies.japi.Japize.processRootSet(Japize.java:471)
     [exec] 	at net.wuffies.japi.Japize.doJapize(Japize.java:443)
     [exec] 	at net.wuffies.japi.Japize.main(Japize.java:316)
     [exec] -
     [exec] Failed to Japize javax.swing.JSpinner$NumberEditor: java.lang.ArrayIndexOutOfBoundsException
     [exec] java.lang.ArrayIndexOutOfBoundsException
     [exec] 	at java.util.Arrays.mergeSort(Arrays.java:2460)
     [exec] 	at java.util.Arrays.sort(Arrays.java:2369)
     [exec] 	at java.util.Arrays.sort(Arrays.java:2329)
     [exec] 	at net.wuffies.japi.BoundMemberSet.getFields(BoundMemberSet.java:33)

...

update-index:

test-result:

BUILD FAILED
/home/hybld/continuum-working-directory/6/build.xml:204: There were test errors.

Total time: 78 minutes 42 seconds

****************************************************************************

...

Mime
View raw message