harmony-alerts mailing list archives

Site index · List index
Message view « Date » · « Thread »
Top « Date » · « Thread »
From nom...@hursley.ibm.com
Subject [continuum] BUILD FAILURE: Classlib/linux.ia32 Build/Test
Date Thu, 12 Apr 2007 15:33:37 GMT
Online report : http://people.apache.org/~hindessm/continuum/classlib/linux.ia32/2007/04/12/20070412-153337.failure.log.gz
Build statistics:
  State: Failed
  Previous State: Failed
  Started at: Thu, 12 Apr 2007 15:08:47 +0100
  Finished at: Thu, 12 Apr 2007 16:33:34 +0100
  Total time: 1h 24m 46s
  Build Trigger: Schedule
  Exit code: 1
  Building machine hostname: hy2
  Operating system : Linux(unknown)
  Java version : 1.5.0_06(Sun Microsystems Inc.)

Changes
                            classlib/modules/sql/src/test/java/org/apache/harmony/sql/tests/javax/sql/rowset/serial/SQLInputImplTest.java
            classlib/modules/sql/src/test/java/org/apache/harmony/sql/tests/javax/sql/rowset/serial/SQLOutputImplTest.java
            classlib/modules/sql/src/test/java/org/apache/harmony/sql/tests/javax/sql/rowset/serial/SerialArrayTest.java
            classlib/modules/sql/src/main/java/javax/sql/rowset/serial/SQLInputImpl.java
            classlib/modules/sql/src/main/java/javax/sql/rowset/serial/SQLOutputImpl.java
            classlib/modules/sql/src/main/java/javax/sql/rowset/serial/SerialArray.java
        
****************************************************************************
Output:
****************************************************************************
Buildfile: build.xml

svn-prop:

build:
   [delete] Deleting directory /home/hybld/continuum-working-directory/6/classlib/deploy
     [echo] Classlib revision is 527948
     [echo] Post process: true
     [echo] JAPI: true
     [echo] Building with reference jdk/javac
     [exec] Buildfile: build.xml

     [exec] -init-hdk-for-clean:
     [exec]     [mkdir] Created dir: /home/hybld/continuum-working-directory/6/classlib/deploy/build/ant
     [exec]      [copy] Copying 1 file to /home/hybld/continuum-working-directory/6/classlib/deploy/build/ant

     [exec] clean-java:

     [exec] -modules-clean-bin:

     [exec] clean:
     [exec]    [delete] Deleting 30 files from /home/hybld/continuum-working-directory/6/classlib/build/classes
     [exec]    [delete] Deleting 12 files from /home/hybld/continuum-working-directory/6/classlib/modules/accessibility/bin/test

     [exec] clean:
     [exec]    [delete] Deleting 13 files from /home/hybld/continuum-working-directory/6/classlib/build/classes
     [exec]    [delete] Deleting 5 files from /home/hybld/continuum-working-directory/6/classlib/modules/annotation/bin/test

     [exec] clean:
     [exec]    [delete] Deleting 35 files from /home/hybld/continuum-working-directory/6/classlib/build/classes
     [exec]    [delete] Deleting 1 files from /home/hybld/continuum-working-directory/6/classlib/modules/applet/bin/test

     [exec] clean:
     [exec]    [delete] Deleting 42 files from /home/hybld/continuum-working-directory/6/classlib/build/classes
     [exec]    [delete] Deleting 36 files from /home/hybld/continuum-working-directory/6/classlib/modules/archive/bin/test

     [exec] clean-native-includes:
     [exec]    [delete] /home/hybld/continuum-working-directory/6/classlib/deploy/include
not found.

     [exec] clean:
     [exec]    [delete] Deleting 112 files from /home/hybld/continuum-working-directory/6/classlib/build/classes
     [exec]    [delete] Deleting 226 files from /home/hybld/continuum-working-directory/6/classlib/modules/auth/bin/test

     [exec] clean:
     [exec]    [delete] Deleting 908 files from /home/hybld/continuum-working-directory/6/classlib/build/classes
     [exec]    [delete] Deleting 537 files from /home/hybld/continuum-working-directory/6/classlib/modules/awt/bin/test

     [exec] clean:
     [exec]    [delete] Deleting 107 files from /home/hybld/continuum-working-directory/6/classlib/build/classes
     [exec]    [delete] Deleting 238 files from /home/hybld/continuum-working-directory/6/classlib/modules/beans/bin/test

     [exec] clean:
     [exec]    [delete] Deleting 125 files from /home/hybld/continuum-working-directory/6/classlib/build/classes
     [exec]    [delete] /home/hybld/continuum-working-directory/6/classlib/modules/concurrent/bin/test
not found.

     [exec] clean:
     [exec]    [delete] Deleting 48 files from /home/hybld/continuum-working-directory/6/classlib/build/classes
     [exec]    [delete] Deleting 90 files from /home/hybld/continuum-working-directory/6/classlib/modules/crypto/bin/test

     [exec] clean:
     [exec]    [delete] Deleting 93 files from /home/hybld/continuum-working-directory/6/classlib/build/classes
     [exec]    [delete] Deleting 3 files from /home/hybld/continuum-working-directory/6/classlib/modules/imageio/bin/test

     [exec] clean:
     [exec]    [delete] Deleting 9 files from /home/hybld/continuum-working-directory/6/classlib/build/classes
     [exec]    [delete] Deleting 20 files from /home/hybld/continuum-working-directory/6/classlib/modules/instrument/bin/test

     [exec] clean:
     [exec]    [delete] Deleting 177 files from /home/hybld/continuum-working-directory/6/classlib/build/classes
     [exec]    [delete] Deleting 192 files from /home/hybld/continuum-working-directory/6/classlib/modules/jndi/bin/test

     [exec] clean:
     [exec]    [delete] Deleting 43 files from /home/hybld/continuum-working-directory/6/classlib/build/classes
     [exec]    [delete] Deleting 18 files from /home/hybld/continuum-working-directory/6/classlib/modules/lang-management/bin/api
     [exec]    [delete] Deleting 16 files from /home/hybld/continuum-working-directory/6/classlib/modules/lang-management/bin/impl

     [exec] clean:
     [exec]    [delete] Deleting 34 files from /home/hybld/continuum-working-directory/6/classlib/build/classes
     [exec]    [delete] Deleting 100 files from /home/hybld/continuum-working-directory/6/classlib/modules/logging/bin/test

     [exec] clean:
     [exec]    [delete] Deleting 969 files from /home/hybld/continuum-working-directory/6/classlib/build/classes
     [exec]    [delete] Deleting 926 files from /home/hybld/continuum-working-directory/6/classlib/modules/luni/bin/test

     [exec] clean-native-includes:
     [exec]    [delete] /home/hybld/continuum-working-directory/6/classlib/deploy/include
not found.
     [exec]    [delete] /home/hybld/continuum-working-directory/6/classlib/deploy/jdk/include
not found.

     [exec] clean:
     [exec]    [delete] Deleting 29 files from /home/hybld/continuum-working-directory/6/classlib/build/classes

     [exec] clean:
     [exec]    [delete] Deleting 14 files from /home/hybld/continuum-working-directory/6/classlib/build/classes
     [exec]    [delete] Deleting 25 files from /home/hybld/continuum-working-directory/6/classlib/modules/math/bin/test

     [exec] clean:
     [exec]    [delete] Deleting 14 files from /home/hybld/continuum-working-directory/6/classlib/build/classes
     [exec]    [delete] Deleting 1 files from /home/hybld/continuum-working-directory/6/classlib/modules/misc/bin/test

     [exec] clean:
     [exec]    [delete] Deleting 142 files from /home/hybld/continuum-working-directory/6/classlib/build/classes
     [exec]    [delete] Deleted 5 directories from /home/hybld/continuum-working-directory/6/classlib/build/classes
     [exec]    [delete] Deleting 157 files from /home/hybld/continuum-working-directory/6/classlib/modules/nio/bin/test
     [exec]    [delete] Deleted 19 directories from /home/hybld/continuum-working-directory/6/classlib/modules/nio/bin/test

     [exec] clean:
     [exec]    [delete] Deleting 20 files from /home/hybld/continuum-working-directory/6/classlib/build/classes
     [exec]    [delete] Deleting 79 files from /home/hybld/continuum-working-directory/6/classlib/modules/nio_char/bin/test

     [exec] clean:
     [exec]    [delete] Deleting 44 files from /home/hybld/continuum-working-directory/6/classlib/build/classes
     [exec]    [delete] Deleting 19 files from /home/hybld/continuum-working-directory/6/classlib/modules/pack200/bin/test

     [exec] clean-native-includes:
     [exec]    [delete] /home/hybld/continuum-working-directory/6/classlib/deploy/include
not found.

     [exec] clean:

     [exec] clean:
     [exec]    [delete] Deleting 32 files from /home/hybld/continuum-working-directory/6/classlib/build/classes
     [exec]    [delete] Deleting 34 files from /home/hybld/continuum-working-directory/6/classlib/modules/prefs/bin/test

     [exec] clean:
     [exec]    [delete] Deleting 205 files from /home/hybld/continuum-working-directory/6/classlib/build/classes
     [exec]    [delete] Deleting 60 files from /home/hybld/continuum-working-directory/6/classlib/modules/print/bin/test

     [exec] clean:
     [exec]    [delete] Deleting 177 files from /home/hybld/continuum-working-directory/6/classlib/build/classes
     [exec]    [delete] Deleting 13 files from /home/hybld/continuum-working-directory/6/classlib/modules/regex/bin/test

     [exec] clean:
     [exec]    [delete] Deleting 230 files from /home/hybld/continuum-working-directory/6/classlib/build/classes
     [exec]    [delete] Deleting 53 files from /home/hybld/continuum-working-directory/6/classlib/modules/rmi/bin/test

     [exec] clean:
     [exec]    [delete] Deleting 429 files from /home/hybld/continuum-working-directory/6/classlib/build/classes
     [exec]    [delete] Deleting 622 files from /home/hybld/continuum-working-directory/6/classlib/modules/security/bin/test

     [exec] clean:
     [exec]    [delete] Deleting 2 files from /home/hybld/continuum-working-directory/6/classlib/build/classes

     [exec] clean:
     [exec]    [delete] Deleting 74 files from /home/hybld/continuum-working-directory/6/classlib/build/classes
     [exec]    [delete] Deleting 54 files from /home/hybld/continuum-working-directory/6/classlib/modules/sound/bin/test

     [exec] clean:
     [exec]    [delete] Deleting 76 files from /home/hybld/continuum-working-directory/6/classlib/build/classes
     [exec]    [delete] Deleting 58 files from /home/hybld/continuum-working-directory/6/classlib/modules/sql/bin/test

     [exec] clean:
     [exec]    [delete] Deleting 6 files from /home/hybld/continuum-working-directory/6/classlib/build/classes

     [exec] clean:
     [exec]    [delete] Deleting 1626 files from /home/hybld/continuum-working-directory/6/classlib/build/classes
     [exec]    [delete] Deleting 4 files from /home/hybld/continuum-working-directory/6/classlib/build/classes

...

     [exec]     [javac] ----------
     [exec]     [javac] 1. WARNING in /home/hybld/continuum-working-directory/6/classlib/modules/annotation/src/test/java/org/apache/harmony/annotation/tests/java/lang/annotation/IncompleteAnnotationExceptionTest.java
     [exec]     [javac]  (at line 53)
     [exec]     [javac] 	clazz, elementName);
     [exec]     [javac] 	^^^^^
     [exec]     [javac] Type safety: The expression of type Class needs unchecked conversion
to conform to Class<? extends Annotation>
     [exec]     [javac] ----------
     [exec]     [javac] 1 problem (1 warning)

     [exec] prepare-exclude:

...

     [exec]     [junit] Tests run: 43, Failures: 0, Errors: 0, Time elapsed: 0.117 sec
     [exec]     [junit] 2007-04-12 15:26:23.904::INFO:  jetty-6.0.x
     [exec]     [junit] 2007-04-12 15:26:23.906::INFO:  Started SocketConnector @ 0.0.0.0:32837
     [exec]     [junit] Tests run: 44, Failures: 0, Errors: 2, Time elapsed: 378.795 sec
     [exec]     [junit] TEST tests.api.java.net.URLConnectionTest FAILED
     [exec]     [junit] Tests run: 3, Failures: 0, Errors: 0, Time elapsed: 0.005 sec
     [exec]     [junit] Tests run: 1, Failures: 0, Errors: 0, Time elapsed: 0.004 sec
     [exec]     [junit] 2007-04-12 15:32:42.650::INFO:  jetty-6.0.x
     [exec]     [junit] 2007-04-12 15:32:42.651::INFO:  Started SocketConnector @ 0.0.0.0:32846
     [exec]     [junit] Tests run: 29, Failures: 0, Errors: 0, Time elapsed: 0.071 sec

...

     [exec]     [junit] Tests run: 2, Failures: 0, Errors: 0, Time elapsed: 0.004 sec
     [exec]     [junit] Tests run: 8, Failures: 0, Errors: 0, Time elapsed: 0.008 sec
     [exec]     [junit] Tests run: 40, Failures: 0, Errors: 0, Time elapsed: 0.025 sec
     [exec]     [junit] Tests run: 16, Failures: 0, Errors: 2, Time elapsed: 0.249 sec
     [exec]     [junit] TEST tests.api.java.util.PropertiesTest FAILED
     [exec]     [junit] Tests run: 6, Failures: 0, Errors: 0, Time elapsed: 0.004 sec
     [exec]     [junit] Tests run: 3, Failures: 0, Errors: 0, Time elapsed: 0.004 sec
     [exec]     [junit] Tests run: 11, Failures: 0, Errors: 0, Time elapsed: 0.007 sec
     [exec]     [junit] Tests run: 4, Failures: 0, Errors: 0, Time elapsed: 0.028 sec
     [exec]     [junit] Tests run: 67, Failures: 0, Errors: 0, Time elapsed: 1.566 sec

...

     [exec]     [junit] Tests run: 23, Failures: 0, Errors: 0, Time elapsed: 0.128 sec
     [exec]     [junit] Tests run: 19, Failures: 0, Errors: 0, Time elapsed: 0.06 sec
     [exec]     [junit] Tests run: 48, Failures: 0, Errors: 0, Time elapsed: 0.305 sec
     [exec]     [junit] Tests run: 16, Failures: 0, Errors: 0, Time elapsed: 0.372 sec
     [exec]     [junit] Tests FAILED

     [exec] touch-failures-file:

     [exec] touch-errors-file:


...

     [exec]     [junit] org.apache.harmony.rmi.test.MyException: MyRemoteObject.test_Exception
     [exec]     [junit] Done.

     [exec]     [junit] Testing test_Error...
     [exec]     [junit] java.rmi.ServerError: Error occurred while remote method invocation;
nested exception is:
     [exec]     [junit] 	java.lang.Error: MyRemoteObject.test_Error
     [exec]     [junit] Done.

     [exec]     [junit] Testing test_RuntimeException...
     [exec]     [junit] java.lang.RuntimeException: MyRemoteObject.text_RuntimeException
     [exec]     [junit] Done.

...

     [exec]     [junit] org.apache.harmony.rmi.test.MyException: MyRemoteObject.test_Exception
     [exec]     [junit] Done.

     [exec]     [junit] Testing test_Error...
     [exec]     [junit] java.rmi.ServerError: Error occurred while remote method invocation;
nested exception is:
     [exec]     [junit] 	java.lang.Error: MyRemoteObject.test_Error
     [exec]     [junit] Done.

     [exec]     [junit] Testing test_RuntimeException...
     [exec]     [junit] java.lang.RuntimeException: MyRemoteObject.text_RuntimeException
     [exec]     [junit] Done.

...

     [exec]     [junit] Tests run: 12, Failures: 0, Errors: 0, Time elapsed: 0.017 sec
     [exec]     [junit] Tests run: 7, Failures: 0, Errors: 0, Time elapsed: 0.01 sec
     [exec]     [junit] Tests run: 25, Failures: 0, Errors: 0, Time elapsed: 0.038 sec
     [exec]     [junit] Tests run: 2, Failures: 1, Errors: 0, Time elapsed: 10.018 sec
     [exec]     [junit] TEST javax.swing.colorchooser.AbstractColorChooserPanelTest FAILED
     [exec]     [junit] Tests run: 4, Failures: 0, Errors: 0, Time elapsed: 0.007 sec
     [exec]     [junit] Tests run: 1, Failures: 0, Errors: 0, Time elapsed: 0.005 sec
     [exec]     [junit] Tests run: 1, Failures: 0, Errors: 0, Time elapsed: 0.003 sec
     [exec]     [junit] Tests run: 1, Failures: 1, Errors: 0, Time elapsed: 10.007 sec
     [exec]     [junit] TEST javax.swing.event.DocumentEventTest FAILED
     [exec]     [junit] Tests run: 9, Failures: 9, Errors: 0, Time elapsed: 90.026 sec
     [exec]     [junit] TEST javax.swing.event.EventListenerListTest FAILED
     [exec]     [junit] Tests run: 2, Failures: 2, Errors: 0, Time elapsed: 20.008 sec
     [exec]     [junit] TEST javax.swing.event.InternalFrameEventTest FAILED
     [exec]     [junit] Tests run: 4, Failures: 4, Errors: 0, Time elapsed: 40.014 sec
     [exec]     [junit] TEST javax.swing.event.ListDataEventTest FAILED
     [exec]     [junit] Tests run: 5, Failures: 5, Errors: 0, Time elapsed: 50.017 sec
     [exec]     [junit] TEST javax.swing.event.ListSelectionEventTest FAILED
     [exec]     [junit] Tests run: 1, Failures: 0, Errors: 1, Time elapsed: 0 sec
     [exec]     [junit] Tests FAILED (timeout)

     [exec] touch-failures-file:

     [exec] touch-errors-file:


...

     [exec] gen-report:

     [exec] check-test-result:

     [exec] BUILD FAILED
     [exec] /home/hybld/continuum-working-directory/6/classlib/build.xml:169: The following
error occurred while executing this line:
     [exec] /home/hybld/continuum-working-directory/6/classlib/make/build-test.xml:142: There
were test crashes: /home/hybld/continuum-working-directory/6/classlib/build/test_report/TEST-javax.swing.event.MenuKeyEventTest.xml

     [exec] Total time: 67 minutes 11 seconds
     [exec] Result: 1
     [echo] Tests.failed is set to true

japi:

     [exec] Processing class java.lang,Object:+
     [exec] Processing package java.lang,:=============================================================================+-+++++++++++-+++++++++++++-+++++++++++++++++-+++++-+++++++++++++++++++++++-++++--^+^+++++++++--++++++++++

...

     [exec] Processing package java.lang.management,:=============================================================================++++-+++++++++++
     [exec] Processing package java.lang.ref,:=============================================================================+++++
     [exec] Processing package java.lang.reflect,:=============================================================================+++++++++++++++++++++
     [exec] Processing class ,java:
     [exec] Failed to Japize java: java.lang.RuntimeException: NoClassDefFoundError: java
     [exec] java.lang.RuntimeException: NoClassDefFoundError: java
     [exec] 	at net.wuffies.japi.ClassFile.forName(ClassFile.java:163)
     [exec] 	at net.wuffies.japi.Japize.getClassWrapper(Japize.java:1425)
     [exec] 	at net.wuffies.japi.Japize.japizeClass(Japize.java:748)
     [exec] 	at net.wuffies.japi.Japize.processClass(Japize.java:516)

...

     [exec] 	at net.wuffies.japi.Japize.doJapize(Japize.java:443)
     [exec] 	at net.wuffies.japi.Japize.main(Japize.java:316)

     [exec] Processing class ,javax:
     [exec] Failed to Japize javax: java.lang.RuntimeException: NoClassDefFoundError: javax
     [exec] java.lang.RuntimeException: NoClassDefFoundError: javax
     [exec] 	at net.wuffies.japi.ClassFile.forName(ClassFile.java:163)
     [exec] 	at net.wuffies.japi.Japize.getClassWrapper(Japize.java:1425)
     [exec] 	at net.wuffies.japi.Japize.japizeClass(Japize.java:748)
     [exec] 	at net.wuffies.japi.Japize.processClass(Japize.java:516)

...

     [exec] 	at net.wuffies.japi.Japize.doJapize(Japize.java:443)
     [exec] 	at net.wuffies.japi.Japize.main(Japize.java:316)

     [exec] Processing class ,org:
     [exec] Failed to Japize org: java.lang.RuntimeException: NoClassDefFoundError: org
     [exec] java.lang.RuntimeException: NoClassDefFoundError: org
     [exec] 	at net.wuffies.japi.ClassFile.forName(ClassFile.java:163)
     [exec] 	at net.wuffies.japi.Japize.getClassWrapper(Japize.java:1425)
     [exec] 	at net.wuffies.japi.Japize.japizeClass(Japize.java:748)
     [exec] 	at net.wuffies.japi.Japize.processClass(Japize.java:516)

...

update-index:

test-result:

BUILD FAILED
/home/hybld/continuum-working-directory/6/build.xml:204: There were test errors.

Total time: 84 minutes 45 seconds

****************************************************************************

...

Mime
View raw message