harmony-alerts mailing list archives

Site index · List index
Message view « Date » · « Thread »
Top « Date » · « Thread »
From nom...@intel.com
Subject [build-test alert] BUILD SUCCEEDED Linux SUSE 9 64bit gcc debug: classlib over drlvm
Date Thu, 12 Apr 2007 10:36:33 GMT
BUILD COMPLETE:	build.450

Date of build:	04/12/2007 17:07:45
Time to build:	28 minutes 5 seconds
Last changed:	04/12/2007 16:50:40
Last log entry:	Apply patch for HARMONY-1082([classlib][io]compatibility:java.io.BufferedOutputStream.write(byte[],
int, int) throws ArrayIndexOutOfBoundsException while RI throws NullPointerException)

***********************************************************
Execution log (errors/warnings messages):	

========================================
Testing class libraries...
========================================
Checking for depends/jars/yoko_M2-20070130/yoko.jar
Checking for depends/jars/yoko_M2-20070130/yoko-core.jar
Checking for depends/jars/yoko_M2-20070130/yoko-rmi-impl.jar
Checking for depends/jars/yoko_M2-20070130/yoko-rmi-spec.jar
Checking for depends/jars/bcel-5.2/bcel-5.2.jar
Checking for depends/jars/xalan-j_2.7.0/xalan.jar
Checking for depends/jars/xerces_2.9.0/xerces.zip
Checking for depends/jars/junit_3.8.2/junit.jar
Checking for depends/jars/bcprov-jdk15-134/bcprov.jar
Checking for depends/jars/icu4j_3.4.4/icu4j_3_4_4.jar
Checking for depends/jars/mx4j_3.0.2/mx4j.zip
Checking for depends/jars/ecj_3.2/ecj_3.2.jar
Checking for depends/jars/jetty/jetty-6.0.0.jar
Checking for depends/jars/jetty/jetty-util-6.0.0.jar
Checking for depends/jars/jetty/servlet-api-2.5-6.0.0.jar
Checking for depends/libs/build/lcms/icc34.h
Checking for depends/libs/build/lcms/lcms.h
Checking for depends/libs/build/png/pngconf.h
Checking for depends/libs/build/png/png.h
Checking for depends/libs/build/jpeg/jconfig.lnx
Checking for depends/libs/build/jpeg/jpeglib.h
Checking for depends/libs/build/jpeg/jmorecfg.h
Checking for depends/libs/build/jpeg/jerror.h
Checking for depends/libs/build/lcms/liblcms.linux.x86_64
Checking for depends/libs/build/png/libpng.linux.x86_64
Checking for depends/libs/build/jpeg/libjpeg.linux.x86_64
hy.test.vm.name = drl
Compiling ACCESSIBILITY classes
Compiling ACCESSIBILITY tests
Since fork is false, ignoring memoryMaximumSize setting
Compiling ANNOTATION classes
Compiling ANNOTATION tests
Since fork is false, ignoring memoryMaximumSize setting
----------
1. WARNING in /export/cruise/trunk/cc/projects/classlib/trunk/modules/annotation/src/test/java/org/apache/harmony/annotation/tests/java/lang/annotation/IncompleteAnnotationExceptionTest.java
 (at line 53)
	clazz, elementName);
	^^^^^
Type safety: The expression of type Class needs unchecked conversion to conform to Class<?
extends Annotation>
----------
1 problem (1 warning)
Compiling APPLET classes
Compiling APPLET tests
Since fork is false, ignoring memoryMaximumSize setting
Compiling ARCHIVE classes
Compiling ARCHIVE tests
Since fork is false, ignoring memoryMaximumSize setting
Compiling AUTH classes
Compiling AUTH tests
Since fork is false, ignoring memoryMaximumSize setting
Compiling AWT classes
Compiling AWT tests
Since fork is false, ignoring memoryMaximumSize setting
Compiling BEANS classes
Compiling support classes for BEANS tests
Compiling internal BEANS tests
Compiling BEANS tests
Since fork is false, ignoring memoryMaximumSize setting
Running internal BEANS tests
Running BEANS tests
Compiling CRYPTO classes
Compiling CRYPTO test support files
Compiling CRYPTO api tests
Since fork is false, ignoring memoryMaximumSize setting
Compiling CRYPTO api injected tests
Since fork is false, ignoring memoryMaximumSize setting
Compiling CRYPTO impl injected tests
Since fork is false, ignoring memoryMaximumSize setting
Compiling CRYPTO impl tests
Since fork is false, ignoring memoryMaximumSize setting
Running CRYPTO api tests
Running CRYPTO api.injected tests
Running CRYPTO impl tests
Running CRYPTO impl injected tests
Compiling ImageIO classes
Compiling ImageIO tests
Since fork is false, ignoring memoryMaximumSize setting
Compiling INSTRUMENT classes
Compiling INSTRUMENT tests
Since fork is false, ignoring memoryMaximumSize setting
Compiling JNDI classes
Compiling JNDI tests
Since fork is false, ignoring memoryMaximumSize setting
Compiling LANG-MANAGEMENT classes
Compiling LANG-MANAGEMENT API tests
Since fork is false, ignoring memoryMaximumSize setting
Compiling LANG-MANAGEMENT Implementation tests
Since fork is false, ignoring memoryMaximumSize setting
Compiling LOGGING classes
Compiling LOGGING tests
Since fork is false, ignoring memoryMaximumSize setting
Compiling LUNI classes
Compiling LUNI JUnit Tests
Since fork is false, ignoring memoryMaximumSize setting
Running LUNI JUnit Tests
java.io.IOException: Stream is closed
	at java.io.BufferedInputStream.read(BufferedInputStream.java:247)
	at java.io.FilterInputStream.read(FilterInputStream.java:137)
	at tests.support.Support_Exec$1.run(Support_Exec.java:177)
	at java.lang.Thread.run(Thread.java:661)
2007-04-12 17:22:33.895::INFO:  Logging to STDERR via org.mortbay.log.StdErrLog
2007-04-12 17:22:34.115::INFO:  jetty-6.0.x
2007-04-12 17:22:34.361::INFO:  Started SocketConnector @ 0.0.0.0:51312
2007-04-12 17:22:35.401::WARN:  EXCEPTION 
java.security.AccessControlException: Permission check failed (java.net.SocketPermission 127.0.0.1:51327
accept,resolve)
	at java.security.AccessControlContext.checkPermission(AccessControlContext.java:133)
	at java.security.AccessController.checkPermission(AccessController.java:194)
	at java.lang.SecurityManager.checkPermission(SecurityManager.java:746)
	at java.lang.SecurityManager.checkAccept(SecurityManager.java:88)
	at java.net.ServerSocket.accept(ServerSocket.java:151)
	at org.mortbay.jetty.bio.SocketConnector.accept(SocketConnector.java:97)
	at org.mortbay.jetty.AbstractConnector$Acceptor.run(AbstractConnector.java:630)
	at org.mortbay.thread.BoundedThreadPool$PoolThread.run(BoundedThreadPool.java:475)
2007-04-12 17:22:55.762::INFO:  jetty-6.0.x
2007-04-12 17:22:55.796::INFO:  Started SocketConnector @ 0.0.0.0:51418
2007-04-12 17:22:57.572::INFO:  jetty-6.0.x
2007-04-12 17:22:57.576::INFO:  Started SocketConnector @ 0.0.0.0:51427
Compiling MATH classes
Compiling MATH tests
Since fork is false, ignoring memoryMaximumSize setting
Compiling MISC classes
Compiling MISC tests
Since fork is false, ignoring memoryMaximumSize setting
Compiling NIO classes
Compiling NIO tests
Since fork is false, ignoring memoryMaximumSize setting
Compiling NIO_CHAR classes
Compiling NIO_CHAR tests
Since fork is false, ignoring memoryMaximumSize setting
Cannot find unmappable byte array for US-ASCII
Cannot find unmappable byte array for gb18030
Cannot find unmappable byte array for ISO-8859-1
Cannot find malform byte array for ISO-8859-1
Cannot find unmappable byte array for UTF-16BE
Cannot find malform byte array for UTF-16BE
Cannot find unmappable byte array for UTF-16
Cannot find malform byte array for UTF-16
Cannot find unmappable byte array for UTF-16LE
Cannot find malform byte array for UTF-16LE
Cannot find unmappable byte array for UTF-8
Compiling PACK200 classes
Compiling PACK200 tests
Since fork is false, ignoring memoryMaximumSize setting
Running PACK200 tests
Compiling PREFS classes
Compiling PREFS tests
Since fork is false, ignoring memoryMaximumSize setting
Compiling PRINT classes
Compiling Print tests
Since fork is false, ignoring memoryMaximumSize setting
java.net.ConnectException: localhost/127.0.0.1:631 - Connection refused
	at org.apache.harmony.luni.net.PlainSocketImpl.connect(PlainSocketImpl.java:230)
	at org.apache.harmony.luni.net.PlainSocketImpl.connect(PlainSocketImpl.java:510)
	at java.net.Socket.connect(Socket.java:932)
	at org.apache.harmony.luni.internal.net.www.protocol.http.HttpURLConnection.getHTTPConnection(HttpURLConnection.java:635)
	at org.apache.harmony.luni.internal.net.www.protocol.http.HttpURLConnection.connect(HttpURLConnection.java:619)
	at org.apache.harmony.x.print.ipp.IppClient.request(IppClient.java:111)
	at org.apache.harmony.x.print.ipp.IppClient.request(IppClient.java:87)
	at org.apache.harmony.x.print.cups.CUPSPrintServiceProvider.findDefaultPrintService(CUPSPrintServiceProvider.java:471)
	at org.apache.harmony.x.print.cups.CUPSPrintServiceProvider.getDefaultPrintService(CUPSPrintServiceProvider.java:169)
	at javax.print.PrintServiceLookup.lookupDefaultPrintService(PrintServiceLookup.java:139)
	at javax.print.attribute.HashAttributeTest.testAdd2(HashAttributeTest.java:128)
	at java.lang.reflect.VMReflection.invokeMethod(VMReflection.java)
	at java.lang.reflect.Method.invoke(Method.java:381)
	at junit.framework.TestCase.runTest(TestCase.java:154)
	at junit.framework.TestCase.runBare(TestCase.java:127)
	at junit.framework.TestResult$1.protect(TestResult.java:106)
	at junit.framework.TestResult.runProtected(TestResult.java:124)
	at junit.framework.TestResult.run(TestResult.java:109)
	at junit.framework.TestCase.run(TestCase.java:118)
	at junit.framework.TestSuite.runTest(TestSuite.java:208)
	at junit.framework.TestSuite.run(TestSuite.java:203)
	at org.apache.tools.ant.taskdefs.optional.junit.JUnitTestRunner.run(JUnitTestRunner.java:297)
	at org.apache.tools.ant.taskdefs.optional.junit.JUnitTestRunner.launch(JUnitTestRunner.java:672)
	at org.apache.tools.ant.taskdefs.optional.junit.JUnitTestRunner.main(JUnitTestRunner.java:546)
java.net.ConnectException: localhost/127.0.0.1:631 - Connection refused
	at org.apache.harmony.luni.net.PlainSocketImpl.connect(PlainSocketImpl.java:230)
	at org.apache.harmony.luni.net.PlainSocketImpl.connect(PlainSocketImpl.java:510)
	at java.net.Socket.connect(Socket.java:932)
	at org.apache.harmony.luni.internal.net.www.protocol.http.HttpURLConnection.getHTTPConnection(HttpURLConnection.java:635)
	at org.apache.harmony.luni.internal.net.www.protocol.http.HttpURLConnection.connect(HttpURLConnection.java:619)
	at org.apache.harmony.x.print.ipp.IppClient.request(IppClient.java:111)
	at org.apache.harmony.x.print.ipp.IppClient.request(IppClient.java:87)
	at org.apache.harmony.x.print.cups.CUPSPrintServiceProvider.findDefaultPrintService(CUPSPrintServiceProvider.java:471)
	at org.apache.harmony.x.print.cups.CUPSPrintServiceProvider.getDefaultPrintService(CUPSPrintServiceProvider.java:169)
	at javax.print.PrintServiceLookup.lookupDefaultPrintService(PrintServiceLookup.java:139)
	at javax.print.attribute.HashAttributeTest.testEquals(HashAttributeTest.java:284)
	at java.lang.reflect.VMReflection.invokeMethod(VMReflection.java)
	at java.lang.reflect.Method.invoke(Method.java:381)
	at junit.framework.TestCase.runTest(TestCase.java:154)
	at junit.framework.TestCase.runBare(TestCase.java:127)
	at junit.framework.TestResult$1.protect(TestResult.java:106)
	at junit.framework.TestResult.runProtected(TestResult.java:124)
	at junit.framework.TestResult.run(TestResult.java:109)
	at junit.framework.TestCase.run(TestCase.java:118)
	at junit.framework.TestSuite.runTest(TestSuite.java:208)
	at junit.framework.TestSuite.run(TestSuite.java:203)
	at org.apache.tools.ant.taskdefs.optional.junit.JUnitTestRunner.run(JUnitTestRunner.java:297)
	at org.apache.tools.ant.taskdefs.optional.junit.JUnitTestRunner.launch(JUnitTestRunner.java:672)
	at org.apache.tools.ant.taskdefs.optional.junit.JUnitTestRunner.main(JUnitTestRunner.java:546)
java.net.ConnectException: localhost/127.0.0.1:631 - Connection refused
	at org.apache.harmony.luni.net.PlainSocketImpl.connect(PlainSocketImpl.java:230)
	at org.apache.harmony.luni.net.PlainSocketImpl.connect(PlainSocketImpl.java:510)
	at java.net.Socket.connect(Socket.java:932)
	at org.apache.harmony.luni.internal.net.www.protocol.http.HttpURLConnection.getHTTPConnection(HttpURLConnection.java:635)
	at org.apache.harmony.luni.internal.net.www.protocol.http.HttpURLConnection.connect(HttpURLConnection.java:619)
	at org.apache.harmony.x.print.ipp.IppClient.request(IppClient.java:111)
	at org.apache.harmony.x.print.ipp.IppClient.request(IppClient.java:87)
	at org.apache.harmony.x.print.cups.CUPSPrintServiceProvider.findDefaultPrintService(CUPSPrintServiceProvider.java:471)
	at org.apache.harmony.x.print.cups.CUPSPrintServiceProvider.getDefaultPrintService(CUPSPrintServiceProvider.java:169)
	at javax.print.PrintServiceLookup.lookupDefaultPrintService(PrintServiceLookup.java:139)
	at javax.print.attribute.HashAttributeTest.testAdd2(HashAttributeTest.java:128)
	at java.lang.reflect.VMReflection.invokeMethod(VMReflection.java)
	at java.lang.reflect.Method.invoke(Method.java:381)
	at junit.framework.TestCase.runTest(TestCase.java:154)
	at junit.framework.TestCase.runBare(TestCase.java:127)
	at junit.framework.TestResult$1.protect(TestResult.java:106)
	at junit.framework.TestResult.runProtected(TestResult.java:124)
	at junit.framework.TestResult.run(TestResult.java:109)
	at junit.framework.TestCase.run(TestCase.java:118)
	at junit.framework.TestSuite.runTest(TestSuite.java:208)
	at junit.framework.TestSuite.run(TestSuite.java:203)
	at junit.framework.TestSuite.runTest(TestSuite.java:208)
	at junit.framework.TestSuite.run(TestSuite.java:203)
	at org.apache.tools.ant.taskdefs.optional.junit.JUnitTestRunner.run(JUnitTestRunner.java:297)
	at org.apache.tools.ant.taskdefs.optional.junit.JUnitTestRunner.launch(JUnitTestRunner.java:672)
	at org.apache.tools.ant.taskdefs.optional.junit.JUnitTestRunner.main(JUnitTestRunner.java:546)
java.net.ConnectException: localhost/127.0.0.1:631 - Connection refused
	at org.apache.harmony.luni.net.PlainSocketImpl.connect(PlainSocketImpl.java:230)
	at org.apache.harmony.luni.net.PlainSocketImpl.connect(PlainSocketImpl.java:510)
	at java.net.Socket.connect(Socket.java:932)
	at org.apache.harmony.luni.internal.net.www.protocol.http.HttpURLConnection.getHTTPConnection(HttpURLConnection.java:635)
	at org.apache.harmony.luni.internal.net.www.protocol.http.HttpURLConnection.connect(HttpURLConnection.java:619)
	at org.apache.harmony.x.print.ipp.IppClient.request(IppClient.java:111)
	at org.apache.harmony.x.print.ipp.IppClient.request(IppClient.java:87)
	at org.apache.harmony.x.print.cups.CUPSPrintServiceProvider.findDefaultPrintService(CUPSPrintServiceProvider.java:471)
	at org.apache.harmony.x.print.cups.CUPSPrintServiceProvider.getDefaultPrintService(CUPSPrintServiceProvider.java:169)
	at javax.print.PrintServiceLookup.lookupDefaultPrintService(PrintServiceLookup.java:139)
	at javax.print.attribute.HashAttributeTest.testEquals(HashAttributeTest.java:284)
	at java.lang.reflect.VMReflection.invokeMethod(VMReflection.java)
	at java.lang.reflect.Method.invoke(Method.java:381)
	at junit.framework.TestCase.runTest(TestCase.java:154)
	at junit.framework.TestCase.runBare(TestCase.java:127)
	at junit.framework.TestResult$1.protect(TestResult.java:106)
	at junit.framework.TestResult.runProtected(TestResult.java:124)
	at junit.framework.TestResult.run(TestResult.java:109)
	at junit.framework.TestCase.run(TestCase.java:118)
	at junit.framework.TestSuite.runTest(TestSuite.java:208)
	at junit.framework.TestSuite.run(TestSuite.java:203)
	at junit.framework.TestSuite.runTest(TestSuite.java:208)
	at junit.framework.TestSuite.run(TestSuite.java:203)
	at org.apache.tools.ant.taskdefs.optional.junit.JUnitTestRunner.run(JUnitTestRunner.java:297)
	at org.apache.tools.ant.taskdefs.optional.junit.JUnitTestRunner.launch(JUnitTestRunner.java:672)
	at org.apache.tools.ant.taskdefs.optional.junit.JUnitTestRunner.main(JUnitTestRunner.java:546)
Compiling REGEX classes
Compiling REGEX tests
Since fork is false, ignoring memoryMaximumSize setting
Compiling RMI classes
Compiling RMI api tests
Since fork is false, ignoring memoryMaximumSize setting
Running RMI api tests
testDirectSocket_SingleVM starting
Test server started.
Object: MyRemoteObject[UnicastServerRef[endpoint:[[127.0.0.2:52074]](local), ObjID[65536,
UID[-6631d090:111e555c3c6:-8000]]]] created and exported.
Apr 12, 2007 5:27:57 PM org.apache.harmony.rmi.server.RMIReference makeStrong
FINER: main: Strongly referenced RegistryImpl
Registry created.
Object bound in the registry.
Registry located.
Apr 12, 2007 5:27:59 PM org.apache.harmony.rmi.client.ClientConnection sendDGCAck
FINER: main: Sent DGC ack to [localhost:1099] for UID[-6631d090:111e555c3c6:-7ffd]
Lookup object is: Proxy[interf:[org.apache.harmony.rmi.test.MyRemoteInterface, java.rmi.Remote],
RemoteObjectInvocationHandler[UnicastRef[endpoint:[[127.0.0.2:52074]](remote), ObjID[65536,
UID[-6631d090:111e555c3c6:-8000]]]]]
Testing test_String_Void...
Done.
Testing test_Void_String...
Returned: MyRemoteObject.test_Void_String
Done.
Testing test_Int_Void...
Done.
Testing test_Void_Int...
Returned: 987654321
Done.
Testing test_Remote_Void...
Done.
Testing test_Remote_Void with remote object extending another remote object...
Done.
Testing test_Void_Remote...
Apr 12, 2007 5:27:59 PM org.apache.harmony.rmi.client.ClientConnection sendDGCAck
FINER: main: Sent DGC ack to [127.0.0.2:52074] for UID[-6631d090:111e555c3c6:-7fe8]
Returned: Proxy[interf:[org.apache.harmony.rmi.test.MyRemoteInterface2, java.rmi.Remote],
RemoteObjectInvocationHandler[UnicastRef[endpoint:[[127.0.0.2:52082]](remote), ObjID[65539,
UID[-6631d090:111e555c3c6:-7fe9]]]]]
Done.
Testing test_Long_Long...
Returned: 998877665544332211
Done.
Testing test_String_String...
Returned: MyRemoteObject.test_String_String
Done.
Testing test_Remote_Remote...
Apr 12, 2007 5:28:00 PM org.apache.harmony.rmi.client.ClientConnection sendDGCAck
FINER: main: Sent DGC ack to [127.0.0.2:52074] for UID[-6631d090:111e555c3c6:-7fde]
Returned: Proxy[interf:[org.apache.harmony.rmi.test.MyRemoteInterface2, java.rmi.Remote],
RemoteObjectInvocationHandler[UnicastRef[endpoint:[[127.0.0.2:52086]](remote), ObjID[65541,
UID[-6631d090:111e555c3c6:-7fdf]]]]]
Done.
Testing test_RemoteString_Void...
Done.
Testing test_RemoteRemote_Remote...
Apr 12, 2007 5:28:00 PM org.apache.harmony.rmi.client.ClientConnection sendDGCAck
FINER: main: Sent DGC ack to [127.0.0.2:52074] for UID[-6631d090:111e555c3c6:-7fd0]
Returned: Proxy[interf:[org.apache.harmony.rmi.test.MyRemoteInterface2, java.rmi.Remote],
RemoteObjectInvocationHandler[UnicastRef[endpoint:[[127.0.0.2:52093]](remote), ObjID[65545,
UID[-6631d090:111e555c3c6:-7fd1]]]]]
Done.
Testing test_BooleanStringRemote_Void...
Done.
Testing test_Proxy_Void...
Done.
Testing test_Array_Void...
Done.
Testing test_Void_Array...
Done.
Testing test_RemoteArray_Void...
Done.
Testing test_Void_RemoteArray...
Apr 12, 2007 5:28:00 PM org.apache.harmony.rmi.client.ClientConnection sendDGCAck
FINER: main: Sent DGC ack to [127.0.0.2:52074] for UID[-6631d090:111e555c3c6:-7fbd]
Done.
Testing test_Exception...
org.apache.harmony.rmi.test.MyException: MyRemoteObject.test_Exception
Done.
Testing test_Error...
java.rmi.ServerError: Error occurred while remote method invocation; nested exception is:
	java.lang.Error: MyRemoteObject.test_Error
Done.
Testing test_RuntimeException...
java.lang.RuntimeException: MyRemoteObject.text_RuntimeException
Done.
Testing test_RemoteException...
java.rmi.ServerException: RemoteException occurred while remote method invocation; nested
exception is:
	java.rmi.RemoteException: MyRemoteObject.text_RemoteException
Done.
Test server complete.
Test server closing.
Unexporting MyRemoteObject[UnicastServerRef[endpoint:[[127.0.0.2:52074]](local), ObjID[65536,
UID[-6631d090:111e555c3c6:-8000]]]] ...
Done.
Unexporting RegistryImpl ...
Done.
Unexporting MyRemoteObject1[UnicastServerRef[endpoint:[[127.0.0.2:52078]](local), ObjID[65537,
UID[-6631d090:111e555c3c6:-7ff4]]]] ...
Done.
Unexporting MyRemoteObject4[UnicastServerRef[endpoint:[[127.0.0.2:52080]](local), ObjID[65538,
UID[-6631d090:111e555c3c6:-7fef]]]] ...
Done.
Unexporting MyRemoteObject1[UnicastServerRef[endpoint:[[127.0.0.2:52084]](local), ObjID[65540,
UID[-6631d090:111e555c3c6:-7fe3]]]] ...
Done.
Unexporting MyRemoteObject1[UnicastServerRef[endpoint:[[127.0.0.2:52087]](local), ObjID[65542,
UID[-6631d090:111e555c3c6:-7fdd]]]] ...
Done.
Unexporting MyRemoteObject1[UnicastServerRef[endpoint:[[127.0.0.2:52089]](local), ObjID[65543,
UID[-6631d090:111e555c3c6:-7fd8]]]] ...
Done.
Unexporting MyRemoteObject3[UnicastServerRef[endpoint:[[127.0.0.2:52090]](local), ObjID[65544,
UID[-6631d090:111e555c3c6:-7fd7]]]] ...
Done.
Unexporting MyRemoteObject1[UnicastServerRef[endpoint:[[127.0.0.2:52094]](local), ObjID[65546,
UID[-6631d090:111e555c3c6:-7fcf]]]] ...
Done.
Unexporting MyRemoteObject1[UnicastServerRef[endpoint:[[127.0.0.2:52096]](local), ObjID[65547,
UID[-6631d090:111e555c3c6:-7fc4]]]] ...
Done.
Unexporting MyRemoteObject1[UnicastServerRef[endpoint:[[127.0.0.2:52097]](local), ObjID[65548,
UID[-6631d090:111e555c3c6:-7fc3]]]] ...
Done.
Test server exiting.
testDirectHTTP_SingleVM starting
Test server started.
Object: MyRemoteObject[UnicastServerRef[endpoint:[[127.0.0.2:52102]](local), ObjID[65536,
UID[-6631d090:111e555e472:-8000]]]] created and exported.
Apr 12, 2007 5:28:06 PM org.apache.harmony.rmi.server.RMIReference makeStrong
FINER: main: Strongly referenced RegistryImpl
Registry created.
Object bound in the registry.
Registry located.
Apr 12, 2007 5:28:07 PM org.apache.harmony.rmi.client.ClientConnection sendDGCAck
FINER: main: Sent DGC ack to [localhost:1099] for UID[-6631d090:111e555e472:-7ffd]
Lookup object is: Proxy[interf:[org.apache.harmony.rmi.test.MyRemoteInterface, java.rmi.Remote],
RemoteObjectInvocationHandler[UnicastRef[endpoint:[[127.0.0.2:52102]](remote), ObjID[65536,
UID[-6631d090:111e555e472:-8000]]]]]
Testing test_String_Void...
Done.
Testing test_Void_String...
Returned: MyRemoteObject.test_Void_String
Done.
Testing test_Int_Void...
Done.
Testing test_Void_Int...
Returned: 987654321
Done.
Testing test_Remote_Void...
Done.
Testing test_Remote_Void with remote object extending another remote object...
Done.
Testing test_Void_Remote...
Apr 12, 2007 5:28:08 PM org.apache.harmony.rmi.client.ClientConnection sendDGCAck
FINER: main: Sent DGC ack to [127.0.0.2:52102] for UID[-6631d090:111e555e472:-7fe8]
Returned: Proxy[interf:[org.apache.harmony.rmi.test.MyRemoteInterface2, java.rmi.Remote],
RemoteObjectInvocationHandler[UnicastRef[endpoint:[[127.0.0.2:52110]](remote), ObjID[65539,
UID[-6631d090:111e555e472:-7fe9]]]]]
Done.
Testing test_Long_Long...
Returned: 998877665544332211
Done.
Testing test_String_String...
Returned: MyRemoteObject.test_String_String
Done.
Testing test_Remote_Remote...
Apr 12, 2007 5:28:08 PM org.apache.harmony.rmi.client.ClientConnection sendDGCAck
FINER: main: Sent DGC ack to [127.0.0.2:52102] for UID[-6631d090:111e555e472:-7fde]
Returned: Proxy[interf:[org.apache.harmony.rmi.test.MyRemoteInterface2, java.rmi.Remote],
RemoteObjectInvocationHandler[UnicastRef[endpoint:[[127.0.0.2:52114]](remote), ObjID[65541,
UID[-6631d090:111e555e472:-7fdf]]]]]
Done.
Testing test_RemoteString_Void...
Done.
Testing test_RemoteRemote_Remote...
Apr 12, 2007 5:28:08 PM org.apache.harmony.rmi.client.ClientConnection sendDGCAck
FINER: main: Sent DGC ack to [127.0.0.2:52102] for UID[-6631d090:111e555e472:-7fd0]
Returned: Proxy[interf:[org.apache.harmony.rmi.test.MyRemoteInterface2, java.rmi.Remote],
RemoteObjectInvocationHandler[UnicastRef[endpoint:[[127.0.0.2:52121]](remote), ObjID[65545,
UID[-6631d090:111e555e472:-7fd1]]]]]
Done.
Testing test_BooleanStringRemote_Void...
Done.
Testing test_Proxy_Void...
Done.
Testing test_Array_Void...
Done.
Testing test_Void_Array...
Done.
Testing test_RemoteArray_Void...
Done.
Testing test_Void_RemoteArray...
Apr 12, 2007 5:28:09 PM org.apache.harmony.rmi.client.ClientConnection sendDGCAck
FINER: main: Sent DGC ack to [127.0.0.2:52102] for UID[-6631d090:111e555e472:-7fbd]
Done.
Testing test_Exception...
org.apache.harmony.rmi.test.MyException: MyRemoteObject.test_Exception
Done.
Testing test_Error...
java.rmi.ServerError: Error occurred while remote method invocation; nested exception is:
	java.lang.Error: MyRemoteObject.test_Error
Done.
Testing test_RuntimeException...
java.lang.RuntimeException: MyRemoteObject.text_RuntimeException
Done.
Testing test_RemoteException...
java.rmi.ServerException: RemoteException occurred while remote method invocation; nested
exception is:
	java.rmi.RemoteException: MyRemoteObject.text_RemoteException
Done.
Test server complete.
Test server closing.
Unexporting MyRemoteObject[UnicastServerRef[endpoint:[[127.0.0.2:52102]](local), ObjID[65536,
UID[-6631d090:111e555e472:-8000]]]] ...
Done.
Unexporting RegistryImpl ...
Done.
Unexporting MyRemoteObject1[UnicastServerRef[endpoint:[[127.0.0.2:52106]](local), ObjID[65537,
UID[-6631d090:111e555e472:-7ff4]]]] ...
Done.
Unexporting MyRemoteObject4[UnicastServerRef[endpoint:[[127.0.0.2:52108]](local), ObjID[65538,
UID[-6631d090:111e555e472:-7fef]]]] ...
Done.
Unexporting MyRemoteObject1[UnicastServerRef[endpoint:[[127.0.0.2:52112]](local), ObjID[65540,
UID[-6631d090:111e555e472:-7fe3]]]] ...
Done.
Unexporting MyRemoteObject1[UnicastServerRef[endpoint:[[127.0.0.2:52115]](local), ObjID[65542,
UID[-6631d090:111e555e472:-7fdd]]]] ...
Done.
Unexporting MyRemoteObject1[UnicastServerRef[endpoint:[[127.0.0.2:52117]](local), ObjID[65543,
UID[-6631d090:111e555e472:-7fd8]]]] ...
Done.
Unexporting MyRemoteObject3[UnicastServerRef[endpoint:[[127.0.0.2:52118]](local), ObjID[65544,
UID[-6631d090:111e555e472:-7fd7]]]] ...
Done.
Unexporting MyRemoteObject1[UnicastServerRef[endpoint:[[127.0.0.2:52122]](local), ObjID[65546,
UID[-6631d090:111e555e472:-7fcf]]]] ...
Done.
Unexporting MyRemoteObject1[UnicastServerRef[endpoint:[[127.0.0.2:52124]](local), ObjID[65547,
UID[-6631d090:111e555e472:-7fc4]]]] ...
Done.
Unexporting MyRemoteObject1[UnicastServerRef[endpoint:[[127.0.0.2:52125]](local), ObjID[65548,
UID[-6631d090:111e555e472:-7fc3]]]] ...
Done.
Test server exiting.
Unexporting MyRemoteObject1[UnicastServerRef[endpoint:[[127.0.0.2:52130]](local), ObjID[65536,
UID[-65a92b38:111e55600de:-7ff7]]]] ...
Done.
Unexporting MyRemoteObject1[UnicastServerRef[endpoint:[[127.0.0.2:52131]](local), ObjID[65537,
UID[-65a92b38:111e55600de:-7ff6]]]] ...
Done.
Unexporting MyRemoteObject1[UnicastServerRef[endpoint:[[127.0.0.2:52132]](local), ObjID[65538,
UID[-65a92b38:111e55600de:-7ff5]]]] ...
Done.
Unexporting MyRemoteObject1[UnicastServerRef[endpoint:[[127.0.0.2:52133]](local), ObjID[65539,
UID[-65a92b38:111e55600de:-7ff4]]]] ...
Done.
Unexporting MyRemoteObject1[UnicastServerRef[endpoint:[[127.0.0.2:52134]](local), ObjID[65540,
UID[-65a92b38:111e55600de:-7ff3]]]] ...
Done.
Unexporting MyRemoteObject1[UnicastServerRef[endpoint:[[127.0.0.2:52135]](local), ObjID[65541,
UID[-65a92b38:111e55600de:-7ff2]]]] ...
Done.
Unexporting MyRemoteObject1[UnicastServerRef[endpoint:[[127.0.0.2:52136]](local), ObjID[65542,
UID[-65a92b38:111e55600de:-7ff1]]]] ...
Done.
Unexporting MyRemoteObject1[UnicastServerRef[endpoint:[[127.0.0.2:52137]](local), ObjID[65543,
UID[-65a92b38:111e55600de:-7ff0]]]] ...
Done.
LogStream[tst]:
Compiling SECURITY classes
Compiling SECURITY test support files
Since fork is false, ignoring memoryMaximumSize setting
Compiling SECURITY api tests
Since fork is false, ignoring memoryMaximumSize setting
Compiling SECURITY api injected tests
Since fork is false, ignoring memoryMaximumSize setting
Compiling SECURITY impl injected tests
Since fork is false, ignoring memoryMaximumSize setting
Compiling SECURITY impl tests
Since fork is false, ignoring memoryMaximumSize setting
Running SECURITY api tests
Running SECURITY api.injected tests
Running SECURITY impl tests
Running SECURITY impl injected tests
Compiling SOUND classes
Compiling SOUND tests
Since fork is false, ignoring memoryMaximumSize setting
Compiling SQL classes
Compiling SQL tests
Since fork is false, ignoring memoryMaximumSize setting
Compiling Sun Compat classes
Compiling SUNCOMPAT tests
Compiling TEXT classes
Compiling TEXT tests
Since fork is false, ignoring memoryMaximumSize setting
Compiling TOOLS classes
Compiling Tools tests
Since fork is false, ignoring memoryMaximumSize setting
Compiling X-NET classes
Compiling X-NET test support files
Compiling X-NET api tests
Since fork is false, ignoring memoryMaximumSize setting
Compiling X-NET impl injected tests
Since fork is false, ignoring memoryMaximumSize setting
Compiling X-NET impl tests
Since fork is false, ignoring memoryMaximumSize setting
Running X-NET api tests
Running X-NET impl tests
Running X-NET impl injected tests
The test report is in /export/cruise/trunk/cc/projects/classlib/trunk/build/test_report/html/index.html

***********************************************************
Unit Tests: (15966)
        

***********************************************************
Modifications since last successful build:	(99)
            
modified pyang  /harmony/enhanced/classlib/trunk/modules/luni/src/main/java/java/io/BufferedOutputStream.java
04/12/2007 16:50:40 Apply patch for HARMONY-1082([classlib][io]compatibility:java.io.BufferedOutputStream.write(byte[],
int, int) throws ArrayIndexOutOfBoundsException while RI throws NullPointerException)
modified pyang  /harmony/enhanced/classlib/trunk/modules/luni/src/test/java/tests/api/java/io/BufferedOutputStreamTest.java
04/12/2007 16:50:40 Apply patch for HARMONY-1082([classlib][io]compatibility:java.io.BufferedOutputStream.write(byte[],
int, int) throws ArrayIndexOutOfBoundsException while RI throws NullPointerException)
modified pyang  /harmony/enhanced/classlib/trunk/modules/luni/src/main/java/java/net/MulticastSocket.java
04/12/2007 16:49:20 Apply patch for HARMONY-3572([Classlib] delete some never-used private/package
methods)
modified pyang  /harmony/enhanced/classlib/trunk/modules/luni/src/main/java/java/net/DatagramSocket.java
04/12/2007 16:49:20 Apply patch for HARMONY-3572([Classlib] delete some never-used private/package
methods)
modified pyang  /harmony/enhanced/classlib/trunk/modules/luni/src/main/java/java/net/SocketImpl.java
04/12/2007 16:48:08 Apply patch for HARMONY-3603([classlib][luni]SocketImpl.write() send twice)
modified pyang  /harmony/enhanced/classlib/trunk/modules/luni/src/main/java/java/net/JarURLConnection.java
04/12/2007 16:46:16 Apply patch for HARMONY-3614( [classlib][luni]add tests for java.net.JarURLConnecttion
and HttpURLConnection)
modified pyang  /harmony/enhanced/classlib/trunk/modules/luni/src/test/java/tests/api/java/net/JarURLConnectionTest.java
04/12/2007 16:46:16 Apply patch for HARMONY-3614( [classlib][luni]add tests for java.net.JarURLConnecttion
and HttpURLConnection)
modified pyang  /harmony/enhanced/classlib/trunk/modules/luni/src/test/java/tests/api/java/net/HttpURLConnectionTest.java
04/12/2007 16:46:16 Apply patch for HARMONY-3614( [classlib][luni]add tests for java.net.JarURLConnecttion
and HttpURLConnection)
modified xli  /harmony/enhanced/drlvm/trunk/vm/vmcore/include/finalize.h 04/12/2007 16:42:23
HARMONY-3588 : resolve bugs in finalizer thread shutdown.
modified xli  /harmony/enhanced/drlvm/trunk/vm/vmcore/include/ref_enqueue_thread.h 04/12/2007
16:42:23 HARMONY-3588 : resolve bugs in finalizer thread shutdown.
modified xli  /harmony/enhanced/drlvm/trunk/vm/vmcore/src/init/finalizer_thread.cpp 04/12/2007
16:42:23 HARMONY-3588 : resolve bugs in finalizer thread shutdown.
modified xli  /harmony/enhanced/drlvm/trunk/vm/vmcore/src/init/ref_enqueue_thread.cpp 04/12/2007
16:42:23 HARMONY-3588 : resolve bugs in finalizer thread shutdown.
modified xli  /harmony/enhanced/drlvm/trunk/vm/vmcore/src/init/vm_shutdown.cpp 04/12/2007
16:42:23 HARMONY-3588 : resolve bugs in finalizer thread shutdown.
modified pyang  /harmony/enhanced/classlib/trunk/modules/luni/src/main/java/java/io/ObjectOutputStream.java
04/12/2007 16:40:36 Apply patch for HARMONY-3610([classlib][luni]java.io.ObjectOutputStream.writeObjectOverride()
throws IOException)
modified pyang  /harmony/enhanced/classlib/trunk/modules/luni/src/test/java/tests/api/java/io/ObjectOutputStreamTest.java
04/12/2007 16:40:36 Apply patch for HARMONY-3610([classlib][luni]java.io.ObjectOutputStream.writeObjectOverride()
throws IOException)
add cc-drlvm log20070412153249Lbuild.562 04/12/2007 15:32:49drlvm
add cc-classlib log20070412152933Lbuild.420 04/12/2007 15:29:33classlib
modified varlax  /harmony/enhanced/drlvm/trunk/build/custom/msvc_2003/gc_gen/gc_gen.vcproj
04/12/2007 15:14:20 Applied HARMONY-3624 [drlvm] Project files update for MSVS2003 and MSVS2005
solutions
modified varlax  /harmony/enhanced/drlvm/trunk/build/custom/msvc_2003/vmcore/vmcore.vcproj
04/12/2007 15:14:20 Applied HARMONY-3624 [drlvm] Project files update for MSVS2003 and MSVS2005
solutions
modified varlax  /harmony/enhanced/drlvm/trunk/build/custom/msvc_2005/vmcore/vmcore.vcproj
04/12/2007 15:14:20 Applied HARMONY-3624 [drlvm] Project files update for MSVS2003 and MSVS2005
solutions
modified varlax  /harmony/enhanced/drlvm/trunk/build/custom/msvc_2003/jitrino/jitrino.vcproj
04/12/2007 15:14:20 Applied HARMONY-3624 [drlvm] Project files update for MSVS2003 and MSVS2005
solutions
modified smishura  /harmony/enhanced/classlib/trunk/modules/luni/make/exclude.linux.x86_64.drl
04/12/2007 13:29:30 Exclude SecurityManagerTest for DRL VM. See HARMONY-3628:([drlvm][testing]
API test org.apache.harmony.luni.tests.java.lang.SecurityManagerTest failed on DRLVM)
modified smishura  /harmony/enhanced/classlib/trunk/modules/luni/make/exclude.windows.x86.drl
04/12/2007 13:29:30 Exclude SecurityManagerTest for DRL VM. See HARMONY-3628:([drlvm][testing]
API test org.apache.harmony.luni.tests.java.lang.SecurityManagerTest failed on DRLVM)
modified smishura  /harmony/enhanced/classlib/trunk/modules/luni/make/exclude.linux.x86.drl
04/12/2007 13:29:30 Exclude SecurityManagerTest for DRL VM. See HARMONY-3628:([drlvm][testing]
API test org.apache.harmony.luni.tests.java.lang.SecurityManagerTest failed on DRLVM)
modified smishura  /harmony/enhanced/classlib/trunk/modules/luni/make/exclude.windows.x86_64.drl
04/12/2007 13:29:30 Exclude SecurityManagerTest for DRL VM. See HARMONY-3628:([drlvm][testing]
API test org.apache.harmony.luni.tests.java.lang.SecurityManagerTest failed on DRLVM)
add cc-drlvm log20070412131701Lbuild.561 04/12/2007 13:17:01drlvm
add cc-classlib log20070412131342Lbuild.419 04/12/2007 13:13:42classlib
modified pyang  /harmony/enhanced/classlib/trunk/modules/archive/src/test/java/org/apache/harmony/archive/tests/java/util/jar/JarEntryTest.java
04/12/2007 12:35:34 Apply patch for HARMONY-3621( [classlib][archive] Add test for java.util.jar.Attributes.hashCode(
) and java.util.jar.JarEntry( JarEntry ))
modified pyang  /harmony/enhanced/classlib/trunk/modules/archive/src/test/java/org/apache/harmony/archive/tests/java/util/jar/AttributesTest.java
04/12/2007 12:35:34 Apply patch for HARMONY-3621( [classlib][archive] Add test for java.util.jar.Attributes.hashCode(
) and java.util.jar.JarEntry( JarEntry ))
modified pyang  /harmony/enhanced/classlib/trunk/modules/luni/src/test/java/tests/api/java/net/DatagramSocketImplTest.java
04/12/2007 12:30:55 Apply patch for HARMONY-3607([classlib][luni]add tests for java.net.DatagramSocketImpl.connect)
added pyang  /harmony/enhanced/classlib/trunk/modules/luni/src/test/java/tests/api/java/net/SecureCacheResponseTest.java
04/12/2007 12:29:17 Apply patch for HARMONY-3606( [classlib][luni]Add tests for java.net.SecureCacheResponse)
add cc-drlvm log20070412110725Lbuild.560 04/12/2007 11:07:25drlvm
add cc-classlib log20070412110406Lbuild.418 04/12/2007 11:04:06classlib
modified xli  /harmony/enhanced/classlib/trunk/modules/imageio/src/main/java/org/apache/harmony/x/imageio/plugins/png/PNGImageReaderSpi.java
04/12/2007 10:43:48 HARMONY-3623: fix bug that code depends on hash order
modified ndbeyer  /harmony/enhanced/classlib/trunk/modules/swing/make/exclude.common 04/12/2007
10:42:22 Revert removal of prematurely excluded tests.
add cc-drlvm log20070412085311Lbuild.559 04/12/2007 08:53:11drlvm
add cc-classlib log20070412085002Lbuild.417 04/12/2007 08:50:02classlib
modified gshimansky  /harmony/enhanced/drlvm/trunk/vm/vmcore/src/jit/jit_runtime_support.cpp
04/12/2007 05:11:03 Applied HARMONY-1922 [drlvm] wrong assertion in class_alloc_new_object()
modified gshimansky  /harmony/enhanced/drlvm/trunk/build/make/components/vm/kernel_classes.xml
04/12/2007 05:09:19 Applied HARMONY-3622 [drlvm][build] failed to rebuild single kernel class
modified gshimansky  /harmony/enhanced/drlvm/trunk/build/make/targets/build.java.xml 04/12/2007
05:09:19 Applied HARMONY-3622 [drlvm][build] failed to rebuild single kernel class
modified gshimansky  /harmony/enhanced/drlvm/trunk/build/make/targets/build.xml 04/12/2007
05:09:19 Applied HARMONY-3622 [drlvm][build] failed to rebuild single kernel class
modified gshimansky  /harmony/enhanced/classlib/trunk/modules/imageio/build.xml 04/12/2007
05:08:04 Applied HARMONY-2719 [classlib][build] Copy pdb files on windows to deploy directory
modified gshimansky  /harmony/enhanced/classlib/trunk/modules/awt/build.xml 04/12/2007 05:08:04
Applied HARMONY-2719 [classlib][build] Copy pdb files on windows to deploy directory
modified gshimansky  /harmony/enhanced/classlib/trunk/modules/misc/build.xml 04/12/2007 05:08:04
Applied HARMONY-2719 [classlib][build] Copy pdb files on windows to deploy directory
modified gshimansky  /harmony/enhanced/classlib/trunk/modules/portlib/build.xml 04/12/2007
05:08:04 Applied HARMONY-2719 [classlib][build] Copy pdb files on windows to deploy directory
modified gshimansky  /harmony/enhanced/classlib/trunk/modules/print/build.xml 04/12/2007 05:08:04
Applied HARMONY-2719 [classlib][build] Copy pdb files on windows to deploy directory
modified gshimansky  /harmony/enhanced/classlib/trunk/modules/prefs/build.xml 04/12/2007 05:08:04
Applied HARMONY-2719 [classlib][build] Copy pdb files on windows to deploy directory
modified gshimansky  /harmony/enhanced/classlib/trunk/modules/archive/build.xml 04/12/2007
05:08:04 Applied HARMONY-2719 [classlib][build] Copy pdb files on windows to deploy directory
modified gshimansky  /harmony/enhanced/classlib/trunk/modules/auth/build.xml 04/12/2007 05:08:04
Applied HARMONY-2719 [classlib][build] Copy pdb files on windows to deploy directory
modified gshimansky  /harmony/enhanced/classlib/trunk/make/properties.xml 04/12/2007 05:08:04
Applied HARMONY-2719 [classlib][build] Copy pdb files on windows to deploy directory
modified gshimansky  /harmony/enhanced/classlib/trunk/modules/text/build.xml 04/12/2007 05:08:04
Applied HARMONY-2719 [classlib][build] Copy pdb files on windows to deploy directory
modified gshimansky  /harmony/enhanced/classlib/trunk/modules/nio/build.xml 04/12/2007 05:08:04
Applied HARMONY-2719 [classlib][build] Copy pdb files on windows to deploy directory
modified gshimansky  /harmony/enhanced/classlib/trunk/modules/luni/build.xml 04/12/2007 05:08:04
Applied HARMONY-2719 [classlib][build] Copy pdb files on windows to deploy directory
modified gshimansky  /harmony/enhanced/classlib/trunk/modules/security/build.xml 04/12/2007
05:08:04 Applied HARMONY-2719 [classlib][build] Copy pdb files on windows to deploy directory
modified gshimansky  /harmony/enhanced/classlib/trunk/modules/instrument/build.xml 04/12/2007
05:08:04 Applied HARMONY-2719 [classlib][build] Copy pdb files on windows to deploy directory
add cc-drlvm log20070412000559Lbuild.558 04/12/2007 00:05:59drlvm
add cc-classlib log20070412000223Lbuild.416 04/12/2007 00:02:23classlib
modified ndbeyer  /harmony/enhanced/classlib/trunk/modules/swing/src/main/java/common/javax/swing/JEditorPane.java
04/11/2007 23:58:19 Apply patches for HARMONY-3454: [classlib][swing] JEditorPane.createEditorKitForContentType()
uses wrong classloader
modified ndbeyer  /harmony/enhanced/classlib/trunk/modules/swing/src/test/api/java/common/javax/swing/JEditorPaneTest.java
04/11/2007 23:58:19 Apply patches for HARMONY-3454: [classlib][swing] JEditorPane.createEditorKitForContentType()
uses wrong classloader
modified ndbeyer  /harmony/enhanced/classlib/trunk/modules/swing/make/exclude.common 04/11/2007
23:58:19 Apply patches for HARMONY-3454: [classlib][swing] JEditorPane.createEditorKitForContentType()
uses wrong classloader
add cc-drlvm log20070411211754Lbuild.557 04/11/2007 21:17:54drlvm
add cc-classlib log20070411211358Lbuild.415 04/11/2007 21:13:58classlib
modified hindessm  /harmony/enhanced/classlib/trunk/modules/imageio/build.xml 04/11/2007 19:45:27
Add missing clean native step.
modified varlax  /harmony/enhanced/drlvm/trunk/vm/jitrino/src/codegenerator/ipf/IpfCodeGenerator.cpp
04/11/2007 19:28:45 Applied HARMONY-3596 [drlvm][ia64][jit] Guarded code liveness analysis
implemented
added varlax  /harmony/enhanced/drlvm/trunk/vm/jitrino/src/codegenerator/ipf/include/IpfLiveManager.h
04/11/2007 19:28:45 Applied HARMONY-3596 [drlvm][ia64][jit] Guarded code liveness analysis
implemented
modified varlax  /harmony/enhanced/drlvm/trunk/vm/jitrino/src/codegenerator/ipf/include/IpfOpndManager.h
04/11/2007 19:28:45 Applied HARMONY-3596 [drlvm][ia64][jit] Guarded code liveness analysis
implemented
deleted varlax  /harmony/enhanced/drlvm/trunk/vm/jitrino/src/codegenerator/ipf/include/IpfDce.h
04/11/2007 19:28:45 Applied HARMONY-3596 [drlvm][ia64][jit] Guarded code liveness analysis
implemented
modified varlax  /harmony/enhanced/drlvm/trunk/vm/jitrino/src/codegenerator/ipf/IpfRegisterAllocator.cpp
04/11/2007 19:28:45 Applied HARMONY-3596 [drlvm][ia64][jit] Guarded code liveness analysis
implemented
added varlax  /harmony/enhanced/drlvm/trunk/vm/jitrino/src/codegenerator/ipf/include/IpfInstrumentator.h
04/11/2007 19:28:45 Applied HARMONY-3596 [drlvm][ia64][jit] Guarded code liveness analysis
implemented
modified varlax  /harmony/enhanced/drlvm/trunk/vm/jitrino/src/codegenerator/ipf/include/IpfCfg.h
04/11/2007 19:28:45 Applied HARMONY-3596 [drlvm][ia64][jit] Guarded code liveness analysis
implemented
modified varlax  /harmony/enhanced/drlvm/trunk/vm/jitrino/src/codegenerator/ipf/include/IpfCodeLayouter.h
04/11/2007 19:28:45 Applied HARMONY-3596 [drlvm][ia64][jit] Guarded code liveness analysis
implemented
added varlax  /harmony/enhanced/drlvm/trunk/vm/jitrino/src/codegenerator/ipf/IpfLiveManager.cpp
04/11/2007 19:28:45 Applied HARMONY-3596 [drlvm][ia64][jit] Guarded code liveness analysis
implemented
modified varlax  /harmony/enhanced/drlvm/trunk/vm/jitrino/src/codegenerator/ipf/IpfOpndManager.cpp
04/11/2007 19:28:45 Applied HARMONY-3596 [drlvm][ia64][jit] Guarded code liveness analysis
implemented
deleted varlax  /harmony/enhanced/drlvm/trunk/vm/jitrino/src/codegenerator/ipf/IpfDce.cpp
04/11/2007 19:28:45 Applied HARMONY-3596 [drlvm][ia64][jit] Guarded code liveness analysis
implemented
modified varlax  /harmony/enhanced/drlvm/trunk/vm/jitrino/src/codegenerator/ipf/include/IpfLiveAnalyzer.h
04/11/2007 19:28:45 Applied HARMONY-3596 [drlvm][ia64][jit] Guarded code liveness analysis
implemented
added varlax  /harmony/enhanced/drlvm/trunk/vm/jitrino/src/codegenerator/ipf/IpfInstrumentator.cpp
04/11/2007 19:28:45 Applied HARMONY-3596 [drlvm][ia64][jit] Guarded code liveness analysis
implemented
modified varlax  /harmony/enhanced/drlvm/trunk/vm/jitrino/src/codegenerator/ipf/IpfCodeLayouter.cpp
04/11/2007 19:28:45 Applied HARMONY-3596 [drlvm][ia64][jit] Guarded code liveness analysis
implemented
modified varlax  /harmony/enhanced/drlvm/trunk/vm/jitrino/src/codegenerator/ipf/IpfCfg.cpp
04/11/2007 19:28:45 Applied HARMONY-3596 [drlvm][ia64][jit] Guarded code liveness analysis
implemented
modified varlax  /harmony/enhanced/drlvm/trunk/vm/jitrino/src/codegenerator/ipf/include/IpfCodeSelector.h
04/11/2007 19:28:45 Applied HARMONY-3596 [drlvm][ia64][jit] Guarded code liveness analysis
implemented
modified varlax  /harmony/enhanced/drlvm/trunk/vm/jitrino/src/codegenerator/ipf/IpfLiveAnalyzer.cpp
04/11/2007 19:28:45 Applied HARMONY-3596 [drlvm][ia64][jit] Guarded code liveness analysis
implemented
modified varlax  /harmony/enhanced/drlvm/trunk/vm/jitrino/src/codegenerator/ipf/include/IpfIrPrinter.h
04/11/2007 19:28:45 Applied HARMONY-3596 [drlvm][ia64][jit] Guarded code liveness analysis
implemented
modified varlax  /harmony/enhanced/drlvm/trunk/vm/jitrino/src/codegenerator/ipf/include/IpfRuntimeSupport.h
04/11/2007 19:28:45 Applied HARMONY-3596 [drlvm][ia64][jit] Guarded code liveness analysis
implemented
modified varlax  /harmony/enhanced/drlvm/trunk/vm/jitrino/src/codegenerator/ipf/include/IpfType.h
04/11/2007 19:28:45 Applied HARMONY-3596 [drlvm][ia64][jit] Guarded code liveness analysis
implemented
modified varlax  /harmony/enhanced/drlvm/trunk/vm/jitrino/src/codegenerator/ipf/IpfInstCodeSelector.cpp
04/11/2007 19:28:45 Applied HARMONY-3596 [drlvm][ia64][jit] Guarded code liveness analysis
implemented
modified varlax  /harmony/enhanced/drlvm/trunk/vm/jitrino/src/codegenerator/ipf/include/IpfCodeGenerator.h
04/11/2007 19:28:45 Applied HARMONY-3596 [drlvm][ia64][jit] Guarded code liveness analysis
implemented
modified varlax  /harmony/enhanced/drlvm/trunk/vm/jitrino/src/codegenerator/ipf/IpfCodeSelector.cpp
04/11/2007 19:28:45 Applied HARMONY-3596 [drlvm][ia64][jit] Guarded code liveness analysis
implemented
modified varlax  /harmony/enhanced/drlvm/trunk/vm/jitrino/src/codegenerator/ipf/include/IpfRegisterAllocator.h
04/11/2007 19:28:45 Applied HARMONY-3596 [drlvm][ia64][jit] Guarded code liveness analysis
implemented
modified varlax  /harmony/enhanced/drlvm/trunk/vm/jitrino/src/codegenerator/ipf/IpfIrPrinter.cpp
04/11/2007 19:28:45 Applied HARMONY-3596 [drlvm][ia64][jit] Guarded code liveness analysis
implemented
modified varlax  /harmony/enhanced/drlvm/trunk/vm/jitrino/src/codegenerator/ipf/IpfEncoder.cpp
04/11/2007 19:28:45 Applied HARMONY-3596 [drlvm][ia64][jit] Guarded code liveness analysis
implemented
modified varlax  /harmony/enhanced/drlvm/trunk/vm/jitrino/src/codegenerator/ipf/IpfRuntimeSupport.cpp
04/11/2007 19:28:45 Applied HARMONY-3596 [drlvm][ia64][jit] Guarded code liveness analysis
implemented
add cc-drlvm log20070411190652Lbuild.556 04/11/2007 19:06:52drlvm
modified pyang  /harmony/enhanced/classlib/trunk/modules/luni/src/test/java/tests/api/java/io/PrintStreamTest.java
04/11/2007 18:59:53 Apply patch for HARMONY-3608([classlib][luni] Add test cases for java.io.PrintStream)
modified pyang  /harmony/enhanced/classlib/trunk/modules/luni/src/test/java/tests/api/java/io/FilterInputStreamTest.java
04/11/2007 18:58:22 Apply patch for HARMONY-3612([classlib][luni]Add test cases for java.io.FilterInputStream
and ObjectInputStream)
modified pyang  /harmony/enhanced/classlib/trunk/modules/luni/src/test/java/org/apache/harmony/luni/tests/java/io/ObjectInputStreamTest.java
04/11/2007 18:58:22 Apply patch for HARMONY-3612([classlib][luni]Add test cases for java.io.FilterInputStream
and ObjectInputStream)
add cc-classlib log20070411185624Lbuild.414 04/11/2007 18:56:24classlib
modified pyang  /harmony/enhanced/classlib/trunk/modules/archive/src/main/java/java/util/zip/ZipEntry.java
04/11/2007 18:54:52 Apply patch for HARMONY-3613([classlib][archive] Add test for java.util.zip.ZipFile.size()
and remove some useless methods of ZipEntry)
modified pyang  /harmony/enhanced/classlib/trunk/modules/archive/src/test/java/org/apache/harmony/archive/tests/java/util/zip/ZipFileTest.java
04/11/2007 18:54:52 Apply patch for HARMONY-3613([classlib][archive] Add test for java.util.zip.ZipFile.size()
and remove some useless methods of ZipEntry)
added pyang  /harmony/enhanced/classlib/trunk/modules/awt/src/test/api/java/common/org/apache/harmony/awt/AWTPermissionTest.java
04/11/2007 18:52:20 Apply patch for HARMONY-3594([classlib][luni] Add test cases for java.lang.SecurityManager)
modified pyang  /harmony/enhanced/classlib/trunk/modules/luni/src/test/java/org/apache/harmony/luni/tests/java/lang/SecurityManagerTest.java
04/11/2007 18:52:20 Apply patch for HARMONY-3594([classlib][luni] Add test cases for java.lang.SecurityManager)

Mime
View raw message