harmony-alerts mailing list archives

Site index · List index
Message view « Date » · « Thread »
Top « Date » · « Thread »
From nom...@intel.com
Subject [build-test alert] BUILD FAILED Windows XP SP2 msvc debug: classlib over drlvm
Date Wed, 11 Apr 2007 14:35:59 GMT
BUILD FAILED:
	Ant Error Message:
C:\cruise\trunk\cc\projects\classlib\trunk\build.xml:169: The following error occurred while
executing this line: C:\cruise\trunk\cc\projects\classlib\trunk\make\build-test.xml:147: There
were test errors.

Date of build:	04/11/2007 21:04:54
Time to build:	30 minutes 30 seconds
Last changed:	04/11/2007 19:45:27
Last log entry:	Add missing clean native step.

***********************************************************
Execution log (errors/warnings messages):	

========================================
Testing class libraries...
========================================

Checking for depends/jars/yoko_M2-20070130/yoko.jar
Checking for depends/jars/yoko_M2-20070130/yoko-core.jar
Checking for depends/jars/yoko_M2-20070130/yoko-rmi-impl.jar
Checking for depends/jars/yoko_M2-20070130/yoko-rmi-spec.jar
Checking for depends/jars/bcel-5.2/bcel-5.2.jar
Checking for depends/jars/xalan-j_2.7.0/xalan.jar
Checking for depends/jars/xerces_2.9.0/xerces.zip
Checking for depends/jars/junit_3.8.2/junit.jar
Checking for depends/jars/bcprov-jdk15-134/bcprov.jar
Checking for depends/jars/icu4j_3.4.4/icu4j_3_4_4.jar
Checking for depends/jars/mx4j_3.0.2/mx4j.zip
Checking for depends/jars/ecj_3.2/ecj_3.2.jar
Checking for depends/jars/jetty/jetty-6.0.0.jar
Checking for depends/jars/jetty/jetty-util-6.0.0.jar
Checking for depends/jars/jetty/servlet-api-2.5-6.0.0.jar
Checking for depends/libs/windows.x86/msvcr71.dll
Checking for depends/libs/windows.x86/swing_awt_deps_winxp_2006-09-28.tgz
hy.test.vm.name = drl
Compiling ACCESSIBILITY classes
Compiling ACCESSIBILITY tests
Since fork is false, ignoring memoryMaximumSize setting
Compiling ANNOTATION classes
Compiling ANNOTATION tests
Since fork is false, ignoring memoryMaximumSize setting
----------
1. WARNING in C:\cruise\trunk\cc\projects\classlib\trunk\modules\annotation\src\test\java\org\apache\harmony\annotation\tests\java\lang\annotation\IncompleteAnnotationExceptionTest.java
 (at line 53)
	clazz, elementName);
	^^^^^
Type safety: The expression of type Class needs unchecked conversion to conform to Class<?
extends Annotation>
----------
1 problem (1 warning)
Compiling APPLET classes
Compiling APPLET tests
Since fork is false, ignoring memoryMaximumSize setting
Compiling ARCHIVE classes
Compiling ARCHIVE tests
Since fork is false, ignoring memoryMaximumSize setting
Compiling AUTH classes
Compiling AUTH tests
Since fork is false, ignoring memoryMaximumSize setting
Compiling AWT classes
Compiling AWT tests
Since fork is false, ignoring memoryMaximumSize setting
Compiling BEANS classes
Compiling support classes for BEANS tests
Compiling internal BEANS tests
Compiling BEANS tests
Since fork is false, ignoring memoryMaximumSize setting
Running internal BEANS tests
Running BEANS tests
Compiling CRYPTO classes
Compiling CRYPTO test support files
Compiling CRYPTO api tests
Since fork is false, ignoring memoryMaximumSize setting
Compiling CRYPTO api injected tests
Since fork is false, ignoring memoryMaximumSize setting
Compiling CRYPTO impl injected tests
Since fork is false, ignoring memoryMaximumSize setting
Compiling CRYPTO impl tests
Since fork is false, ignoring memoryMaximumSize setting
Running CRYPTO api tests
Running CRYPTO api.injected tests
Running CRYPTO impl tests
Running CRYPTO impl injected tests
Compiling ImageIO classes
Compiling ImageIO tests
Since fork is false, ignoring memoryMaximumSize setting
Compiling INSTRUMENT classes
Compiling INSTRUMENT tests
Since fork is false, ignoring memoryMaximumSize setting
Compiling JNDI classes
Compiling JNDI tests
Since fork is false, ignoring memoryMaximumSize setting
Compiling LANG-MANAGEMENT classes
Compiling LANG-MANAGEMENT API tests
Since fork is false, ignoring memoryMaximumSize setting
Compiling LANG-MANAGEMENT Implementation tests
Since fork is false, ignoring memoryMaximumSize setting
Compiling LOGGING classes
Compiling LOGGING tests
Since fork is false, ignoring memoryMaximumSize setting
Compiling LUNI classes
Compiling LUNI JUnit Tests
Since fork is false, ignoring memoryMaximumSize setting
Running LUNI JUnit Tests
java.io.IOException: Stream is closed
	at java.io.BufferedInputStream.read(BufferedInputStream.java:247)
	at java.io.FilterInputStream.read(FilterInputStream.java:137)
	at tests.support.Support_Exec$1.run(Support_Exec.java:177)
	at java.lang.Thread.run(Thread.java:661)
2007-04-11 21:18:51.065::INFO:  Logging to STDERR via org.mortbay.log.StdErrLog
2007-04-11 21:18:51.315::INFO:  jetty-6.0.x
2007-04-11 21:18:51.565::INFO:  Started SocketConnector @ 0.0.0.0:2021
2007-04-11 21:19:56.955::INFO:  jetty-6.0.x
2007-04-11 21:19:56.971::INFO:  Started SocketConnector @ 0.0.0.0:2311
2007-04-11 21:19:59.768::INFO:  jetty-6.0.x
2007-04-11 21:19:59.768::INFO:  Started SocketConnector @ 0.0.0.0:2323
Compiling MATH classes
Compiling MATH tests
Since fork is false, ignoring memoryMaximumSize setting
Compiling MISC classes
Compiling MISC tests
Since fork is false, ignoring memoryMaximumSize setting
Compiling NIO classes
Compiling NIO tests
Since fork is false, ignoring memoryMaximumSize setting
Compiling NIO_CHAR classes
Compiling NIO_CHAR tests
Since fork is false, ignoring memoryMaximumSize setting
Cannot find unmappable byte array for US-ASCII
Cannot find unmappable byte array for gb18030
Cannot find unmappable byte array for ISO-8859-1
Cannot find malform byte array for ISO-8859-1
Cannot find unmappable byte array for UTF-16BE
Cannot find malform byte array for UTF-16BE
Cannot find unmappable byte array for UTF-16
Cannot find malform byte array for UTF-16
Cannot find unmappable byte array for UTF-16LE
Cannot find malform byte array for UTF-16LE
Cannot find unmappable byte array for UTF-8
Compiling PACK200 classes
Compiling PACK200 tests
Since fork is false, ignoring memoryMaximumSize setting
Running PACK200 tests
Compiling PREFS classes
Compiling PREFS tests
Since fork is false, ignoring memoryMaximumSize setting
Compiling PRINT classes
Compiling Print tests
Since fork is false, ignoring memoryMaximumSize setting
Compiling REGEX classes
Compiling REGEX tests
Since fork is false, ignoring memoryMaximumSize setting
Compiling RMI classes
Compiling RMI api tests
Since fork is false, ignoring memoryMaximumSize setting
Running RMI api tests
testDirectSocket_SingleVM starting
Test server started.
Object: MyRemoteObject[UnicastServerRef[endpoint:[[10.125.122.37:2965]](local), ObjID[65536,
UID[205b752c:111e107cb8a:-8000]]]] created and exported.
Apr 11, 2007 9:24:19 PM org.apache.harmony.rmi.server.RMIReference makeStrong
FINER: main: Strongly referenced RegistryImpl
Registry created.
Object bound in the registry.
Registry located.
Apr 11, 2007 9:24:21 PM org.apache.harmony.rmi.client.ClientConnection sendDGCAck
FINER: main: Sent DGC ack to [localhost:1099] for UID[205b752c:111e107cb8a:-7ffd]
Lookup object is: Proxy[interf:[org.apache.harmony.rmi.test.MyRemoteInterface, java.rmi.Remote],
RemoteObjectInvocationHandler[UnicastRef[endpoint:[[10.125.122.37:2965]](remote), ObjID[65536,
UID[205b752c:111e107cb8a:-8000]]]]]
Testing test_String_Void...
Done.
Testing test_Void_String...
Returned: MyRemoteObject.test_Void_String
Done.
Testing test_Int_Void...
Done.
Testing test_Void_Int...
Returned: 987654321
Done.
Testing test_Remote_Void...
Done.
Testing test_Remote_Void with remote object extending another remote object...
Done.
Testing test_Void_Remote...
Apr 11, 2007 9:24:21 PM org.apache.harmony.rmi.client.ClientConnection sendDGCAck
FINER: main: Sent DGC ack to [10.125.122.37:2965] for UID[205b752c:111e107cb8a:-7fe8]
Returned: Proxy[interf:[org.apache.harmony.rmi.test.MyRemoteInterface2, java.rmi.Remote],
RemoteObjectInvocationHandler[UnicastRef[endpoint:[[10.125.122.37:2973]](remote), ObjID[65539,
UID[205b752c:111e107cb8a:-7fe9]]]]]
Done.
Testing test_Long_Long...
Returned: 998877665544332211
Done.
Testing test_String_String...
Returned: MyRemoteObject.test_String_String
Done.
Testing test_Remote_Remote...
Apr 11, 2007 9:24:21 PM org.apache.harmony.rmi.client.ClientConnection sendDGCAck
FINER: main: Sent DGC ack to [10.125.122.37:2965] for UID[205b752c:111e107cb8a:-7fde]
Returned: Proxy[interf:[org.apache.harmony.rmi.test.MyRemoteInterface2, java.rmi.Remote],
RemoteObjectInvocationHandler[UnicastRef[endpoint:[[10.125.122.37:2977]](remote), ObjID[65541,
UID[205b752c:111e107cb8a:-7fdf]]]]]
Done.
Testing test_RemoteString_Void...
Done.
Testing test_RemoteRemote_Remote...
Apr 11, 2007 9:24:22 PM org.apache.harmony.rmi.client.ClientConnection sendDGCAck
FINER: main: Sent DGC ack to [10.125.122.37:2965] for UID[205b752c:111e107cb8a:-7fd0]
Returned: Proxy[interf:[org.apache.harmony.rmi.test.MyRemoteInterface2, java.rmi.Remote],
RemoteObjectInvocationHandler[UnicastRef[endpoint:[[10.125.122.37:2984]](remote), ObjID[65545,
UID[205b752c:111e107cb8a:-7fd1]]]]]
Done.
Testing test_BooleanStringRemote_Void...
Done.
Testing test_Proxy_Void...
Done.
Testing test_Array_Void...
Done.
Testing test_Void_Array...
Done.
Testing test_RemoteArray_Void...
Done.
Testing test_Void_RemoteArray...
Apr 11, 2007 9:24:22 PM org.apache.harmony.rmi.client.ClientConnection sendDGCAck
FINER: main: Sent DGC ack to [10.125.122.37:2965] for UID[205b752c:111e107cb8a:-7fbd]
Done.
Testing test_Exception...
org.apache.harmony.rmi.test.MyException: MyRemoteObject.test_Exception
Done.
Testing test_Error...
java.rmi.ServerError: Error occurred while remote method invocation; nested exception is:
	java.lang.Error: MyRemoteObject.test_Error
Done.
Testing test_RuntimeException...
java.lang.RuntimeException: MyRemoteObject.text_RuntimeException
Done.
Testing test_RemoteException...
java.rmi.ServerException: RemoteException occurred while remote method invocation; nested
exception is:
	java.rmi.RemoteException: MyRemoteObject.text_RemoteException
Done.
Test server complete.
Test server closing.
Unexporting MyRemoteObject[UnicastServerRef[endpoint:[[10.125.122.37:2965]](local), ObjID[65536,
UID[205b752c:111e107cb8a:-8000]]]] ...
Done.
Unexporting MyRemoteObject1[UnicastServerRef[endpoint:[[10.125.122.37:2969]](local), ObjID[65537,
UID[205b752c:111e107cb8a:-7ff4]]]] ...
Done.
Unexporting MyRemoteObject4[UnicastServerRef[endpoint:[[10.125.122.37:2971]](local), ObjID[65538,
UID[205b752c:111e107cb8a:-7fef]]]] ...
Done.
Unexporting MyRemoteObject1[UnicastServerRef[endpoint:[[10.125.122.37:2975]](local), ObjID[65540,
UID[205b752c:111e107cb8a:-7fe3]]]] ...
Done.
Unexporting MyRemoteObject1[UnicastServerRef[endpoint:[[10.125.122.37:2978]](local), ObjID[65542,
UID[205b752c:111e107cb8a:-7fdd]]]] ...
Done.
Unexporting MyRemoteObject1[UnicastServerRef[endpoint:[[10.125.122.37:2980]](local), ObjID[65543,
UID[205b752c:111e107cb8a:-7fd8]]]] ...
Done.
Unexporting MyRemoteObject3[UnicastServerRef[endpoint:[[10.125.122.37:2981]](local), ObjID[65544,
UID[205b752c:111e107cb8a:-7fd7]]]] ...
Done.
Unexporting MyRemoteObject1[UnicastServerRef[endpoint:[[10.125.122.37:2985]](local), ObjID[65546,
UID[205b752c:111e107cb8a:-7fcf]]]] ...
Done.
Unexporting MyRemoteObject1[UnicastServerRef[endpoint:[[10.125.122.37:2987]](local), ObjID[65547,
UID[205b752c:111e107cb8a:-7fc4]]]] ...
Done.
Unexporting MyRemoteObject1[UnicastServerRef[endpoint:[[10.125.122.37:2988]](local), ObjID[65548,
UID[205b752c:111e107cb8a:-7fc3]]]] ...
Done.
Unexporting RegistryImpl ...
Done.
Test server exiting.
testDirectHTTP_SingleVM starting
Test server started.
Object: MyRemoteObject[UnicastServerRef[endpoint:[[10.125.122.37:2993]](local), ObjID[65536,
UID[205b752c:111e107f77c:-8000]]]] created and exported.
Apr 11, 2007 9:24:30 PM org.apache.harmony.rmi.server.RMIReference makeStrong
FINER: main: Strongly referenced RegistryImpl
Registry created.
Object bound in the registry.
Registry located.
Apr 11, 2007 9:24:32 PM org.apache.harmony.rmi.client.ClientConnection sendDGCAck
FINER: main: Sent DGC ack to [localhost:1099] for UID[205b752c:111e107f77c:-7ffd]
Lookup object is: Proxy[interf:[org.apache.harmony.rmi.test.MyRemoteInterface, java.rmi.Remote],
RemoteObjectInvocationHandler[UnicastRef[endpoint:[[10.125.122.37:2993]](remote), ObjID[65536,
UID[205b752c:111e107f77c:-8000]]]]]
Testing test_String_Void...
Done.
Testing test_Void_String...
Returned: MyRemoteObject.test_Void_String
Done.
Testing test_Int_Void...
Done.
Testing test_Void_Int...
Returned: 987654321
Done.
Testing test_Remote_Void...
Done.
Testing test_Remote_Void with remote object extending another remote object...
Done.
Testing test_Void_Remote...
Apr 11, 2007 9:24:32 PM org.apache.harmony.rmi.client.ClientConnection sendDGCAck
FINER: main: Sent DGC ack to [10.125.122.37:2993] for UID[205b752c:111e107f77c:-7fe8]
Returned: Proxy[interf:[org.apache.harmony.rmi.test.MyRemoteInterface2, java.rmi.Remote],
RemoteObjectInvocationHandler[UnicastRef[endpoint:[[10.125.122.37:3001]](remote), ObjID[65539,
UID[205b752c:111e107f77c:-7fe9]]]]]
Done.
Testing test_Long_Long...
Returned: 998877665544332211
Done.
Testing test_String_String...
Returned: MyRemoteObject.test_String_String
Done.
Testing test_Remote_Remote...
Apr 11, 2007 9:24:33 PM org.apache.harmony.rmi.client.ClientConnection sendDGCAck
FINER: main: Sent DGC ack to [10.125.122.37:2993] for UID[205b752c:111e107f77c:-7fde]
Returned: Proxy[interf:[org.apache.harmony.rmi.test.MyRemoteInterface2, java.rmi.Remote],
RemoteObjectInvocationHandler[UnicastRef[endpoint:[[10.125.122.37:3005]](remote), ObjID[65541,
UID[205b752c:111e107f77c:-7fdf]]]]]
Done.
Testing test_RemoteString_Void...
Done.
Testing test_RemoteRemote_Remote...
Apr 11, 2007 9:24:33 PM org.apache.harmony.rmi.client.ClientConnection sendDGCAck
FINER: main: Sent DGC ack to [10.125.122.37:2993] for UID[205b752c:111e107f77c:-7fd0]
Returned: Proxy[interf:[org.apache.harmony.rmi.test.MyRemoteInterface2, java.rmi.Remote],
RemoteObjectInvocationHandler[UnicastRef[endpoint:[[10.125.122.37:3012]](remote), ObjID[65545,
UID[205b752c:111e107f77c:-7fd1]]]]]
Done.
Testing test_BooleanStringRemote_Void...
Done.
Testing test_Proxy_Void...
Done.
Testing test_Array_Void...
Done.
Testing test_Void_Array...
Done.
Testing test_RemoteArray_Void...
Done.
Testing test_Void_RemoteArray...
Apr 11, 2007 9:24:33 PM org.apache.harmony.rmi.client.ClientConnection sendDGCAck
FINER: main: Sent DGC ack to [10.125.122.37:2993] for UID[205b752c:111e107f77c:-7fbd]
Done.
Testing test_Exception...
org.apache.harmony.rmi.test.MyException: MyRemoteObject.test_Exception
Done.
Testing test_Error...
java.rmi.ServerError: Error occurred while remote method invocation; nested exception is:
	java.lang.Error: MyRemoteObject.test_Error
Done.
Testing test_RuntimeException...
java.lang.RuntimeException: MyRemoteObject.text_RuntimeException
Done.
Testing test_RemoteException...
java.rmi.ServerException: RemoteException occurred while remote method invocation; nested
exception is:
	java.rmi.RemoteException: MyRemoteObject.text_RemoteException
Done.
Test server complete.
Test server closing.
Unexporting MyRemoteObject[UnicastServerRef[endpoint:[[10.125.122.37:2993]](local), ObjID[65536,
UID[205b752c:111e107f77c:-8000]]]] ...
Done.
Unexporting MyRemoteObject1[UnicastServerRef[endpoint:[[10.125.122.37:2997]](local), ObjID[65537,
UID[205b752c:111e107f77c:-7ff4]]]] ...
Done.
Unexporting MyRemoteObject4[UnicastServerRef[endpoint:[[10.125.122.37:2999]](local), ObjID[65538,
UID[205b752c:111e107f77c:-7fef]]]] ...
Done.
Unexporting MyRemoteObject1[UnicastServerRef[endpoint:[[10.125.122.37:3003]](local), ObjID[65540,
UID[205b752c:111e107f77c:-7fe3]]]] ...
Done.
Unexporting MyRemoteObject1[UnicastServerRef[endpoint:[[10.125.122.37:3006]](local), ObjID[65542,
UID[205b752c:111e107f77c:-7fdd]]]] ...
Done.
Unexporting MyRemoteObject1[UnicastServerRef[endpoint:[[10.125.122.37:3008]](local), ObjID[65543,
UID[205b752c:111e107f77c:-7fd8]]]] ...
Done.
Unexporting MyRemoteObject3[UnicastServerRef[endpoint:[[10.125.122.37:3009]](local), ObjID[65544,
UID[205b752c:111e107f77c:-7fd7]]]] ...
Done.
Unexporting MyRemoteObject1[UnicastServerRef[endpoint:[[10.125.122.37:3013]](local), ObjID[65546,
UID[205b752c:111e107f77c:-7fcf]]]] ...
Done.
Unexporting MyRemoteObject1[UnicastServerRef[endpoint:[[10.125.122.37:3015]](local), ObjID[65547,
UID[205b752c:111e107f77c:-7fc4]]]] ...
Done.
Unexporting MyRemoteObject1[UnicastServerRef[endpoint:[[10.125.122.37:3016]](local), ObjID[65548,
UID[205b752c:111e107f77c:-7fc3]]]] ...
Done.
Unexporting RegistryImpl ...
Done.
Test server exiting.
Unexporting MyRemoteObject1[UnicastServerRef[endpoint:[[10.125.122.37:3021]](local), ObjID[65536,
UID[20d6fab0:111e1081e5d:-7ff7]]]] ...
Done.
Unexporting MyRemoteObject1[UnicastServerRef[endpoint:[[10.125.122.37:3022]](local), ObjID[65537,
UID[20d6fab0:111e1081e5d:-7ff6]]]] ...
Done.
Unexporting MyRemoteObject1[UnicastServerRef[endpoint:[[10.125.122.37:3023]](local), ObjID[65538,
UID[20d6fab0:111e1081e5d:-7ff5]]]] ...
Done.
Unexporting MyRemoteObject1[UnicastServerRef[endpoint:[[10.125.122.37:3024]](local), ObjID[65539,
UID[20d6fab0:111e1081e5d:-7ff4]]]] ...
Done.
Unexporting MyRemoteObject1[UnicastServerRef[endpoint:[[10.125.122.37:3025]](local), ObjID[65540,
UID[20d6fab0:111e1081e5d:-7ff3]]]] ...
Done.
Unexporting MyRemoteObject1[UnicastServerRef[endpoint:[[10.125.122.37:3026]](local), ObjID[65541,
UID[20d6fab0:111e1081e5d:-7ff2]]]] ...
Done.
Unexporting MyRemoteObject1[UnicastServerRef[endpoint:[[10.125.122.37:3027]](local), ObjID[65542,
UID[20d6fab0:111e1081e5d:-7ff1]]]] ...
Done.
Unexporting MyRemoteObject1[UnicastServerRef[endpoint:[[10.125.122.37:3028]](local), ObjID[65543,
UID[20d6fab0:111e1081e5d:-7ff0]]]] ...
Done.
LogStream[tst]:
Compiling SECURITY classes
Compiling SECURITY test support files
Since fork is false, ignoring memoryMaximumSize setting
Compiling SECURITY api tests
Since fork is false, ignoring memoryMaximumSize setting
Compiling SECURITY api injected tests
Since fork is false, ignoring memoryMaximumSize setting
Compiling SECURITY impl injected tests
Since fork is false, ignoring memoryMaximumSize setting
Compiling SECURITY impl tests
Since fork is false, ignoring memoryMaximumSize setting
Running SECURITY api tests
Running SECURITY api.injected tests
Running SECURITY impl tests
Running SECURITY impl injected tests
Compiling SOUND classes
Compiling SOUND tests
Since fork is false, ignoring memoryMaximumSize setting
Compiling SQL classes
Compiling SQL tests
Since fork is false, ignoring memoryMaximumSize setting
Compiling Sun Compat classes
Compiling SUNCOMPAT tests
Compiling TEXT classes
Compiling TEXT tests
Since fork is false, ignoring memoryMaximumSize setting
Compiling TOOLS classes
Compiling Tools tests
Since fork is false, ignoring memoryMaximumSize setting
Compiling X-NET classes
Compiling X-NET test support files
Compiling X-NET api tests
Since fork is false, ignoring memoryMaximumSize setting
Compiling X-NET impl injected tests
Since fork is false, ignoring memoryMaximumSize setting
Compiling X-NET impl tests
Since fork is false, ignoring memoryMaximumSize setting
Running X-NET api tests
Running X-NET impl tests
Running X-NET impl injected tests
The test report is in C:\cruise\trunk\cc\projects\classlib\trunk\build\test_report\html\index.html

***********************************************************
Unit Tests: (16436)
        
error: test_classLoaderDepth org.apache.harmony.luni.tests.java.lang.SecurityManagerTest
error: test_currentClassLoader org.apache.harmony.luni.tests.java.lang.SecurityManagerTest
error: test_currentLoadedClass org.apache.harmony.luni.tests.java.lang.SecurityManagerTest
error: test_inClassLoader org.apache.harmony.luni.tests.java.lang.SecurityManagerTest
Unit Test Error Details:	(4)
                
Test: test_classLoaderDepthClass: org.apache.harmony.luni.tests.java.lang.SecurityManagerTestjava.lang.NullPointerException
	at java.lang.SecurityManager.classLoaderDepth(SecurityManager.java:625)
	at org.apache.harmony.luni.tests.java.lang.SecurityManagerTest$MockSecurityManager.classLoaderDepth(SecurityManagerTest.java:562)
	at org.apache.harmony.luni.tests.java.lang.SecurityManagerTest.test_classLoaderDepth(SecurityManagerTest.java:515)
	at java.lang.reflect.VMReflection.invokeMethod(VMReflection.java)

Test: test_currentClassLoaderClass: org.apache.harmony.luni.tests.java.lang.SecurityManagerTestjava.lang.NullPointerException
	at java.lang.SecurityManager.currentClassLoader(SecurityManager.java:589)
	at org.apache.harmony.luni.tests.java.lang.SecurityManagerTest$MockSecurityManager.currentClassLoader(SecurityManagerTest.java:567)
	at org.apache.harmony.luni.tests.java.lang.SecurityManagerTest.test_currentClassLoader(SecurityManagerTest.java:522)
	at java.lang.reflect.VMReflection.invokeMethod(VMReflection.java)

Test: test_currentLoadedClassClass: org.apache.harmony.luni.tests.java.lang.SecurityManagerTestjava.lang.NullPointerException
	at java.lang.SecurityManager.currentLoadedClass(SecurityManager.java:660)
	at org.apache.harmony.luni.tests.java.lang.SecurityManagerTest$MockSecurityManager.currentLoadedClass(SecurityManagerTest.java:572)
	at org.apache.harmony.luni.tests.java.lang.SecurityManagerTest.test_currentLoadedClass(SecurityManagerTest.java:529)
	at java.lang.reflect.VMReflection.invokeMethod(VMReflection.java)

Test: test_inClassLoaderClass: org.apache.harmony.luni.tests.java.lang.SecurityManagerTestjava.lang.NullPointerException
	at java.lang.SecurityManager.currentClassLoader(SecurityManager.java:589)
	at org.apache.harmony.luni.tests.java.lang.SecurityManagerTest$MockSecurityManager.currentClassLoader(SecurityManagerTest.java:567)
	at java.lang.SecurityManager.inClassLoader(SecurityManager.java:714)
	at org.apache.harmony.luni.tests.java.lang.SecurityManagerTest$MockSecurityManager.inClassLoader(SecurityManagerTest.java:587)
	at org.apache.harmony.luni.tests.java.lang.SecurityManagerTest.test_inClassLoader(SecurityManagerTest.java:545)
	at java.lang.reflect.VMReflection.invokeMethod(VMReflection.java)


***********************************************************
Modifications since last successful build:	(35)
            
modified hindessm  /harmony/enhanced/classlib/trunk/modules/imageio/build.xml 04/11/2007 19:45:27
Add missing clean native step.
modified varlax  /harmony/enhanced/drlvm/trunk/vm/jitrino/src/codegenerator/ipf/IpfCodeGenerator.cpp
04/11/2007 19:28:45 Applied HARMONY-3596 [drlvm][ia64][jit] Guarded code liveness analysis
implemented
added varlax  /harmony/enhanced/drlvm/trunk/vm/jitrino/src/codegenerator/ipf/include/IpfLiveManager.h
04/11/2007 19:28:45 Applied HARMONY-3596 [drlvm][ia64][jit] Guarded code liveness analysis
implemented
modified varlax  /harmony/enhanced/drlvm/trunk/vm/jitrino/src/codegenerator/ipf/include/IpfOpndManager.h
04/11/2007 19:28:45 Applied HARMONY-3596 [drlvm][ia64][jit] Guarded code liveness analysis
implemented
deleted varlax  /harmony/enhanced/drlvm/trunk/vm/jitrino/src/codegenerator/ipf/include/IpfDce.h
04/11/2007 19:28:45 Applied HARMONY-3596 [drlvm][ia64][jit] Guarded code liveness analysis
implemented
modified varlax  /harmony/enhanced/drlvm/trunk/vm/jitrino/src/codegenerator/ipf/IpfRegisterAllocator.cpp
04/11/2007 19:28:45 Applied HARMONY-3596 [drlvm][ia64][jit] Guarded code liveness analysis
implemented
added varlax  /harmony/enhanced/drlvm/trunk/vm/jitrino/src/codegenerator/ipf/include/IpfInstrumentator.h
04/11/2007 19:28:45 Applied HARMONY-3596 [drlvm][ia64][jit] Guarded code liveness analysis
implemented
modified varlax  /harmony/enhanced/drlvm/trunk/vm/jitrino/src/codegenerator/ipf/include/IpfCfg.h
04/11/2007 19:28:45 Applied HARMONY-3596 [drlvm][ia64][jit] Guarded code liveness analysis
implemented
modified varlax  /harmony/enhanced/drlvm/trunk/vm/jitrino/src/codegenerator/ipf/include/IpfCodeLayouter.h
04/11/2007 19:28:45 Applied HARMONY-3596 [drlvm][ia64][jit] Guarded code liveness analysis
implemented
added varlax  /harmony/enhanced/drlvm/trunk/vm/jitrino/src/codegenerator/ipf/IpfLiveManager.cpp
04/11/2007 19:28:45 Applied HARMONY-3596 [drlvm][ia64][jit] Guarded code liveness analysis
implemented
modified varlax  /harmony/enhanced/drlvm/trunk/vm/jitrino/src/codegenerator/ipf/IpfOpndManager.cpp
04/11/2007 19:28:45 Applied HARMONY-3596 [drlvm][ia64][jit] Guarded code liveness analysis
implemented
deleted varlax  /harmony/enhanced/drlvm/trunk/vm/jitrino/src/codegenerator/ipf/IpfDce.cpp
04/11/2007 19:28:45 Applied HARMONY-3596 [drlvm][ia64][jit] Guarded code liveness analysis
implemented
modified varlax  /harmony/enhanced/drlvm/trunk/vm/jitrino/src/codegenerator/ipf/include/IpfLiveAnalyzer.h
04/11/2007 19:28:45 Applied HARMONY-3596 [drlvm][ia64][jit] Guarded code liveness analysis
implemented
added varlax  /harmony/enhanced/drlvm/trunk/vm/jitrino/src/codegenerator/ipf/IpfInstrumentator.cpp
04/11/2007 19:28:45 Applied HARMONY-3596 [drlvm][ia64][jit] Guarded code liveness analysis
implemented
modified varlax  /harmony/enhanced/drlvm/trunk/vm/jitrino/src/codegenerator/ipf/IpfCodeLayouter.cpp
04/11/2007 19:28:45 Applied HARMONY-3596 [drlvm][ia64][jit] Guarded code liveness analysis
implemented
modified varlax  /harmony/enhanced/drlvm/trunk/vm/jitrino/src/codegenerator/ipf/IpfCfg.cpp
04/11/2007 19:28:45 Applied HARMONY-3596 [drlvm][ia64][jit] Guarded code liveness analysis
implemented
modified varlax  /harmony/enhanced/drlvm/trunk/vm/jitrino/src/codegenerator/ipf/include/IpfCodeSelector.h
04/11/2007 19:28:45 Applied HARMONY-3596 [drlvm][ia64][jit] Guarded code liveness analysis
implemented
modified varlax  /harmony/enhanced/drlvm/trunk/vm/jitrino/src/codegenerator/ipf/IpfLiveAnalyzer.cpp
04/11/2007 19:28:45 Applied HARMONY-3596 [drlvm][ia64][jit] Guarded code liveness analysis
implemented
modified varlax  /harmony/enhanced/drlvm/trunk/vm/jitrino/src/codegenerator/ipf/include/IpfIrPrinter.h
04/11/2007 19:28:45 Applied HARMONY-3596 [drlvm][ia64][jit] Guarded code liveness analysis
implemented
modified varlax  /harmony/enhanced/drlvm/trunk/vm/jitrino/src/codegenerator/ipf/include/IpfRuntimeSupport.h
04/11/2007 19:28:45 Applied HARMONY-3596 [drlvm][ia64][jit] Guarded code liveness analysis
implemented
modified varlax  /harmony/enhanced/drlvm/trunk/vm/jitrino/src/codegenerator/ipf/include/IpfType.h
04/11/2007 19:28:45 Applied HARMONY-3596 [drlvm][ia64][jit] Guarded code liveness analysis
implemented
modified varlax  /harmony/enhanced/drlvm/trunk/vm/jitrino/src/codegenerator/ipf/IpfInstCodeSelector.cpp
04/11/2007 19:28:45 Applied HARMONY-3596 [drlvm][ia64][jit] Guarded code liveness analysis
implemented
modified varlax  /harmony/enhanced/drlvm/trunk/vm/jitrino/src/codegenerator/ipf/include/IpfCodeGenerator.h
04/11/2007 19:28:45 Applied HARMONY-3596 [drlvm][ia64][jit] Guarded code liveness analysis
implemented
modified varlax  /harmony/enhanced/drlvm/trunk/vm/jitrino/src/codegenerator/ipf/IpfCodeSelector.cpp
04/11/2007 19:28:45 Applied HARMONY-3596 [drlvm][ia64][jit] Guarded code liveness analysis
implemented
modified varlax  /harmony/enhanced/drlvm/trunk/vm/jitrino/src/codegenerator/ipf/include/IpfRegisterAllocator.h
04/11/2007 19:28:45 Applied HARMONY-3596 [drlvm][ia64][jit] Guarded code liveness analysis
implemented
modified varlax  /harmony/enhanced/drlvm/trunk/vm/jitrino/src/codegenerator/ipf/IpfIrPrinter.cpp
04/11/2007 19:28:45 Applied HARMONY-3596 [drlvm][ia64][jit] Guarded code liveness analysis
implemented
modified varlax  /harmony/enhanced/drlvm/trunk/vm/jitrino/src/codegenerator/ipf/IpfEncoder.cpp
04/11/2007 19:28:45 Applied HARMONY-3596 [drlvm][ia64][jit] Guarded code liveness analysis
implemented
modified varlax  /harmony/enhanced/drlvm/trunk/vm/jitrino/src/codegenerator/ipf/IpfRuntimeSupport.cpp
04/11/2007 19:28:45 Applied HARMONY-3596 [drlvm][ia64][jit] Guarded code liveness analysis
implemented
modified pyang  /harmony/enhanced/classlib/trunk/modules/luni/src/test/java/tests/api/java/io/PrintStreamTest.java
04/11/2007 18:59:53 Apply patch for HARMONY-3608([classlib][luni] Add test cases for java.io.PrintStream)
modified pyang  /harmony/enhanced/classlib/trunk/modules/luni/src/test/java/tests/api/java/io/FilterInputStreamTest.java
04/11/2007 18:58:22 Apply patch for HARMONY-3612([classlib][luni]Add test cases for java.io.FilterInputStream
and ObjectInputStream)
modified pyang  /harmony/enhanced/classlib/trunk/modules/luni/src/test/java/org/apache/harmony/luni/tests/java/io/ObjectInputStreamTest.java
04/11/2007 18:58:22 Apply patch for HARMONY-3612([classlib][luni]Add test cases for java.io.FilterInputStream
and ObjectInputStream)
modified pyang  /harmony/enhanced/classlib/trunk/modules/archive/src/main/java/java/util/zip/ZipEntry.java
04/11/2007 18:54:52 Apply patch for HARMONY-3613([classlib][archive] Add test for java.util.zip.ZipFile.size()
and remove some useless methods of ZipEntry)
modified pyang  /harmony/enhanced/classlib/trunk/modules/archive/src/test/java/org/apache/harmony/archive/tests/java/util/zip/ZipFileTest.java
04/11/2007 18:54:52 Apply patch for HARMONY-3613([classlib][archive] Add test for java.util.zip.ZipFile.size()
and remove some useless methods of ZipEntry)
added pyang  /harmony/enhanced/classlib/trunk/modules/awt/src/test/api/java/common/org/apache/harmony/awt/AWTPermissionTest.java
04/11/2007 18:52:20 Apply patch for HARMONY-3594([classlib][luni] Add test cases for java.lang.SecurityManager)
modified pyang  /harmony/enhanced/classlib/trunk/modules/luni/src/test/java/org/apache/harmony/luni/tests/java/lang/SecurityManagerTest.java
04/11/2007 18:52:20 Apply patch for HARMONY-3594([classlib][luni] Add test cases for java.lang.SecurityManager)

Mime
View raw message