harmony-alerts mailing list archives

Site index · List index
Message view « Date » · « Thread »
Top « Date » · « Thread »
From nom...@intel.com
Subject [build-test alert] BUILD FAILED Linux SUSE 9 gcc debug: classlib over drlvm
Date Fri, 06 Apr 2007 07:01:23 GMT
BUILD FAILED:
	Ant Error Message:
/export/cruise/trunk/cc/projects/classlib/trunk/build.xml:169: The following error occurred
while executing this line: /export/cruise/trunk/cc/projects/classlib/trunk/make/build-test.xml:147:
There were test errors.

Date of build:	04/06/2007 13:20:49
Time to build:	40 minutes 7 seconds
Last changed:	04/06/2007 10:43:22
Last log entry:	Apply patch for HARMONY-3552([classlib][security]java.security.SecureRandom.next(int
bitCount) returns a int which has a longer bit length than required.)

***********************************************************
Execution log (errors/warnings messages):	
Tests FAILED

========================================
Testing class libraries...
========================================
Checking for depends/jars/yoko_M2-20070130/yoko.jar
Checking for depends/jars/yoko_M2-20070130/yoko-core.jar
Checking for depends/jars/yoko_M2-20070130/yoko-rmi-impl.jar
Checking for depends/jars/yoko_M2-20070130/yoko-rmi-spec.jar
Checking for depends/jars/bcel-5.2/bcel-5.2.jar
Checking for depends/jars/xalan-j_2.7.0/xalan.jar
Checking for depends/jars/xerces_2.9.0/xerces.zip
Checking for depends/jars/junit_3.8.2/junit.jar
Checking for depends/jars/bcprov-jdk15-134/bcprov.jar
Checking for depends/jars/icu4j_3.4.4/icu4j_3_4_4.jar
Checking for depends/jars/mx4j_3.0.2/mx4j.zip
Checking for depends/jars/ecj_3.2/ecj_3.2.jar
Checking for depends/jars/jetty/jetty-6.0.0.jar
Checking for depends/jars/jetty/jetty-util-6.0.0.jar
Checking for depends/jars/jetty/servlet-api-2.5-6.0.0.jar
Checking for depends/libs/build/lcms/icc34.h
Checking for depends/libs/build/lcms/lcms.h
Checking for depends/libs/build/png/pngconf.h
Checking for depends/libs/build/png/png.h
Checking for depends/libs/build/jpeg/jconfig.lnx
Checking for depends/libs/build/jpeg/jpeglib.h
Checking for depends/libs/build/jpeg/jmorecfg.h
Checking for depends/libs/build/jpeg/jerror.h
Checking for depends/libs/build/lcms/liblcms.linux.x86
Checking for depends/libs/build/png/libpng.linux.x86
Checking for depends/libs/build/jpeg/libjpeg.linux.x86
hy.test.vm.name = drl
Compiling ACCESSIBILITY classes
Compiling ACCESSIBILITY tests
Since fork is false, ignoring memoryMaximumSize setting
Compiling ANNOTATION classes
Compiling ANNOTATION tests
Since fork is false, ignoring memoryMaximumSize setting
----------
1. WARNING in /export/cruise/trunk/cc/projects/classlib/trunk/modules/annotation/src/test/java/org/apache/harmony/annotation/tests/java/lang/annotation/IncompleteAnnotationExceptionTest.java
 (at line 53)
	clazz, elementName);
	^^^^^
Type safety: The expression of type Class needs unchecked conversion to conform to Class<?
extends Annotation>
----------
1 problem (1 warning)
Compiling APPLET classes
Compiling APPLET tests
Since fork is false, ignoring memoryMaximumSize setting
Compiling ARCHIVE classes
Compiling ARCHIVE tests
Since fork is false, ignoring memoryMaximumSize setting
Compiling AUTH classes
Compiling AUTH tests
Since fork is false, ignoring memoryMaximumSize setting
Compiling AWT classes
Compiling AWT tests
Since fork is false, ignoring memoryMaximumSize setting
Compiling BEANS classes
Compiling support classes for BEANS tests
Compiling internal BEANS tests
Compiling BEANS tests
Since fork is false, ignoring memoryMaximumSize setting
Running internal BEANS tests
Running BEANS tests
Compiling CRYPTO classes
Compiling CRYPTO test support files
Compiling CRYPTO api tests
Since fork is false, ignoring memoryMaximumSize setting
Compiling CRYPTO api injected tests
Since fork is false, ignoring memoryMaximumSize setting
Compiling CRYPTO impl injected tests
Since fork is false, ignoring memoryMaximumSize setting
Compiling CRYPTO impl tests
Since fork is false, ignoring memoryMaximumSize setting
Running CRYPTO api tests
Running CRYPTO api.injected tests
Running CRYPTO impl tests
Running CRYPTO impl injected tests
Compiling ImageIO classes
Compiling ImageIO tests
Since fork is false, ignoring memoryMaximumSize setting
Compiling INSTRUMENT classes
Compiling INSTRUMENT tests
Since fork is false, ignoring memoryMaximumSize setting
Compiling JNDI classes
Compiling JNDI tests
Since fork is false, ignoring memoryMaximumSize setting
Compiling LANG-MANAGEMENT classes
Compiling LANG-MANAGEMENT API tests
Since fork is false, ignoring memoryMaximumSize setting
Compiling LANG-MANAGEMENT Implementation tests
Since fork is false, ignoring memoryMaximumSize setting
Compiling LOGGING classes
Compiling LOGGING tests
Since fork is false, ignoring memoryMaximumSize setting
Compiling LUNI classes
Compiling LUNI JUnit Tests
Since fork is false, ignoring memoryMaximumSize setting
Running LUNI JUnit Tests
java.io.IOException: Stream is closed
	at java.io.BufferedInputStream.read(BufferedInputStream.java:247)
	at java.io.FilterInputStream.read(FilterInputStream.java:137)
	at tests.support.Support_Exec$1.run(Support_Exec.java:177)
	at java.lang.Thread.run(Thread.java:661)
2007-04-06 13:37:07.914::INFO:  Logging to STDERR via org.mortbay.log.StdErrLog
2007-04-06 13:37:08.169::INFO:  jetty-6.0.x
2007-04-06 13:37:08.475::INFO:  Started SocketConnector @ 0.0.0.0:39280
2007-04-06 13:37:47.501::INFO:  jetty-6.0.x
2007-04-06 13:37:47.513::INFO:  Started SocketConnector @ 0.0.0.0:39386
Compiling MATH classes
Compiling MATH tests
Since fork is false, ignoring memoryMaximumSize setting
Compiling MISC classes
Compiling MISC tests
Since fork is false, ignoring memoryMaximumSize setting
Compiling NIO classes
Compiling NIO tests
Since fork is false, ignoring memoryMaximumSize setting
Compiling NIO_CHAR classes
Compiling NIO_CHAR tests
Since fork is false, ignoring memoryMaximumSize setting
Cannot find unmappable byte array for US-ASCII
Cannot find unmappable byte array for gb18030
Cannot find unmappable byte array for ISO-8859-1
Cannot find malform byte array for ISO-8859-1
Cannot find unmappable byte array for UTF-16BE
Cannot find malform byte array for UTF-16BE
Cannot find unmappable byte array for UTF-16
Cannot find malform byte array for UTF-16
Cannot find unmappable byte array for UTF-16LE
Cannot find malform byte array for UTF-16LE
Cannot find unmappable byte array for UTF-8
Compiling PACK200 classes
Compiling PACK200 tests
Since fork is false, ignoring memoryMaximumSize setting
Running PACK200 tests
init: passed
hyerror: passed
hytime: passed
hyfile: passed
Compiling PREFS classes
Compiling PREFS tests
Since fork is false, ignoring memoryMaximumSize setting
Compiling PRINT classes
Compiling Print tests
Since fork is false, ignoring memoryMaximumSize setting
java.net.ConnectException: localhost/127.0.0.1:631 - Connection refused
	at org.apache.harmony.luni.net.PlainSocketImpl.connect(PlainSocketImpl.java:230)
	at org.apache.harmony.luni.net.PlainSocketImpl.connect(PlainSocketImpl.java:510)
	at java.net.Socket.connect(Socket.java:932)
	at org.apache.harmony.luni.internal.net.www.protocol.http.HttpURLConnection.getHTTPConnection(HttpURLConnection.java:635)
	at org.apache.harmony.luni.internal.net.www.protocol.http.HttpURLConnection.connect(HttpURLConnection.java:619)
	at org.apache.harmony.x.print.ipp.IppClient.request(IppClient.java:111)
	at org.apache.harmony.x.print.ipp.IppClient.request(IppClient.java:87)
	at org.apache.harmony.x.print.cups.CUPSPrintServiceProvider.findDefaultPrintService(CUPSPrintServiceProvider.java:471)
	at org.apache.harmony.x.print.cups.CUPSPrintServiceProvider.getDefaultPrintService(CUPSPrintServiceProvider.java:169)
	at javax.print.PrintServiceLookup.lookupDefaultPrintService(PrintServiceLookup.java:139)
	at javax.print.attribute.HashAttributeTest.testAdd2(HashAttributeTest.java:128)
	at java.lang.reflect.VMReflection.invokeMethod(VMReflection.java)
	at java.lang.reflect.Method.invoke(Method.java:381)
	at junit.framework.TestCase.runTest(TestCase.java:154)
	at junit.framework.TestCase.runBare(TestCase.java:127)
	at junit.framework.TestResult$1.protect(TestResult.java:106)
	at junit.framework.TestResult.runProtected(TestResult.java:124)
	at junit.framework.TestResult.run(TestResult.java:109)
	at junit.framework.TestCase.run(TestCase.java:118)
	at junit.framework.TestSuite.runTest(TestSuite.java:208)
	at junit.framework.TestSuite.run(TestSuite.java:203)
	at org.apache.tools.ant.taskdefs.optional.junit.JUnitTestRunner.run(JUnitTestRunner.java:297)
	at org.apache.tools.ant.taskdefs.optional.junit.JUnitTestRunner.launch(JUnitTestRunner.java:672)
	at org.apache.tools.ant.taskdefs.optional.junit.JUnitTestRunner.main(JUnitTestRunner.java:546)
java.net.ConnectException: localhost/127.0.0.1:631 - Connection refused
	at org.apache.harmony.luni.net.PlainSocketImpl.connect(PlainSocketImpl.java:230)
	at org.apache.harmony.luni.net.PlainSocketImpl.connect(PlainSocketImpl.java:510)
	at java.net.Socket.connect(Socket.java:932)
	at org.apache.harmony.luni.internal.net.www.protocol.http.HttpURLConnection.getHTTPConnection(HttpURLConnection.java:635)
	at org.apache.harmony.luni.internal.net.www.protocol.http.HttpURLConnection.connect(HttpURLConnection.java:619)
	at org.apache.harmony.x.print.ipp.IppClient.request(IppClient.java:111)
	at org.apache.harmony.x.print.ipp.IppClient.request(IppClient.java:87)
	at org.apache.harmony.x.print.cups.CUPSPrintServiceProvider.findDefaultPrintService(CUPSPrintServiceProvider.java:471)
	at org.apache.harmony.x.print.cups.CUPSPrintServiceProvider.getDefaultPrintService(CUPSPrintServiceProvider.java:169)
	at javax.print.PrintServiceLookup.lookupDefaultPrintService(PrintServiceLookup.java:139)
	at javax.print.attribute.HashAttributeTest.testEquals(HashAttributeTest.java:284)
	at java.lang.reflect.VMReflection.invokeMethod(VMReflection.java)
	at java.lang.reflect.Method.invoke(Method.java:381)
	at junit.framework.TestCase.runTest(TestCase.java:154)
	at junit.framework.TestCase.runBare(TestCase.java:127)
	at junit.framework.TestResult$1.protect(TestResult.java:106)
	at junit.framework.TestResult.runProtected(TestResult.java:124)
	at junit.framework.TestResult.run(TestResult.java:109)
	at junit.framework.TestCase.run(TestCase.java:118)
	at junit.framework.TestSuite.runTest(TestSuite.java:208)
	at junit.framework.TestSuite.run(TestSuite.java:203)
	at org.apache.tools.ant.taskdefs.optional.junit.JUnitTestRunner.run(JUnitTestRunner.java:297)
	at org.apache.tools.ant.taskdefs.optional.junit.JUnitTestRunner.launch(JUnitTestRunner.java:672)
	at org.apache.tools.ant.taskdefs.optional.junit.JUnitTestRunner.main(JUnitTestRunner.java:546)
java.net.ConnectException: localhost/127.0.0.1:631 - Connection refused
	at org.apache.harmony.luni.net.PlainSocketImpl.connect(PlainSocketImpl.java:230)
	at org.apache.harmony.luni.net.PlainSocketImpl.connect(PlainSocketImpl.java:510)
	at java.net.Socket.connect(Socket.java:932)
	at org.apache.harmony.luni.internal.net.www.protocol.http.HttpURLConnection.getHTTPConnection(HttpURLConnection.java:635)
	at org.apache.harmony.luni.internal.net.www.protocol.http.HttpURLConnection.connect(HttpURLConnection.java:619)
	at org.apache.harmony.x.print.ipp.IppClient.request(IppClient.java:111)
	at org.apache.harmony.x.print.ipp.IppClient.request(IppClient.java:87)
	at org.apache.harmony.x.print.cups.CUPSPrintServiceProvider.findDefaultPrintService(CUPSPrintServiceProvider.java:471)
	at org.apache.harmony.x.print.cups.CUPSPrintServiceProvider.getDefaultPrintService(CUPSPrintServiceProvider.java:169)
	at javax.print.PrintServiceLookup.lookupDefaultPrintService(PrintServiceLookup.java:139)
	at javax.print.attribute.HashAttributeTest.testAdd2(HashAttributeTest.java:128)
	at java.lang.reflect.VMReflection.invokeMethod(VMReflection.java)
	at java.lang.reflect.Method.invoke(Method.java:381)
	at junit.framework.TestCase.runTest(TestCase.java:154)
	at junit.framework.TestCase.runBare(TestCase.java:127)
	at junit.framework.TestResult$1.protect(TestResult.java:106)
	at junit.framework.TestResult.runProtected(TestResult.java:124)
	at junit.framework.TestResult.run(TestResult.java:109)
	at junit.framework.TestCase.run(TestCase.java:118)
	at junit.framework.TestSuite.runTest(TestSuite.java:208)
	at junit.framework.TestSuite.run(TestSuite.java:203)
	at junit.framework.TestSuite.runTest(TestSuite.java:208)
	at junit.framework.TestSuite.run(TestSuite.java:203)
	at org.apache.tools.ant.taskdefs.optional.junit.JUnitTestRunner.run(JUnitTestRunner.java:297)
	at org.apache.tools.ant.taskdefs.optional.junit.JUnitTestRunner.launch(JUnitTestRunner.java:672)
	at org.apache.tools.ant.taskdefs.optional.junit.JUnitTestRunner.main(JUnitTestRunner.java:546)
java.net.ConnectException: localhost/127.0.0.1:631 - Connection refused
	at org.apache.harmony.luni.net.PlainSocketImpl.connect(PlainSocketImpl.java:230)
	at org.apache.harmony.luni.net.PlainSocketImpl.connect(PlainSocketImpl.java:510)
	at java.net.Socket.connect(Socket.java:932)
	at org.apache.harmony.luni.internal.net.www.protocol.http.HttpURLConnection.getHTTPConnection(HttpURLConnection.java:635)
	at org.apache.harmony.luni.internal.net.www.protocol.http.HttpURLConnection.connect(HttpURLConnection.java:619)
	at org.apache.harmony.x.print.ipp.IppClient.request(IppClient.java:111)
	at org.apache.harmony.x.print.ipp.IppClient.request(IppClient.java:87)
	at org.apache.harmony.x.print.cups.CUPSPrintServiceProvider.findDefaultPrintService(CUPSPrintServiceProvider.java:471)
	at org.apache.harmony.x.print.cups.CUPSPrintServiceProvider.getDefaultPrintService(CUPSPrintServiceProvider.java:169)
	at javax.print.PrintServiceLookup.lookupDefaultPrintService(PrintServiceLookup.java:139)
	at javax.print.attribute.HashAttributeTest.testEquals(HashAttributeTest.java:284)
	at java.lang.reflect.VMReflection.invokeMethod(VMReflection.java)
	at java.lang.reflect.Method.invoke(Method.java:381)
	at junit.framework.TestCase.runTest(TestCase.java:154)
	at junit.framework.TestCase.runBare(TestCase.java:127)
	at junit.framework.TestResult$1.protect(TestResult.java:106)
	at junit.framework.TestResult.runProtected(TestResult.java:124)
	at junit.framework.TestResult.run(TestResult.java:109)
	at junit.framework.TestCase.run(TestCase.java:118)
	at junit.framework.TestSuite.runTest(TestSuite.java:208)
	at junit.framework.TestSuite.run(TestSuite.java:203)
	at junit.framework.TestSuite.runTest(TestSuite.java:208)
	at junit.framework.TestSuite.run(TestSuite.java:203)
	at org.apache.tools.ant.taskdefs.optional.junit.JUnitTestRunner.run(JUnitTestRunner.java:297)
	at org.apache.tools.ant.taskdefs.optional.junit.JUnitTestRunner.launch(JUnitTestRunner.java:672)
	at org.apache.tools.ant.taskdefs.optional.junit.JUnitTestRunner.main(JUnitTestRunner.java:546)
Compiling REGEX classes
Compiling REGEX tests
Since fork is false, ignoring memoryMaximumSize setting
Compiling RMI classes
Compiling RMI api tests
Since fork is false, ignoring memoryMaximumSize setting
Running RMI api tests
testDirectSocket_SingleVM starting
Test server started.
Object: MyRemoteObject[UnicastServerRef[endpoint:[[10.125.122.35:40038]](local), ObjID[65536,
UID[42713238:111c5a3e0a6:-8000]]]] created and exported.
Apr 6, 2007 1:45:27 PM org.apache.harmony.rmi.server.RMIReference makeStrong
FINER: main: Strongly referenced RegistryImpl
Registry created.
Object bound in the registry.
Registry located.
Apr 6, 2007 1:45:29 PM org.apache.harmony.rmi.client.ClientConnection sendDGCAck
FINER: main: Sent DGC ack to [localhost:1099] for UID[42713238:111c5a3e0a6:-7ffd]
Lookup object is: Proxy[interf:[org.apache.harmony.rmi.test.MyRemoteInterface, java.rmi.Remote],
RemoteObjectInvocationHandler[UnicastRef[endpoint:[[10.125.122.35:40038]](remote), ObjID[65536,
UID[42713238:111c5a3e0a6:-8000]]]]]
Testing test_String_Void...
Done.
Testing test_Void_String...
Returned: MyRemoteObject.test_Void_String
Done.
Testing test_Int_Void...
Done.
Testing test_Void_Int...
Returned: 987654321
Done.
Testing test_Remote_Void...
Done.
Testing test_Remote_Void with remote object extending another remote object...
Done.
Testing test_Void_Remote...
Apr 6, 2007 1:45:29 PM org.apache.harmony.rmi.client.ClientConnection sendDGCAck
FINER: main: Sent DGC ack to [10.125.122.35:40038] for UID[42713238:111c5a3e0a6:-7fe8]
Returned: Proxy[interf:[org.apache.harmony.rmi.test.MyRemoteInterface2, java.rmi.Remote],
RemoteObjectInvocationHandler[UnicastRef[endpoint:[[10.125.122.35:40046]](remote), ObjID[65539,
UID[42713238:111c5a3e0a6:-7fe9]]]]]
Done.
Testing test_Long_Long...
Returned: 998877665544332211
Done.
Testing test_String_String...
Returned: MyRemoteObject.test_String_String
Done.
Testing test_Remote_Remote...
Apr 6, 2007 1:45:30 PM org.apache.harmony.rmi.client.ClientConnection sendDGCAck
FINER: main: Sent DGC ack to [10.125.122.35:40038] for UID[42713238:111c5a3e0a6:-7fde]
Returned: Proxy[interf:[org.apache.harmony.rmi.test.MyRemoteInterface2, java.rmi.Remote],
RemoteObjectInvocationHandler[UnicastRef[endpoint:[[10.125.122.35:40050]](remote), ObjID[65541,
UID[42713238:111c5a3e0a6:-7fdf]]]]]
Done.
Testing test_RemoteString_Void...
Done.
Testing test_RemoteRemote_Remote...
Apr 6, 2007 1:45:30 PM org.apache.harmony.rmi.client.ClientConnection sendDGCAck
FINER: main: Sent DGC ack to [10.125.122.35:40038] for UID[42713238:111c5a3e0a6:-7fd0]
Returned: Proxy[interf:[org.apache.harmony.rmi.test.MyRemoteInterface2, java.rmi.Remote],
RemoteObjectInvocationHandler[UnicastRef[endpoint:[[10.125.122.35:40057]](remote), ObjID[65545,
UID[42713238:111c5a3e0a6:-7fd1]]]]]
Done.
Testing test_BooleanStringRemote_Void...
Done.
Testing test_Proxy_Void...
Done.
Testing test_Array_Void...
Done.
Testing test_Void_Array...
Done.
Testing test_RemoteArray_Void...
Done.
Testing test_Void_RemoteArray...
Apr 6, 2007 1:45:31 PM org.apache.harmony.rmi.client.ClientConnection sendDGCAck
FINER: main: Sent DGC ack to [10.125.122.35:40038] for UID[42713238:111c5a3e0a6:-7fbd]
Done.
Testing test_Exception...
org.apache.harmony.rmi.test.MyException: MyRemoteObject.test_Exception
Done.
Testing test_Error...
java.rmi.ServerError: Error occurred while remote method invocation; nested exception is:
	java.lang.Error: MyRemoteObject.test_Error
Done.
Testing test_RuntimeException...
java.lang.RuntimeException: MyRemoteObject.text_RuntimeException
Done.
Testing test_RemoteException...
java.rmi.ServerException: RemoteException occurred while remote method invocation; nested
exception is:
	java.rmi.RemoteException: MyRemoteObject.text_RemoteException
Done.
Test server complete.
Test server closing.
Unexporting MyRemoteObject[UnicastServerRef[endpoint:[[10.125.122.35:40038]](local), ObjID[65536,
UID[42713238:111c5a3e0a6:-8000]]]] ...
Done.
Unexporting MyRemoteObject1[UnicastServerRef[endpoint:[[10.125.122.35:40042]](local), ObjID[65537,
UID[42713238:111c5a3e0a6:-7ff4]]]] ...
Done.
Unexporting MyRemoteObject4[UnicastServerRef[endpoint:[[10.125.122.35:40044]](local), ObjID[65538,
UID[42713238:111c5a3e0a6:-7fef]]]] ...
Done.
Unexporting MyRemoteObject1[UnicastServerRef[endpoint:[[10.125.122.35:40048]](local), ObjID[65540,
UID[42713238:111c5a3e0a6:-7fe3]]]] ...
Done.
Unexporting MyRemoteObject1[UnicastServerRef[endpoint:[[10.125.122.35:40051]](local), ObjID[65542,
UID[42713238:111c5a3e0a6:-7fdd]]]] ...
Done.
Unexporting MyRemoteObject1[UnicastServerRef[endpoint:[[10.125.122.35:40053]](local), ObjID[65543,
UID[42713238:111c5a3e0a6:-7fd8]]]] ...
Done.
Unexporting MyRemoteObject3[UnicastServerRef[endpoint:[[10.125.122.35:40054]](local), ObjID[65544,
UID[42713238:111c5a3e0a6:-7fd7]]]] ...
Done.
Unexporting RegistryImpl ...
Done.
Unexporting MyRemoteObject1[UnicastServerRef[endpoint:[[10.125.122.35:40058]](local), ObjID[65546,
UID[42713238:111c5a3e0a6:-7fcf]]]] ...
Done.
Unexporting MyRemoteObject1[UnicastServerRef[endpoint:[[10.125.122.35:40060]](local), ObjID[65547,
UID[42713238:111c5a3e0a6:-7fc4]]]] ...
Done.
Unexporting MyRemoteObject1[UnicastServerRef[endpoint:[[10.125.122.35:40061]](local), ObjID[65548,
UID[42713238:111c5a3e0a6:-7fc3]]]] ...
Done.
Test server exiting.
testDirectHTTP_SingleVM starting
Test server started.
Object: MyRemoteObject[UnicastServerRef[endpoint:[[10.125.122.35:40066]](local), ObjID[65536,
UID[42713238:111c5a40cc4:-8000]]]] created and exported.
Apr 6, 2007 1:45:38 PM org.apache.harmony.rmi.server.RMIReference makeStrong
FINER: main: Strongly referenced RegistryImpl
Registry created.
Object bound in the registry.
Registry located.
Apr 6, 2007 1:45:40 PM org.apache.harmony.rmi.client.ClientConnection sendDGCAck
FINER: main: Sent DGC ack to [localhost:1099] for UID[42713238:111c5a40cc4:-7ffd]
Lookup object is: Proxy[interf:[org.apache.harmony.rmi.test.MyRemoteInterface, java.rmi.Remote],
RemoteObjectInvocationHandler[UnicastRef[endpoint:[[10.125.122.35:40066]](remote), ObjID[65536,
UID[42713238:111c5a40cc4:-8000]]]]]
Testing test_String_Void...
Done.
Testing test_Void_String...
Returned: MyRemoteObject.test_Void_String
Done.
Testing test_Int_Void...
Done.
Testing test_Void_Int...
Returned: 987654321
Done.
Testing test_Remote_Void...
Done.
Testing test_Remote_Void with remote object extending another remote object...
Done.
Testing test_Void_Remote...
Apr 6, 2007 1:45:41 PM org.apache.harmony.rmi.client.ClientConnection sendDGCAck
FINER: main: Sent DGC ack to [10.125.122.35:40066] for UID[42713238:111c5a40cc4:-7fe8]
Returned: Proxy[interf:[org.apache.harmony.rmi.test.MyRemoteInterface2, java.rmi.Remote],
RemoteObjectInvocationHandler[UnicastRef[endpoint:[[10.125.122.35:40074]](remote), ObjID[65539,
UID[42713238:111c5a40cc4:-7fe9]]]]]
Done.
Testing test_Long_Long...
Returned: 998877665544332211
Done.
Testing test_String_String...
Returned: MyRemoteObject.test_String_String
Done.
Testing test_Remote_Remote...
Apr 6, 2007 1:45:41 PM org.apache.harmony.rmi.client.ClientConnection sendDGCAck
FINER: main: Sent DGC ack to [10.125.122.35:40066] for UID[42713238:111c5a40cc4:-7fde]
Returned: Proxy[interf:[org.apache.harmony.rmi.test.MyRemoteInterface2, java.rmi.Remote],
RemoteObjectInvocationHandler[UnicastRef[endpoint:[[10.125.122.35:40078]](remote), ObjID[65541,
UID[42713238:111c5a40cc4:-7fdf]]]]]
Done.
Testing test_RemoteString_Void...
Done.
Testing test_RemoteRemote_Remote...
Apr 6, 2007 1:45:41 PM org.apache.harmony.rmi.client.ClientConnection sendDGCAck
FINER: main: Sent DGC ack to [10.125.122.35:40066] for UID[42713238:111c5a40cc4:-7fd0]
Returned: Proxy[interf:[org.apache.harmony.rmi.test.MyRemoteInterface2, java.rmi.Remote],
RemoteObjectInvocationHandler[UnicastRef[endpoint:[[10.125.122.35:40085]](remote), ObjID[65545,
UID[42713238:111c5a40cc4:-7fd1]]]]]
Done.
Testing test_BooleanStringRemote_Void...
Done.
Testing test_Proxy_Void...
Done.
Testing test_Array_Void...
Done.
Testing test_Void_Array...
Done.
Testing test_RemoteArray_Void...
Done.
Testing test_Void_RemoteArray...
Apr 6, 2007 1:45:42 PM org.apache.harmony.rmi.client.ClientConnection sendDGCAck
FINER: main: Sent DGC ack to [10.125.122.35:40066] for UID[42713238:111c5a40cc4:-7fbd]
Done.
Testing test_Exception...
org.apache.harmony.rmi.test.MyException: MyRemoteObject.test_Exception
Done.
Testing test_Error...
java.rmi.ServerError: Error occurred while remote method invocation; nested exception is:
	java.lang.Error: MyRemoteObject.test_Error
Done.
Testing test_RuntimeException...
java.lang.RuntimeException: MyRemoteObject.text_RuntimeException
Done.
Testing test_RemoteException...
java.rmi.ServerException: RemoteException occurred while remote method invocation; nested
exception is:
	java.rmi.RemoteException: MyRemoteObject.text_RemoteException
Done.
Test server complete.
Test server closing.
Unexporting MyRemoteObject[UnicastServerRef[endpoint:[[10.125.122.35:40066]](local), ObjID[65536,
UID[42713238:111c5a40cc4:-8000]]]] ...
Done.
Unexporting MyRemoteObject1[UnicastServerRef[endpoint:[[10.125.122.35:40070]](local), ObjID[65537,
UID[42713238:111c5a40cc4:-7ff4]]]] ...
Done.
Unexporting MyRemoteObject4[UnicastServerRef[endpoint:[[10.125.122.35:40072]](local), ObjID[65538,
UID[42713238:111c5a40cc4:-7fef]]]] ...
Done.
Unexporting MyRemoteObject1[UnicastServerRef[endpoint:[[10.125.122.35:40076]](local), ObjID[65540,
UID[42713238:111c5a40cc4:-7fe3]]]] ...
Done.
Unexporting MyRemoteObject1[UnicastServerRef[endpoint:[[10.125.122.35:40079]](local), ObjID[65542,
UID[42713238:111c5a40cc4:-7fdd]]]] ...
Done.
Unexporting MyRemoteObject1[UnicastServerRef[endpoint:[[10.125.122.35:40081]](local), ObjID[65543,
UID[42713238:111c5a40cc4:-7fd8]]]] ...
Done.
Unexporting MyRemoteObject3[UnicastServerRef[endpoint:[[10.125.122.35:40082]](local), ObjID[65544,
UID[42713238:111c5a40cc4:-7fd7]]]] ...
Done.
Unexporting RegistryImpl ...
Done.
Unexporting MyRemoteObject1[UnicastServerRef[endpoint:[[10.125.122.35:40086]](local), ObjID[65546,
UID[42713238:111c5a40cc4:-7fcf]]]] ...
Done.
Unexporting MyRemoteObject1[UnicastServerRef[endpoint:[[10.125.122.35:40088]](local), ObjID[65547,
UID[42713238:111c5a40cc4:-7fc4]]]] ...
Done.
Unexporting MyRemoteObject1[UnicastServerRef[endpoint:[[10.125.122.35:40089]](local), ObjID[65548,
UID[42713238:111c5a40cc4:-7fc3]]]] ...
Done.
Test server exiting.
Unexporting MyRemoteObject1[UnicastServerRef[endpoint:[[10.125.122.35:40094]](local), ObjID[65536,
UID[42f1d050:111c5a4320a:-7ff7]]]] ...
Done.
Unexporting MyRemoteObject1[UnicastServerRef[endpoint:[[10.125.122.35:40095]](local), ObjID[65537,
UID[42f1d050:111c5a4320a:-7ff6]]]] ...
Done.
Unexporting MyRemoteObject1[UnicastServerRef[endpoint:[[10.125.122.35:40096]](local), ObjID[65538,
UID[42f1d050:111c5a4320a:-7ff5]]]] ...
Done.
Unexporting MyRemoteObject1[UnicastServerRef[endpoint:[[10.125.122.35:40097]](local), ObjID[65539,
UID[42f1d050:111c5a4320a:-7ff4]]]] ...
Done.
Unexporting MyRemoteObject1[UnicastServerRef[endpoint:[[10.125.122.35:40098]](local), ObjID[65540,
UID[42f1d050:111c5a4320a:-7ff3]]]] ...
Done.
Unexporting MyRemoteObject1[UnicastServerRef[endpoint:[[10.125.122.35:40099]](local), ObjID[65541,
UID[42f1d050:111c5a4320a:-7ff2]]]] ...
Done.
Unexporting MyRemoteObject1[UnicastServerRef[endpoint:[[10.125.122.35:40100]](local), ObjID[65542,
UID[42f1d050:111c5a4320a:-7ff1]]]] ...
Done.
Unexporting MyRemoteObject1[UnicastServerRef[endpoint:[[10.125.122.35:40101]](local), ObjID[65543,
UID[42f1d050:111c5a4320a:-7ff0]]]] ...
Done.
LogStream[tst]:
Compiling SECURITY classes
Compiling SECURITY test support files
Since fork is false, ignoring memoryMaximumSize setting
Compiling SECURITY api tests
Since fork is false, ignoring memoryMaximumSize setting
Compiling SECURITY api injected tests
Since fork is false, ignoring memoryMaximumSize setting
Compiling SECURITY impl injected tests
Since fork is false, ignoring memoryMaximumSize setting
Compiling SECURITY impl tests
Since fork is false, ignoring memoryMaximumSize setting
Running SECURITY api tests
Running SECURITY api.injected tests
Running SECURITY impl tests
Running SECURITY impl injected tests
Compiling SOUND classes
Compiling SOUND tests
Since fork is false, ignoring memoryMaximumSize setting
Compiling SQL classes
Compiling SQL tests
Since fork is false, ignoring memoryMaximumSize setting
Compiling Sun Compat classes
Compiling SUNCOMPAT tests
Compiling TEXT classes
Compiling TEXT tests
Since fork is false, ignoring memoryMaximumSize setting
Compiling TOOLS classes
Compiling Tools tests
Since fork is false, ignoring memoryMaximumSize setting
Compiling X-NET classes
Compiling X-NET test support files
Compiling X-NET api tests
Since fork is false, ignoring memoryMaximumSize setting
Compiling X-NET impl injected tests
Since fork is false, ignoring memoryMaximumSize setting
Compiling X-NET impl tests
Since fork is false, ignoring memoryMaximumSize setting
Running X-NET api tests
Running X-NET impl tests
Running X-NET impl injected tests
The test report is in /export/cruise/trunk/cc/projects/classlib/trunk/build/test_report/html/index.html

***********************************************************
Unit Tests: (16189)
        
error: test_load org.apache.harmony.security.tests.java.security.KeyStore3Test
error: test_store org.apache.harmony.security.tests.java.security.KeyStore3Test
error: test_setKeyEntry_null org.apache.harmony.security.tests.java.security.KeyStore3Test
error: test_setKeyEntry_key_is_null org.apache.harmony.security.tests.java.security.KeyStore3Test
error: test_setKeyEntry_key_is_private org.apache.harmony.security.tests.java.security.KeyStore3Test
error: test_setCertificateEntry_null org.apache.harmony.security.tests.java.security.KeyStore3Test
error: testEntry05 org.apache.harmony.security.tests.java.security.KeyStore_Impl1Test
error: testGetInstance01 org.apache.harmony.security.tests.java.security.KeyStore_Impl2Test
error: testGetInstance02 org.apache.harmony.security.tests.java.security.KeyStore_Impl2Test
error: testGetInstance03 org.apache.harmony.security.tests.java.security.KeyStore_Impl2Test
failure: test_nextJ org.apache.harmony.security.tests.java.security.SecureRandom2Test
Unit Test Error Details:	(11)
                
Test: test_loadClass: org.apache.harmony.security.tests.java.security.KeyStore3Testjava.io.IOException:
LoadSroreParameter is null
	at java.security.KeyStore.load(KeyStore.java:431)
	at org.apache.harmony.security.tests.java.security.KeyStore3Test.test_load(KeyStore3Test.java:77)
	at java.lang.reflect.VMReflection.invokeMethod(VMReflection.java)

Test: test_storeClass: org.apache.harmony.security.tests.java.security.KeyStore3Testjava.io.IOException:
LoadSroreParameter is null
	at java.security.KeyStore.store(KeyStore.java:409)
	at org.apache.harmony.security.tests.java.security.KeyStore3Test.test_store(KeyStore3Test.java:90)
	at java.lang.reflect.VMReflection.invokeMethod(VMReflection.java)

Test: test_setKeyEntry_nullClass: org.apache.harmony.security.tests.java.security.KeyStore3Testjava.lang.NullPointerException:
alias is null
	at java.security.KeyStore.setKeyEntry(KeyStore.java:240)
	at org.apache.harmony.security.tests.java.security.KeyStore3Test.test_setKeyEntry_null(KeyStore3Test.java:96)
	at java.lang.reflect.VMReflection.invokeMethod(VMReflection.java)

Test: test_setKeyEntry_key_is_nullClass: org.apache.harmony.security.tests.java.security.KeyStore3Testjava.security.KeyStoreException:
The key is null
	at java.security.KeyStore.setKeyEntry(KeyStore.java:243)
	at org.apache.harmony.security.tests.java.security.KeyStore3Test.test_setKeyEntry_key_is_null(KeyStore3Test.java:102)
	at java.lang.reflect.VMReflection.invokeMethod(VMReflection.java)

Test: test_setKeyEntry_key_is_privateClass: org.apache.harmony.security.tests.java.security.KeyStore3Testjava.security.KeyStoreException:
Certificate chain is not defined for Private key 
	at java.security.KeyStore.setKeyEntry(KeyStore.java:248)
	at org.apache.harmony.security.tests.java.security.KeyStore3Test.test_setKeyEntry_key_is_private(KeyStore3Test.java:109)
	at java.lang.reflect.VMReflection.invokeMethod(VMReflection.java)

Test: test_setCertificateEntry_nullClass: org.apache.harmony.security.tests.java.security.KeyStore3Testjava.lang.NullPointerException:
alias is null
	at java.security.KeyStore.setCertificateEntry(KeyStore.java:277)
	at org.apache.harmony.security.tests.java.security.KeyStore3Test.test_setCertificateEntry_null(KeyStore3Test.java:139)
	at java.lang.reflect.VMReflection.invokeMethod(VMReflection.java)

Test: testEntry05Class: org.apache.harmony.security.tests.java.security.KeyStore_Impl1Testjava.security.KeyStoreException:
Certificate chain is not defined for Private key 
	at java.security.KeyStore.setKeyEntry(KeyStore.java:248)
	at org.apache.harmony.security.tests.java.security.KeyStore_Impl1Test.testEntry05(KeyStore_Impl1Test.java:752)
	at java.lang.reflect.VMReflection.invokeMethod(VMReflection.java)

Test: testGetInstance01Class: org.apache.harmony.security.tests.java.security.KeyStore_Impl2Testjava.io.IOException:
LoadSroreParameter is null
	at java.security.KeyStore.store(KeyStore.java:409)
	at org.apache.harmony.security.tests.java.security.KeyStore_Impl2Test.checkResult(KeyStore_Impl2Test.java:159)
	at org.apache.harmony.security.tests.java.security.KeyStore_Impl2Test.testGetInstance01(KeyStore_Impl2Test.java:324)
	at java.lang.reflect.VMReflection.invokeMethod(VMReflection.java)

Test: testGetInstance02Class: org.apache.harmony.security.tests.java.security.KeyStore_Impl2Testjava.io.IOException:
LoadSroreParameter is null
	at java.security.KeyStore.store(KeyStore.java:409)
	at org.apache.harmony.security.tests.java.security.KeyStore_Impl2Test.checkResult(KeyStore_Impl2Test.java:159)
	at org.apache.harmony.security.tests.java.security.KeyStore_Impl2Test.testGetInstance02(KeyStore_Impl2Test.java:382)
	at java.lang.reflect.VMReflection.invokeMethod(VMReflection.java)

Test: testGetInstance03Class: org.apache.harmony.security.tests.java.security.KeyStore_Impl2Testjava.io.IOException:
LoadSroreParameter is null
	at java.security.KeyStore.store(KeyStore.java:409)
	at org.apache.harmony.security.tests.java.security.KeyStore_Impl2Test.checkResult(KeyStore_Impl2Test.java:159)
	at org.apache.harmony.security.tests.java.security.KeyStore_Impl2Test.testGetInstance03(KeyStore_Impl2Test.java:428)
	at java.lang.reflect.VMReflection.invokeMethod(VMReflection.java)

Test: test_nextJClass: org.apache.harmony.security.tests.java.security.SecureRandom2Testjunit.framework.AssertionFailedError:
expected:<29> but was:<32>
	at org.apache.harmony.security.tests.java.security.SecureRandom2Test.test_nextJ(SecureRandom2Test.java:182)
	at java.lang.reflect.VMReflection.invokeMethod(VMReflection.java)


***********************************************************
Modifications since last successful build:	(7)
            
modified pyang  /harmony/enhanced/classlib/trunk/modules/security/src/main/java/common/java/security/SecureRandom.java
04/06/2007 10:43:22 Apply patch for HARMONY-3552([classlib][security]java.security.SecureRandom.next(int
bitCount) returns a int which has a longer bit length than required.)
modified pyang  /harmony/enhanced/classlib/trunk/modules/security/src/test/api/java/org/apache/harmony/security/tests/java/security/SecureRandom2Test.java
04/06/2007 10:43:22 Apply patch for HARMONY-3552([classlib][security]java.security.SecureRandom.next(int
bitCount) returns a int which has a longer bit length than required.)
modified pyang  /harmony/enhanced/classlib/trunk/modules/security/src/main/java/common/java/security/KeyStore.java
04/06/2007 10:42:13 Apply patch for HARMONY-3549([classlib][security]KeyStore.load(null) should
not throw exception on the level of KeyStore class.)
modified pyang  /harmony/enhanced/classlib/trunk/modules/security/src/test/impl/java/org/apache/harmony/security/tests/java/security/KeyStore_Impl1Test.java
04/06/2007 10:42:13 Apply patch for HARMONY-3549([classlib][security]KeyStore.load(null) should
not throw exception on the level of KeyStore class.)
modified pyang  /harmony/enhanced/classlib/trunk/modules/security/src/test/impl/java/org/apache/harmony/security/tests/java/security/KeyStore_Impl2Test.java
04/06/2007 10:42:13 Apply patch for HARMONY-3549([classlib][security]KeyStore.load(null) should
not throw exception on the level of KeyStore class.)
modified pyang  /harmony/enhanced/classlib/trunk/modules/security/src/test/api/java/org/apache/harmony/security/tests/java/security/Signature2Test.java
04/06/2007 10:42:13 Apply patch for HARMONY-3549([classlib][security]KeyStore.load(null) should
not throw exception on the level of KeyStore class.)
added pyang  /harmony/enhanced/classlib/trunk/modules/security/src/test/api/java/org/apache/harmony/security/tests/java/security/KeyStore3Test.java
04/06/2007 10:42:13 Apply patch for HARMONY-3549([classlib][security]KeyStore.load(null) should
not throw exception on the level of KeyStore class.)

Mime
View raw message