harmony-alerts mailing list archives

Site index · List index
Message view « Date » · « Thread »
Top « Date » · « Thread »
From nbe...@kc.rr.com
Subject [build-test alert] BUILD FAILED Windows 2000 msvc debug: classlib over ibmvm
Date Mon, 02 Apr 2007 02:38:22 GMT
BUILD FAILED:
	Ant Error Message:
C:\bt-trunk\cc\projects\classlib\trunk\build.xml:167: The following error occurred while executing this line: C:\bt-trunk\cc\projects\classlib\trunk\make\build-test.xml:133: There were test crashes: C:\bt-trunk\cc\projects\classlib\trunk\build\test_report\TEST-java.awt.AccessibleAWTCheckboxMenuItemTest.xml;C:\bt-trunk\cc\projects\classlib\trunk\build\test_report\TEST-javax.swing.AbstractActionRTest.xml;C:\bt-trunk\cc\projects\classlib\trunk\build\test_report\TEST-org.apache.harmony.beans.tests.java.beans.SimpleBeanInfoTest.xml

Date of build:	04/01/2007 20:49:54
Time to build:	40 minutes 10 seconds
Last changed:	03/30/2007 09:24:14
Last log entry:	classlib

***********************************************************
Errors/Warnings:	(343)
            
Test org.apache.harmony.awt.HeadlessTest FAILED
Tests FAILED
Tests FAILED
Tests FAILED

========================================
Testing class libraries...
========================================

Checking for depends/jars/yoko_M2-20070130/yoko.jar
Checking for depends/jars/yoko_M2-20070130/yoko-core.jar
Checking for depends/jars/yoko_M2-20070130/yoko-rmi-impl.jar
Checking for depends/jars/yoko_M2-20070130/yoko-rmi-spec.jar
Checking for depends/jars/bcel-5.2/bcel-5.2.jar
Checking for depends/jars/xalan-j_2.7.0/xalan.jar
Checking for depends/jars/xerces_2.8.0/resolver.jar
Checking for depends/jars/xerces_2.8.0/xercesImpl.jar
Checking for depends/jars/xerces_2.8.0/xml-apis.jar
Checking for depends/jars/junit_3.8.2/junit.jar
Checking for depends/jars/bcprov-jdk15-134/bcprov.jar
Checking for depends/jars/icu4j_3.4.4/icu4j_3_4_4.jar
Checking for depends/jars/mx4j_3.0.2/mx4j.zip
Checking for depends/jars/ecj_3.2/ecj_3.2.jar
Checking for depends/jars/jetty/jetty-6.0.0.jar
Checking for depends/jars/jetty/jetty-util-6.0.0.jar
Checking for depends/jars/jetty/servlet-api-2.5-6.0.0.jar
Checking for depends/libs/windows.x86/msvcr71.dll
Checking for depends/libs/windows.x86/swing_awt_deps_winxp_2006-09-28.tgz
Since fork is false, ignoring memoryMaximumSize setting
Compiling ACCESSIBILITY classes
Compiling ACCESSIBILITY tests
Compiling ANNOTATION classes
Compiling ANNOTATION tests
Compiling APPLET classes
Compiling APPLET tests
Compiling ARCHIVE classes
Compiling ARCHIVE tests
Compiling AUTH classes
Compiling AUTH tests
Compiling AWT classes
Compiling AWT tests
Unhandled exception
Type=Segmentation error vmState=0x00040000
J9Generic_Signal_Number=00000004 ExceptionCode=c0000005 ExceptionAddress=00000000 ContextFlags=0001003f
Handler1=7FE50390 Handler2=7FD074F0 InaccessibleAddress=00000000
EDI=10D4FC70 ESI=00000020 EAX=00000000 EBX=00000000
ECX=0000007F EDX=00000002
EIP=00000000 ESP=10D4FC5C EBP=10D4FC68
Module=C:\bt-trunk\cc\projects\classlib\trunk\deploy\jdk\jre\bin\java.exe
Module_base_address=00000000 Offset_in_DLL=00000000
Target=2_30_20060727_07300_lHdSMR (Windows 2000 5.0 build 2195 Service Pack 4)
CPU=x86 (1 logical CPUs) (0x3ff4c000 RAM)
JavaVMInitArgs.nOptions=12:
    -Dcom.ibm.oti.vm.vmdir=C:\bt-trunk\cc\projects\classlib\trunk\deploy\jdk\jre\bin\default\
    -Dcom.ibm.oti.vm.exe=C:\bt-trunk\cc\projects\classlib\trunk\deploy\jdk\jre\bin\java.exe
    -Dcom.ibm.oti.vm.bootstrap.library.path=C:\bt-trunk\cc\projects\classlib\trunk\deploy\jdk\jre\bin;C:\bt-trunk\cc\projects\classlib\trunk\deploy\jdk\jre\bin\default
    -Xbootclasspath/p:C:\bt-trunk\cc\projects\classlib\trunk\deploy\jdk\jre\bin\default\luni-kernel.jar;C:\bt-trunk\cc\projects\classlib\trunk\deploy\jdk\jre\bin\default\security-kernel.jar
    -DTEST_SRC_DIR=C:\bt-trunk\cc\projects\classlib\trunk\modules\awt\bin\test
    -Xbootclasspath/a:C:\bt-trunk\cc\projects\classlib\trunk\modules\awt\bin\test;C:\bt-trunk\cc\projects\classlib\trunk\modules\awt/../../depends/jars/junit_3.8.2/junit.jar
    -Djava.class.path=C:\bt-trunk\cc\apache-ant-1.6.5\lib\junit.jar;C:\bt-trunk\cc\apache-ant-1.6.5\lib\ant-launcher.jar;C:\bt-trunk\cc\apache-ant-1.6.5\lib\ant.jar;C:\bt-trunk\cc\apache-ant-1.6.5\lib\ant-junit.jar
    -Djava.home=C:\bt-trunk\cc\projects\classlib\trunk\deploy\jdk\jre
    -Djava.library.path=C:\bt-trunk\cc\projects\classlib\trunk\deploy\jdk\jre\bin\;.;C:\bt-trunk\cc\projects\classlib\trunk\deploy\jdk\jre\bin\default;C:\bt-trunk\cc\projects\classlib\trunk\deploy\jdk\jre\bin\;C:\Program Files\Debugging Tools for Windows;C:\Program Files\Microsoft Visual Studio .NET 2003\Common7\IDE;C:\Program Files\Microsoft Visual Studio .NET 2003\VC7\BIN;C:\Program Files\Microsoft Visual Studio .NET 2003\Common7\Tools;C:\Program Files\Microsoft Visual Studio .NET 2003\Common7\Tools\bin\prerelease;C:\Program Files\Microsoft Visual Studio .NET 2003\Common7\Tools\bin;C:\Program Files\Microsoft Visual Studio .NET 2003\SDK\v1.1\bin;C:\WINNT\Microsoft.NET\Framework\v1.1.4322;C:\WINNT\system32;C:\WINNT;C:\WINNT\System32\Wbem;c:\install\bin;c:\install\svn\bin;c:\install\ant\bin
    _org.apache.harmony.vmi.portlib (extra info: 0012FBB8)
    -Xjcl:jclclear_23
    _j2se_j9=136448
Error: Dump failed - could not link MiniDumpWriteDump in DBGHELP.DLL
Thread: AWT-NativeEventThread (priority 5) (daemon) (LOCATION OF ERROR)
 NATIVE   org/apache/harmony/awt/nativebridge/windows/Win32.IsThemeActive()I
 00000018 org/apache/harmony/awt/wtk/windows/WinEventQueue$ThemeMap.<init>(Lorg/apache/harmony/awt/wtk/windows/WinEventQueue;)V
 0000000a org/apache/harmony/awt/wtk/windows/WinEventQueue.<init>(Lorg/apache/harmony/awt/wtk/windows/WinSystemProperties;)V
 00000018 org/apache/harmony/awt/wtk/windows/WinWTK.<init>()V
 NATIVE   java/lang/Class.newInstanceImpl()Ljava/lang/Object;
 00000006 java/lang/Class.newInstance()Ljava/lang/Object;
 00000006 java/awt/Toolkit.createWTK(Ljava/lang/String;)Lorg/apache/harmony/awt/wtk/WTK;
 00000002 java/awt/Toolkit.access$1(Ljava/awt/Toolkit;Ljava/lang/String;)Lorg/apache/harmony/awt/wtk/WTK;
 0000000c java/awt/Toolkit$1.init()Lorg/apache/harmony/awt/wtk/WTK;
 0000000b org/apache/harmony/awt/wtk/NativeEventThread.run()V
Thread: main (priority 5)
 NATIVE   java/lang/Object.wait(JI)V
 00000003 java/lang/Object.wait()V
 0000000e org/apache/harmony/awt/wtk/NativeEventThread.start(Lorg/apache/harmony/awt/wtk/NativeEventThread$Init;)V
 0000007a java/awt/Toolkit.init()V
 00000092 java/awt/Toolkit.<init>()V
 00000033 java/awt/Toolkit.getDefaultToolkit()Ljava/awt/Toolkit;
 0000000a java/awt/MenuComponent.<init>()V
 00000001 java/awt/MenuItem.<init>(Ljava/lang/String;Ljava/awt/MenuShortcut;)V
 00000004 java/awt/MenuItem.<init>()V
 00000001 java/awt/CheckboxMenuItem.<init>()V
 00000009 java/awt/AccessibleAWTCheckboxMenuItemTest.setUp()V
 00000003 junit/framework/TestCase.runBare()V
 00000004 junit/framework/TestResult$1.protect()V
 00000003 junit/framework/TestResult.runProtected(Ljunit/framework/Test;Ljunit/framework/Protectable;)V
 00000012 junit/framework/TestResult.run(Ljunit/framework/TestCase;)V
 00000002 junit/framework/TestCase.run(Ljunit/framework/TestResult;)V
 00000004 junit/framework/TestSuite.runTest(Ljunit/framework/Test;Ljunit/framework/TestResult;)V
 00000025 junit/framework/TestSuite.run(Ljunit/framework/TestResult;)V
 000001a2 org/apache/tools/ant/taskdefs/optional/junit/JUnitTestRunner.run()V
 00000023 org/apache/tools/ant/taskdefs/optional/junit/JUnitTestRunner.launch(Lorg/apache/tools/ant/taskdefs/optional/junit/JUnitTest;ZZZZLjava/util/Properties;)I
 000001b9 org/apache/tools/ant/taskdefs/optional/junit/JUnitTestRunner.main([Ljava/lang/String;)V
Thread: JIT Compilation Thread (priority 10) (daemon)
Thread: Finalizer thread (priority 5) (daemon)
Thread: AWT-DataTransferThread (priority 5) (daemon)
 NATIVE   org/apache/harmony/awt/nativebridge/windows/Win32.GetMessageW(JJII)I
 00000016 org/apache/harmony/awt/nativebridge/windows/Win32.GetMessageW(Lorg/apache/harmony/awt/nativebridge/windows/Win32$MSG;JII)I
 0000001a org/apache/harmony/awt/datatransfer/windows/WinDTK.runEventLoop()V
 00000025 org/apache/harmony/awt/datatransfer/DataTransferThread.run()V
Compiling BEANS classes
Compiling support classes for BEANS tests
Compiling internal BEANS tests
Compiling BEANS tests
Running internal BEANS tests
Running BEANS tests
Unhandled exception
Type=Segmentation error vmState=0x00040000
J9Generic_Signal_Number=00000004 ExceptionCode=c0000005 ExceptionAddress=00000000 ContextFlags=0001003f
Handler1=7FE50390 Handler2=7FD074F0 InaccessibleAddress=00000000
EDI=0140FC70 ESI=00000020 EAX=00000000 EBX=00000000
ECX=0000007F EDX=00000002
EIP=00000000 ESP=0140FC5C EBP=0140FC68
Module=C:\bt-trunk\cc\projects\classlib\trunk\deploy\jdk\jre\bin\java.exe
Module_base_address=00000000 Offset_in_DLL=00000000
Target=2_30_20060727_07300_lHdSMR (Windows 2000 5.0 build 2195 Service Pack 4)
CPU=x86 (1 logical CPUs) (0x3ff4c000 RAM)
JavaVMInitArgs.nOptions=10:
    -Dcom.ibm.oti.vm.vmdir=C:\bt-trunk\cc\projects\classlib\trunk\deploy\jdk\jre\bin\default\
    -Dcom.ibm.oti.vm.exe=C:\bt-trunk\cc\projects\classlib\trunk\deploy\jdk\jre\bin\java.exe
    -Dcom.ibm.oti.vm.bootstrap.library.path=C:\bt-trunk\cc\projects\classlib\trunk\deploy\jdk\jre\bin;C:\bt-trunk\cc\projects\classlib\trunk\deploy\jdk\jre\bin\default
    -Xbootclasspath/p:C:\bt-trunk\cc\projects\classlib\trunk\deploy\jdk\jre\bin\default\luni-kernel.jar;C:\bt-trunk\cc\projects\classlib\trunk\deploy\jdk\jre\bin\default\security-kernel.jar
    -Djava.class.path=C:\bt-trunk\cc\projects\classlib\trunk\modules\beans\bin\test;C:\bt-trunk\cc\projects\classlib\trunk\modules\beans\bin\test_support;C:\bt-trunk\cc\projects\classlib\trunk\modules\beans\src\test\resources;C:\bt-trunk\cc\projects\classlib\trunk\deploy\build\test\support.jar;C:\bt-trunk\cc\apache-ant-1.6.5\lib\junit.jar;C:\bt-trunk\cc\apache-ant-1.6.5\lib\ant-launcher.jar;C:\bt-trunk\cc\apache-ant-1.6.5\lib\ant.jar;C:\bt-trunk\cc\apache-ant-1.6.5\lib\ant-junit.jar
    -Djava.home=C:\bt-trunk\cc\projects\classlib\trunk\deploy\jdk\jre
    -Djava.library.path=C:\bt-trunk\cc\projects\classlib\trunk\deploy\jdk\jre\bin\;.;C:\bt-trunk\cc\projects\classlib\trunk\deploy\jdk\jre\bin\default;C:\bt-trunk\cc\projects\classlib\trunk\deploy\jdk\jre\bin\;C:\Program Files\Debugging Tools for Windows;C:\Program Files\Microsoft Visual Studio .NET 2003\Common7\IDE;C:\Program Files\Microsoft Visual Studio .NET 2003\VC7\BIN;C:\Program Files\Microsoft Visual Studio .NET 2003\Common7\Tools;C:\Program Files\Microsoft Visual Studio .NET 2003\Common7\Tools\bin\prerelease;C:\Program Files\Microsoft Visual Studio .NET 2003\Common7\Tools\bin;C:\Program Files\Microsoft Visual Studio .NET 2003\SDK\v1.1\bin;C:\WINNT\Microsoft.NET\Framework\v1.1.4322;C:\WINNT\system32;C:\WINNT;C:\WINNT\System32\Wbem;c:\install\bin;c:\install\svn\bin;c:\install\ant\bin
    _org.apache.harmony.vmi.portlib (extra info: 0012FBB8)
    -Xjcl:jclclear_23
    _j2se_j9=136448
Error: Dump failed - could not link MiniDumpWriteDump in DBGHELP.DLL
Thread: AWT-NativeEventThread (priority 5) (daemon) (LOCATION OF ERROR)
 NATIVE   org/apache/harmony/awt/nativebridge/windows/Win32.IsThemeActive()I
 00000018 org/apache/harmony/awt/wtk/windows/WinEventQueue$ThemeMap.<init>(Lorg/apache/harmony/awt/wtk/windows/WinEventQueue;)V
 0000000a org/apache/harmony/awt/wtk/windows/WinEventQueue.<init>(Lorg/apache/harmony/awt/wtk/windows/WinSystemProperties;)V
 00000018 org/apache/harmony/awt/wtk/windows/WinWTK.<init>()V
 NATIVE   java/lang/Class.newInstanceImpl()Ljava/lang/Object;
 00000006 java/lang/Class.newInstance()Ljava/lang/Object;
 00000006 java/awt/Toolkit.createWTK(Ljava/lang/String;)Lorg/apache/harmony/awt/wtk/WTK;
 00000002 java/awt/Toolkit.access$1(Ljava/awt/Toolkit;Ljava/lang/String;)Lorg/apache/harmony/awt/wtk/WTK;
 0000000c java/awt/Toolkit$1.init()Lorg/apache/harmony/awt/wtk/WTK;
 0000000b org/apache/harmony/awt/wtk/NativeEventThread.run()V
Thread: main (priority 5)
 NATIVE   java/lang/Object.wait(JI)V
 00000003 java/lang/Object.wait()V
 0000000e org/apache/harmony/awt/wtk/NativeEventThread.start(Lorg/apache/harmony/awt/wtk/NativeEventThread$Init;)V
 0000007a java/awt/Toolkit.init()V
 00000092 java/awt/Toolkit.<init>()V
 00000033 java/awt/Toolkit.getDefaultToolkit()Ljava/awt/Toolkit;
 0000000d java/beans/SimpleBeanInfo.loadImage(Ljava/lang/String;)Ljava/awt/Image;
 0000000b org/apache/harmony/beans/tests/java/beans/SimpleBeanInfoTest.testLoadImage()V
 00000004 java/lang/reflect/AccessibleObject.invokeV(Ljava/lang/Object;[Ljava/lang/Object;)V
 0000043a java/lang/reflect/Method.invoke(Ljava/lang/Object;[Ljava/lang/Object;)Ljava/lang/Object;  (@31E1DBD6)
 00000060 junit/framework/TestCase.runTest()V
 00000005 junit/framework/TestCase.runBare()V
 00000004 junit/framework/TestResult$1.protect()V
 00000003 junit/framework/TestResult.runProtected(Ljunit/framework/Test;Ljunit/framework/Protectable;)V
 00000011 junit/framework/TestResult.run(Ljunit/framework/TestCase;)V
 00000002 junit/framework/TestCase.run(Ljunit/framework/TestResult;)V
 00000004 junit/framework/TestSuite.runTest(Ljunit/framework/Test;Ljunit/framework/TestResult;)V
 0000001f junit/framework/TestSuite.run(Ljunit/framework/TestResult;)V
 000001a2 org/apache/tools/ant/taskdefs/optional/junit/JUnitTestRunner.run()V
 00000023 org/apache/tools/ant/taskdefs/optional/junit/JUnitTestRunner.launch(Lorg/apache/tools/ant/taskdefs/optional/junit/JUnitTest;ZZZZLjava/util/Properties;)I
 000001b9 org/apache/tools/ant/taskdefs/optional/junit/JUnitTestRunner.main([Ljava/lang/String;)V
Thread: JIT Compilation Thread (priority 10) (daemon)
Thread: Finalizer thread (priority 5) (daemon)
Thread: AWT-DataTransferThread (priority 5) (daemon)
 NATIVE   org/apache/harmony/awt/nativebridge/windows/Win32.GetMessageW(JJII)I
 00000016 org/apache/harmony/awt/nativebridge/windows/Win32.GetMessageW(Lorg/apache/harmony/awt/nativebridge/windows/Win32$MSG;JII)I
 0000001a org/apache/harmony/awt/datatransfer/windows/WinDTK.runEventLoop()V
 00000025 org/apache/harmony/awt/datatransfer/DataTransferThread.run()V
Compiling CRYPTO classes
Compiling CRYPTO test support files
Since fork is false, ignoring memoryMaximumSize setting
Compiling CRYPTO api tests
Compiling CRYPTO api injected tests
Compiling CRYPTO impl injected tests
Compiling CRYPTO impl tests
Running CRYPTO api tests
Running CRYPTO api.injected tests
Running CRYPTO impl tests
Running CRYPTO impl injected tests
Compiling ImageIO classes
Compiling ImageIO tests
Compiling INSTRUMENT classes
Compiling INSTRUMENT tests
Compiling JNDI classes
Compiling JNDI tests
Compiling LANG-MANAGEMENT classes
Compiling LANG-MANAGEMENT API tests
Compiling LANG-MANAGEMENT Implementation tests
Compiling LOGGING classes
Compiling LOGGING tests
Compiling LUNI classes
Compiling LUNI JUnit Tests
Running LUNI JUnit Tests
Compiling MATH classes
Compiling MATH tests
Compiling MISC classes
Compiling MISC tests
Compiling NIO classes
Compiling NIO tests
Compiling NIO_CHAR classes
Compiling NIO_CHAR tests
Cannot find unmappable byte array for US-ASCII
Cannot find unmappable byte array for gb18030
Cannot find unmappable byte array for ISO-8859-1
Cannot find malform byte array for ISO-8859-1
Cannot find unmappable byte array for UTF-16BE
Cannot find malform byte array for UTF-16BE
Cannot find unmappable byte array for UTF-16LE
Cannot find malform byte array for UTF-16LE
Cannot find unmappable byte array for UTF-8
Compiling PACK200 classes
Compiling PACK200 tests
Running PACK200 tests
Compiling PREFS classes
Compiling PREFS tests
Compiling PRINT classes
Compiling Print tests
Compiling REGEX classes
Compiling REGEX tests
Compiling RMI classes
Compiling RMI api tests
Running RMI api tests
Unexporting MyRemoteObject1[UnicastServerRef[endpoint:[[192.168.1.150:3126]](local), ObjID[65536, UID[4b304b30:111b0162773:-7ff7]]]] ...
Done.
Unexporting MyRemoteObject1[UnicastServerRef[endpoint:[[192.168.1.150:3127]](local), ObjID[65537, UID[4b304b30:111b0162773:-7ff6]]]] ...
Done.
Unexporting MyRemoteObject1[UnicastServerRef[endpoint:[[192.168.1.150:3128]](local), ObjID[65538, UID[4b304b30:111b0162773:-7ff5]]]] ...
Done.
Unexporting MyRemoteObject1[UnicastServerRef[endpoint:[[192.168.1.150:3129]](local), ObjID[65539, UID[4b304b30:111b0162773:-7ff4]]]] ...
Done.
Unexporting MyRemoteObject1[UnicastServerRef[endpoint:[[192.168.1.150:3130]](local), ObjID[65540, UID[4b304b30:111b0162773:-7ff3]]]] ...
Done.
Unexporting MyRemoteObject1[UnicastServerRef[endpoint:[[192.168.1.150:3131]](local), ObjID[65541, UID[4b304b30:111b0162773:-7ff2]]]] ...
Done.
Unexporting MyRemoteObject1[UnicastServerRef[endpoint:[[192.168.1.150:3132]](local), ObjID[65542, UID[4b304b30:111b0162773:-7ff1]]]] ...
Done.
Unexporting MyRemoteObject1[UnicastServerRef[endpoint:[[192.168.1.150:3133]](local), ObjID[65543, UID[4b304b30:111b0162773:-7ff0]]]] ...
Done.
LogStream[tst]:
Compiling SECURITY classes
Compiling SECURITY test support files
Compiling SECURITY api tests
Compiling SECURITY api injected tests
Compiling SECURITY impl injected tests
Compiling SECURITY impl tests
Running SECURITY api tests
Running SECURITY api.injected tests
Running SECURITY impl tests
Running SECURITY impl injected tests
Compiling SOUND classes
Compiling SOUND tests
Compiling SQL classes
Compiling SQL tests
Compiling Sun Compat classes
Compiling SUNCOMPAT tests
Compiling SWING classes
Compiling SWING tests
Unhandled exception
Type=Segmentation error vmState=0x00040000
J9Generic_Signal_Number=00000004 ExceptionCode=c0000005 ExceptionAddress=00000000 ContextFlags=0001003f
Handler1=7FE50390 Handler2=7FD074F0 InaccessibleAddress=00000000
EDI=00EBFC70 ESI=00000020 EAX=00000000 EBX=00000000
ECX=0000007F EDX=00000002
EIP=00000000 ESP=00EBFC5C EBP=00EBFC68
Module=C:\bt-trunk\cc\projects\classlib\trunk\deploy\jdk\jre\bin\java.exe
Module_base_address=00000000 Offset_in_DLL=00000000
Target=2_30_20060727_07300_lHdSMR (Windows 2000 5.0 build 2195 Service Pack 4)
CPU=x86 (1 logical CPUs) (0x3ff4c000 RAM)
JavaVMInitArgs.nOptions=11:
    -Dcom.ibm.oti.vm.vmdir=C:\bt-trunk\cc\projects\classlib\trunk\deploy\jdk\jre\bin\default\
    -Dcom.ibm.oti.vm.exe=C:\bt-trunk\cc\projects\classlib\trunk\deploy\jdk\jre\bin\java.exe
    -Dcom.ibm.oti.vm.bootstrap.library.path=C:\bt-trunk\cc\projects\classlib\trunk\deploy\jdk\jre\bin;C:\bt-trunk\cc\projects\classlib\trunk\deploy\jdk\jre\bin\default
    -Xbootclasspath/p:C:\bt-trunk\cc\projects\classlib\trunk\deploy\jdk\jre\bin\default\luni-kernel.jar;C:\bt-trunk\cc\projects\classlib\trunk\deploy\jdk\jre\bin\default\security-kernel.jar
    -Xbootclasspath/a:C:\bt-trunk\cc\projects\classlib\trunk\modules\swing\bin\test;../../depends/jars/junit_3.8.2/junit.jar;C:\bt-trunk\cc\projects\classlib\trunk\deploy/build/test/support.jar
    -Djava.class.path=C:\bt-trunk\cc\apache-ant-1.6.5\lib\junit.jar;C:\bt-trunk\cc\apache-ant-1.6.5\lib\ant-launcher.jar;C:\bt-trunk\cc\apache-ant-1.6.5\lib\ant.jar;C:\bt-trunk\cc\apache-ant-1.6.5\lib\ant-junit.jar
    -Djava.home=C:\bt-trunk\cc\projects\classlib\trunk\deploy\jdk\jre
    -Djava.library.path=C:\bt-trunk\cc\projects\classlib\trunk\deploy\jdk\jre\bin\;.;C:\bt-trunk\cc\projects\classlib\trunk\deploy\jdk\jre\bin\default;C:\bt-trunk\cc\projects\classlib\trunk\deploy\jdk\jre\bin\;C:\Program Files\Debugging Tools for Windows;C:\Program Files\Microsoft Visual Studio .NET 2003\Common7\IDE;C:\Program Files\Microsoft Visual Studio .NET 2003\VC7\BIN;C:\Program Files\Microsoft Visual Studio .NET 2003\Common7\Tools;C:\Program Files\Microsoft Visual Studio .NET 2003\Common7\Tools\bin\prerelease;C:\Program Files\Microsoft Visual Studio .NET 2003\Common7\Tools\bin;C:\Program Files\Microsoft Visual Studio .NET 2003\SDK\v1.1\bin;C:\WINNT\Microsoft.NET\Framework\v1.1.4322;C:\WINNT\system32;C:\WINNT;C:\WINNT\System32\Wbem;c:\install\bin;c:\install\svn\bin;c:\install\ant\bin
    _org.apache.harmony.vmi.portlib (extra info: 0012FBB8)
    -Xjcl:jclclear_23
    _j2se_j9=136448
Error: Dump failed - could not link MiniDumpWriteDump in DBGHELP.DLL
Thread: AWT-NativeEventThread (priority 5) (daemon) (LOCATION OF ERROR)
 NATIVE   org/apache/harmony/awt/nativebridge/windows/Win32.IsThemeActive()I
 00000018 org/apache/harmony/awt/wtk/windows/WinEventQueue$ThemeMap.<init>(Lorg/apache/harmony/awt/wtk/windows/WinEventQueue;)V
 0000000a org/apache/harmony/awt/wtk/windows/WinEventQueue.<init>(Lorg/apache/harmony/awt/wtk/windows/WinSystemProperties;)V
 00000018 org/apache/harmony/awt/wtk/windows/WinWTK.<init>()V
 NATIVE   java/lang/Class.newInstanceImpl()Ljava/lang/Object;
 00000006 java/lang/Class.newInstance()Ljava/lang/Object;
 00000006 java/awt/Toolkit.createWTK(Ljava/lang/String;)Lorg/apache/harmony/awt/wtk/WTK;
 00000002 java/awt/Toolkit.access$1(Ljava/awt/Toolkit;Ljava/lang/String;)Lorg/apache/harmony/awt/wtk/WTK;
 0000000c java/awt/Toolkit$1.init()Lorg/apache/harmony/awt/wtk/WTK;
 0000000b org/apache/harmony/awt/wtk/NativeEventThread.run()V
Thread: main (priority 5)
 NATIVE   java/lang/Object.wait(JI)V
 00000003 java/lang/Object.wait(J)V
 00000063 java/lang/Thread.join(JI)V
 00000003 java/lang/Thread.join(J)V
 0000001e javax/swing/BasicSwingTestCase.runBare()V
 00000004 junit/framework/TestResult$1.protect()V
 00000003 junit/framework/TestResult.runProtected(Ljunit/framework/Test;Ljunit/framework/Protectable;)V
 00000012 junit/framework/TestResult.run(Ljunit/framework/TestCase;)V
 00000002 junit/framework/TestCase.run(Ljunit/framework/TestResult;)V
 00000004 junit/framework/TestSuite.runTest(Ljunit/framework/Test;Ljunit/framework/TestResult;)V
 00000025 junit/framework/TestSuite.run(Ljunit/framework/TestResult;)V
 000001a2 org/apache/tools/ant/taskdefs/optional/junit/JUnitTestRunner.run()V
 00000023 org/apache/tools/ant/taskdefs/optional/junit/JUnitTestRunner.launch(Lorg/apache/tools/ant/taskdefs/optional/junit/JUnitTest;ZZZZLjava/util/Properties;)I
 000001b9 org/apache/tools/ant/taskdefs/optional/junit/JUnitTestRunner.main([Ljava/lang/String;)V
Thread: JIT Compilation Thread (priority 10) (daemon)
Thread: Thread-0 (priority 5)
 NATIVE   java/lang/Object.wait(JI)V
 00000003 java/lang/Object.wait()V
 0000000e org/apache/harmony/awt/wtk/NativeEventThread.start(Lorg/apache/harmony/awt/wtk/NativeEventThread$Init;)V
 0000007a java/awt/Toolkit.init()V
 00000092 java/awt/Toolkit.<init>()V
 00000033 java/awt/Toolkit.getDefaultToolkit()Ljava/awt/Toolkit;
 0000000e java/awt/EventQueue.invokeAndWait(Ljava/lang/Runnable;)V
 0000000e javax/swing/SwingTestCase.runBareImpl()Ljava/lang/Throwable;
 00000009 javax/swing/BasicSwingTestCase$1.run()V
 0000000d java/lang/Thread.run()V
Thread: Finalizer thread (priority 5) (daemon)
Thread: AWT-DataTransferThread (priority 5) (daemon)
 NATIVE   org/apache/harmony/awt/nativebridge/windows/Win32.GetMessageW(JJII)I
 00000016 org/apache/harmony/awt/nativebridge/windows/Win32.GetMessageW(Lorg/apache/harmony/awt/nativebridge/windows/Win32$MSG;JII)I
 0000001a org/apache/harmony/awt/datatransfer/windows/WinDTK.runEventLoop()V
 00000025 org/apache/harmony/awt/datatransfer/DataTransferThread.run()V
Compiling TEXT classes
Compiling TEXT tests
Compiling TOOLS classes
Compiling Tools tests
Compiling X-NET classes
Compiling X-NET test support files
Since fork is false, ignoring memoryMaximumSize setting
Compiling X-NET api tests
Compiling X-NET impl injected tests
Compiling X-NET impl tests
Running X-NET api tests
Running X-NET impl tests
Running X-NET impl injected tests
The test report is in C:\bt-trunk\cc\projects\classlib\trunk\build\test_report\html\index.html

***********************************************************
Unit Tests: (14371)
        
error: java.awt.AccessibleAWTCheckboxMenuItemTest vmcrash.CrashedTests
error: javax.swing.AbstractActionRTest vmcrash.CrashedTests
error: org.apache.harmony.beans.tests.java.beans.SimpleBeanInfoTest vmcrash.CrashedTests
error: testBufferedImage org.apache.harmony.awt.HeadlessTest
failure: test_getI tests.api.java.util.GregorianCalendarTest
Unit Test Error Details:	(5)
                
Test: java.awt.AccessibleAWTCheckboxMenuItemTestClass: vmcrash.CrashedTests
Test: javax.swing.AbstractActionRTestClass: vmcrash.CrashedTests
Test: org.apache.harmony.beans.tests.java.beans.SimpleBeanInfoTestClass: vmcrash.CrashedTests
Test: testBufferedImageClass: org.apache.harmony.awt.HeadlessTestjava.lang.UnsatisfiedLinkError: gl (JVMPORT015E Unable to resolve DLL references - a prerequisite DLL may be missing)
	at java.lang.ClassLoader.loadLibraryWithPath(ClassLoader.java:113)
	at java.lang.ClassLoader.loadLibraryWithClassLoader(ClassLoader.java:977)
	at java.lang.System.loadLibrary(System.java:758)
	at org.apache.harmony.awt.gl.Surface.<clinit>(Surface.java:84)
	at java.lang.J9VMInternals.initializeImpl(Native Method)
	at java.lang.J9VMInternals.initialize(J9VMInternals.java:177)
	at java.lang.J9VMInternals.initialize(J9VMInternals.java:144)
	at java.awt.image.BufferedImage.createImageSurface(BufferedImage.java:675)
	at java.awt.image.BufferedImage.<init>(BufferedImage.java:356)
	at org.apache.harmony.awt.HeadlessTest.testBufferedImage(HeadlessTest.java:58)
	at java.lang.reflect.AccessibleObject.invokeV(AccessibleObject.java:25)

Test: test_getIClass: tests.api.java.util.GregorianCalendarTestjunit.framework.AssertionFailedError: expected:<346> but was:<345>
	at tests.api.java.util.GregorianCalendarTest.test_getI(GregorianCalendarTest.java:664)
	at java.lang.reflect.AccessibleObject.invokeV(AccessibleObject.java:25)


***********************************************************
Modifications since last successful build:	(769)
            
add cc-classlib log20070330092414Lbuild.91 03/30/2007 09:24:14classlib
modified ayza  /harmony/enhanced/classlib/trunk/modules/awt/src/test/api/java/common/java/awt/Tools.java 03/30/2007 09:17:15 Path should be separated by '/'. This fix should enable some AWT tests on Windows that become broken after my commit at r524038. Related to HARMONY-1813.
add cc-classlib log20070330062157Lbuild.90 03/30/2007 06:21:57classlib
added ayza  /harmony/enhanced/classlib/trunk/modules/awt/src/test/api/resources/shapes 03/30/2007 05:52:16 Humble try to commit reworked patch for HARMONY-1813 ([classlib][awt][test] java.awt test resources are located in wrong place)
added ayza  /harmony/enhanced/classlib/trunk/modules/awt/src/test/api/resources/shapes/java/awt/geom/arc(50,50,400,400,-150,270,OPEN)_flat(30).ico 03/30/2007 05:52:16 Humble try to commit reworked patch for HARMONY-1813 ([classlib][awt][test] java.awt test resources are located in wrong place)
added ayza  /harmony/enhanced/classlib/trunk/modules/awt/src/test/api/resources/shapes/java/awt/geom/arc(50,50,400,200,-200,-359,PIE).ico 03/30/2007 05:52:16 Humble try to commit reworked patch for HARMONY-1813 ([classlib][awt][test] java.awt test resources are located in wrong place)
added ayza  /harmony/enhanced/classlib/trunk/modules/awt/src/test/api/resources/serialization/java/awt/java.awt.Rectangle[x=0,y=0,width=0,height=0].ser 03/30/2007 05:52:16 Humble try to commit reworked patch for HARMONY-1813 ([classlib][awt][test] java.awt test resources are located in wrong place)
added ayza  /harmony/enhanced/classlib/trunk/modules/awt/src/test/api/resources/serialization/java/awt/java.awt.Rectangle[x=0,y=0,width=1,height=2].ser 03/30/2007 05:52:16 Humble try to commit reworked patch for HARMONY-1813 ([classlib][awt][test] java.awt test resources are located in wrong place)
added ayza  /harmony/enhanced/classlib/trunk/modules/awt/src/test/api/resources/shapes/org/apache/harmony/awt/gl/rect.rect 03/30/2007 05:52:16 Humble try to commit reworked patch for HARMONY-1813 ([classlib][awt][test] java.awt test resources are located in wrong place)
modified ayza  /harmony/enhanced/classlib/trunk/modules/awt/src/test/api/java/common/org/apache/harmony/awt/gl/MultiRectAreaTestCase.java 03/30/2007 05:52:16 Humble try to commit reworked patch for HARMONY-1813 ([classlib][awt][test] java.awt test resources are located in wrong place)
added ayza  /harmony/enhanced/classlib/trunk/modules/awt/src/test/api/resources/shapes/java/awt/geom/cubic(50,50,100,150,250,100,50,300).shape 03/30/2007 05:52:16 Humble try to commit reworked patch for HARMONY-1813 ([classlib][awt][test] java.awt test resources are located in wrong place)
deleted ayza  /harmony/enhanced/classlib/trunk/modules/awt/src/test/api/java/common/java/java 03/30/2007 05:52:16 Humble try to commit reworked patch for HARMONY-1813 ([classlib][awt][test] java.awt test resources are located in wrong place)
deleted ayza  /harmony/enhanced/classlib/trunk/modules/awt/src/test/api/java/common/org/apache/harmony/awt/gl/resources/double.rect 03/30/2007 05:52:16 Humble try to commit reworked patch for HARMONY-1813 ([classlib][awt][test] java.awt test resources are located in wrong place)
added ayza  /harmony/enhanced/classlib/trunk/modules/awt/src/test/api/resources/serialization/java/awt/java.awt.Point[x=0,y=0].ser 03/30/2007 05:52:16 Humble try to commit reworked patch for HARMONY-1813 ([classlib][awt][test] java.awt test resources are located in wrong place)
added ayza  /harmony/enhanced/classlib/trunk/modules/awt/src/test/api/resources/shapes/java 03/30/2007 05:52:16 Humble try to commit reworked patch for HARMONY-1813 ([classlib][awt][test] java.awt test resources are located in wrong place)
added ayza  /harmony/enhanced/classlib/trunk/modules/awt/src/test/api/resources/shapes/java/awt/geom/arc(50,50,400,200,-400,-710,OPEN).ico 03/30/2007 05:52:16 Humble try to commit reworked patch for HARMONY-1813 ([classlib][awt][test] java.awt test resources are located in wrong place)
modified ayza  /harmony/enhanced/classlib/trunk/modules/awt/src/test/api/java/common/java/awt/geom/Ellipse2DTest.java 03/30/2007 05:52:16 Humble try to commit reworked patch for HARMONY-1813 ([classlib][awt][test] java.awt test resources are located in wrong place)
added ayza  /harmony/enhanced/classlib/trunk/modules/awt/src/test/api/resources/shapes/java/awt/geom/cubic(150,250,50,250,250,50,250,200).ico 03/30/2007 05:52:16 Humble try to commit reworked patch for HARMONY-1813 ([classlib][awt][test] java.awt test resources are located in wrong place)
added ayza  /harmony/enhanced/classlib/trunk/modules/awt/src/test/api/resources/shapes/org/apache/harmony 03/30/2007 05:52:16 Humble try to commit reworked patch for HARMONY-1813 ([classlib][awt][test] java.awt test resources are located in wrong place)
added ayza  /harmony/enhanced/classlib/trunk/modules/awt/src/test/api/resources/shapes/org 03/30/2007 05:52:16 Humble try to commit reworked patch for HARMONY-1813 ([classlib][awt][test] java.awt test resources are located in wrong place)
added ayza  /harmony/enhanced/classlib/trunk/modules/awt/src/test/api/resources/shapes/java/awt/geom/cubic(50,50,100,150,250,100,50,300).ico 03/30/2007 05:52:16 Humble try to commit reworked patch for HARMONY-1813 ([classlib][awt][test] java.awt test resources are located in wrong place)
modified ayza  /harmony/enhanced/classlib/trunk/modules/awt/src/test/api/java/common/java/awt/geom/Rectangle2DTest.java 03/30/2007 05:52:16 Humble try to commit reworked patch for HARMONY-1813 ([classlib][awt][test] java.awt test resources are located in wrong place)
added ayza  /harmony/enhanced/classlib/trunk/modules/awt/src/test/api/resources/serialization/java/awt/geom 03/30/2007 05:52:16 Humble try to commit reworked patch for HARMONY-1813 ([classlib][awt][test] java.awt test resources are located in wrong place)
added ayza  /harmony/enhanced/classlib/trunk/modules/awt/src/test/api/resources/shapes/java/awt/geom/rect(50,50,200,100)_affine(1,0,0,1,20,30).shape 03/30/2007 05:52:16 Humble try to commit reworked patch for HARMONY-1813 ([classlib][awt][test] java.awt test resources are located in wrong place)
added ayza  /harmony/enhanced/classlib/trunk/modules/awt/src/test/api/resources/shapes/java/awt/geom/ellipse(50,50,100,200).shape 03/30/2007 05:52:16 Humble try to commit reworked patch for HARMONY-1813 ([classlib][awt][test] java.awt test resources are located in wrong place)
added ayza  /harmony/enhanced/classlib/trunk/modules/awt/src/test/api/resources/shapes/java/awt/geom/arc(50,50,200,400,40,-80,PIE)_affine(1,2,2,1,0,0).shape 03/30/2007 05:52:16 Humble try to commit reworked patch for HARMONY-1813 ([classlib][awt][test] java.awt test resources are located in wrong place)
added ayza  /harmony/enhanced/classlib/trunk/modules/awt/src/test/api/resources/shapes/java/awt/geom/arc(50,50,200,200,400,710,PIE).ico 03/30/2007 05:52:16 Humble try to commit reworked patch for HARMONY-1813 ([classlib][awt][test] java.awt test resources are located in wrong place)
added ayza  /harmony/enhanced/classlib/trunk/modules/awt/src/test/api/resources/serialization/java/awt/java.awt.Polygon[0 [0,0,0,0] () ()].ser 03/30/2007 05:52:16 Humble try to commit reworked patch for HARMONY-1813 ([classlib][awt][test] java.awt test resources are located in wrong place)
added ayza  /harmony/enhanced/classlib/trunk/modules/awt/src/test/api/resources/shapes/java/awt/geom/round(50,50,400,200,140,100).ico 03/30/2007 05:52:16 Humble try to commit reworked patch for HARMONY-1813 ([classlib][awt][test] java.awt test resources are located in wrong place)
added ayza  /harmony/enhanced/classlib/trunk/modules/awt/src/test/api/resources/shapes/java/awt/geom/rect(50,50,200,100)_affine(1,0,0,1,20,30).ico 03/30/2007 05:52:16 Humble try to commit reworked patch for HARMONY-1813 ([classlib][awt][test] java.awt test resources are located in wrong place)
added ayza  /harmony/enhanced/classlib/trunk/modules/awt/src/test/api/resources/shapes/java/awt/geom/round(50,50,400,200,140,100)_flat(5).shape 03/30/2007 05:52:16 Humble try to commit reworked patch for HARMONY-1813 ([classlib][awt][test] java.awt test resources are located in wrong place)
added ayza  /harmony/enhanced/classlib/trunk/modules/awt/src/test/api/resources/shapes/java/awt/geom/arc(50,50,400,400,20,330,PIE)_flat(10).ico 03/30/2007 05:52:16 Humble try to commit reworked patch for HARMONY-1813 ([classlib][awt][test] java.awt test resources are located in wrong place)
added ayza  /harmony/enhanced/classlib/trunk/modules/awt/src/test/api/resources/shapes/java/awt/geom/ellipse(50,50,100,200).ico 03/30/2007 05:52:16 Humble try to commit reworked patch for HARMONY-1813 ([classlib][awt][test] java.awt test resources are located in wrong place)
modified ayza  /harmony/enhanced/classlib/trunk/modules/awt/src/test/api/java/common/java/awt/RectangleTest.java 03/30/2007 05:52:16 Humble try to commit reworked patch for HARMONY-1813 ([classlib][awt][test] java.awt test resources are located in wrong place)
added ayza  /harmony/enhanced/classlib/trunk/modules/awt/src/test/api/resources/shapes/java/awt/geom/arc(50,50,400,400,450,-730,CHORD).ico 03/30/2007 05:52:16 Humble try to commit reworked patch for HARMONY-1813 ([classlib][awt][test] java.awt test resources are located in wrong place)
added ayza  /harmony/enhanced/classlib/trunk/modules/awt/src/test/api/resources/shapes/java/awt/geom/quad(50,50,250,100,150,250).ico 03/30/2007 05:52:16 Humble try to commit reworked patch for HARMONY-1813 ([classlib][awt][test] java.awt test resources are located in wrong place)
added ayza  /harmony/enhanced/classlib/trunk/modules/awt/src/test/api/resources/shapes/java/awt/geom/arc(50,50,400,400,20,330,PIE).ico 03/30/2007 05:52:16 Humble try to commit reworked patch for HARMONY-1813 ([classlib][awt][test] java.awt test resources are located in wrong place)
added ayza  /harmony/enhanced/classlib/trunk/modules/awt/src/test/api/resources/shapes/java/awt/geom/arc(50,50,400,400,-150,270,OPEN)_flat(30).shape 03/30/2007 05:52:16 Humble try to commit reworked patch for HARMONY-1813 ([classlib][awt][test] java.awt test resources are located in wrong place)
added ayza  /harmony/enhanced/classlib/trunk/modules/awt/src/test/api/resources/serialization 03/30/2007 05:52:16 Humble try to commit reworked patch for HARMONY-1813 ([classlib][awt][test] java.awt test resources are located in wrong place)
added ayza  /harmony/enhanced/classlib/trunk/modules/awt/src/test/api/resources/shapes/java/awt/geom/arc(50,50,200,200,-100,-200,OPEN).shape 03/30/2007 05:52:16 Humble try to commit reworked patch for HARMONY-1813 ([classlib][awt][test] java.awt test resources are located in wrong place)
modified ayza  /harmony/enhanced/classlib/trunk/modules/awt/src/test/api/java/common/java/awt/DimensionTest.java 03/30/2007 05:52:16 Humble try to commit reworked patch for HARMONY-1813 ([classlib][awt][test] java.awt test resources are located in wrong place)
added ayza  /harmony/enhanced/classlib/trunk/modules/awt/src/test/api/resources/shapes/java/awt/geom/polygon(50,50,200,50,200,150,100,150,100,100,150,100,150,200,50,200).ico 03/30/2007 05:52:16 Humble try to commit reworked patch for HARMONY-1813 ([classlib][awt][test] java.awt test resources are located in wrong place)
added ayza  /harmony/enhanced/classlib/trunk/modules/awt/src/test/api/resources/shapes/java/awt/geom/arc(50,50,400,400,-150,270,OPEN).shape 03/30/2007 05:52:16 Humble try to commit reworked patch for HARMONY-1813 ([classlib][awt][test] java.awt test resources are located in wrong place)
modified ayza  /harmony/enhanced/classlib/trunk/modules/awt/src/test/api/java/common/java/awt/PointTest.java 03/30/2007 05:52:16 Humble try to commit reworked patch for HARMONY-1813 ([classlib][awt][test] java.awt test resources are located in wrong place)
deleted ayza  /harmony/enhanced/classlib/trunk/modules/awt/src/test/api/java/common/java/awt/serialization 03/30/2007 05:52:16 Humble try to commit reworked patch for HARMONY-1813 ([classlib][awt][test] java.awt test resources are located in wrong place)
added ayza  /harmony/enhanced/classlib/trunk/modules/awt/src/test/api/resources/serialization/java/awt 03/30/2007 05:52:16 Humble try to commit reworked patch for HARMONY-1813 ([classlib][awt][test] java.awt test resources are located in wrong place)
added ayza  /harmony/enhanced/classlib/trunk/modules/awt/src/test/api/resources/shapes/java/awt/geom/arc(50,50,200,200,-100,-200,OPEN).ico 03/30/2007 05:52:16 Humble try to commit reworked patch for HARMONY-1813 ([classlib][awt][test] java.awt test resources are located in wrong place)
added ayza  /harmony/enhanced/classlib/trunk/modules/awt/src/test/api/resources/shapes/java/awt/geom/cubic(150,250,50,250,250,50,250,200).shape 03/30/2007 05:52:16 Humble try to commit reworked patch for HARMONY-1813 ([classlib][awt][test] java.awt test resources are located in wrong place)
added ayza  /harmony/enhanced/classlib/trunk/modules/awt/src/test/api/resources/shapes/java/awt/geom/arc(50,50,200,400,-250,360,PIE).shape 03/30/2007 05:52:16 Humble try to commit reworked patch for HARMONY-1813 ([classlib][awt][test] java.awt test resources are located in wrong place)
added ayza  /harmony/enhanced/classlib/trunk/modules/awt/src/test/api/resources/shapes/java/awt/geom/arc(50,50,200,200,0,60,CHORD)_flat(10).shape 03/30/2007 05:52:16 Humble try to commit reworked patch for HARMONY-1813 ([classlib][awt][test] java.awt test resources are located in wrong place)
added ayza  /harmony/enhanced/classlib/trunk/modules/awt/src/test/api/resources/shapes/java/awt/geom/arc(50,50,200,400,-450,730,OPEN).ico 03/30/2007 05:52:16 Humble try to commit reworked patch for HARMONY-1813 ([classlib][awt][test] java.awt test resources are located in wrong place)
deleted ayza  /harmony/enhanced/classlib/trunk/modules/awt/src/test/api/java/common/org/apache/harmony/awt/gl/resources/star.rect 03/30/2007 05:52:16 Humble try to commit reworked patch for HARMONY-1813 ([classlib][awt][test] java.awt test resources are located in wrong place)
deleted ayza  /harmony/enhanced/classlib/trunk/modules/awt/src/test/api/java/common/org/apache/harmony/awt/gl/resources/twist.rect 03/30/2007 05:52:16 Humble try to commit reworked patch for HARMONY-1813 ([classlib][awt][test] java.awt test resources are located in wrong place)
added ayza  /harmony/enhanced/classlib/trunk/modules/awt/src/test/api/resources/shapes/org/apache/harmony/awt/gl/chess.rect 03/30/2007 05:52:16 Humble try to commit reworked patch for HARMONY-1813 ([classlib][awt][test] java.awt test resources are located in wrong place)
added ayza  /harmony/enhanced/classlib/trunk/modules/awt/src/test/api/resources/shapes/java/awt/geom/polygon(50,50,150,50,150,150,50,150).ico 03/30/2007 05:52:16 Humble try to commit reworked patch for HARMONY-1813 ([classlib][awt][test] java.awt test resources are located in wrong place)
added ayza  /harmony/enhanced/classlib/trunk/modules/awt/src/test/api/resources/serialization/java/awt/java.awt.Dimension[width=0,height=0].ser 03/30/2007 05:52:16 Humble try to commit reworked patch for HARMONY-1813 ([classlib][awt][test] java.awt test resources are located in wrong place)
added ayza  /harmony/enhanced/classlib/trunk/modules/awt/src/test/api/resources/shapes/java/awt/geom/round(50,50,400,200,140,100)_flat(10).shape 03/30/2007 05:52:16 Humble try to commit reworked patch for HARMONY-1813 ([classlib][awt][test] java.awt test resources are located in wrong place)
modified ayza  /harmony/enhanced/classlib/trunk/modules/awt/src/test/api/java/common/java/awt/geom/QuadCurve2DTest.java 03/30/2007 05:52:16 Humble try to commit reworked patch for HARMONY-1813 ([classlib][awt][test] java.awt test resources are located in wrong place)
added ayza  /harmony/enhanced/classlib/trunk/modules/awt/src/test/api/resources/shapes/java/awt/geom/arc(50,50,400,400,20,330,CHORD)_flat(40).shape 03/30/2007 05:52:16 Humble try to commit reworked patch for HARMONY-1813 ([classlib][awt][test] java.awt test resources are located in wrong place)
added ayza  /harmony/enhanced/classlib/trunk/modules/awt/src/test/api/resources/serialization/java/awt/java.awt.Dimension[width=1,height=2].ser 03/30/2007 05:52:16 Humble try to commit reworked patch for HARMONY-1813 ([classlib][awt][test] java.awt test resources are located in wrong place)
added ayza  /harmony/enhanced/classlib/trunk/modules/awt/src/test/api/resources/shapes/java/awt/geom/arc(50,50,200,200,100,200,PIE).ico 03/30/2007 05:52:16 Humble try to commit reworked patch for HARMONY-1813 ([classlib][awt][test] java.awt test resources are located in wrong place)
modified ayza  /harmony/enhanced/classlib/trunk/modules/awt/src/test/api/java/common/java/awt/geom/GeneralPathTest.java 03/30/2007 05:52:16 Humble try to commit reworked patch for HARMONY-1813 ([classlib][awt][test] java.awt test resources are located in wrong place)
added ayza  /harmony/enhanced/classlib/trunk/modules/awt/src/test/api/resources/shapes/java/awt/geom/cubic(50,50,150,150,250,150,350,60).shape 03/30/2007 05:52:16 Humble try to commit reworked patch for HARMONY-1813 ([classlib][awt][test] java.awt test resources are located in wrong place)
added ayza  /harmony/enhanced/classlib/trunk/modules/awt/src/test/api/resources/shapes/java/awt/geom/arc(50,50,400,400,20,330,CHORD)_flat(40).ico 03/30/2007 05:52:16 Humble try to commit reworked patch for HARMONY-1813 ([classlib][awt][test] java.awt test resources are located in wrong place)
modified ayza  /harmony/enhanced/classlib/trunk/modules/awt/src/test/api/java/common/java/awt/PolygonTest.java 03/30/2007 05:52:16 Humble try to commit reworked patch for HARMONY-1813 ([classlib][awt][test] java.awt test resources are located in wrong place)
added ayza  /harmony/enhanced/classlib/trunk/modules/awt/src/test/api/resources/shapes/java/awt/geom/arc(50,50,200,200,0,60,OPEN).ico 03/30/2007 05:52:16 Humble try to commit reworked patch for HARMONY-1813 ([classlib][awt][test] java.awt test resources are located in wrong place)
added ayza  /harmony/enhanced/classlib/trunk/modules/awt/src/test/api/resources/shapes/java/awt/geom/arc(50,50,400,400,450,-730,CHORD).shape 03/30/2007 05:52:16 Humble try to commit reworked patch for HARMONY-1813 ([classlib][awt][test] java.awt test resources are located in wrong place)
added ayza  /harmony/enhanced/classlib/trunk/modules/awt/src/test/api/resources/shapes/java/awt/geom 03/30/2007 05:52:16 Humble try to commit reworked patch for HARMONY-1813 ([classlib][awt][test] java.awt test resources are located in wrong place)
added ayza  /harmony/enhanced/classlib/trunk/modules/awt/src/test/api/resources/shapes/java/awt/geom/arc(50,50,200,200,-300,-361,CHORD).shape 03/30/2007 05:52:16 Humble try to commit reworked patch for HARMONY-1813 ([classlib][awt][test] java.awt test resources are located in wrong place)
added ayza  /harmony/enhanced/classlib/trunk/modules/awt/src/test/api/resources/shapes/java/awt/geom/quad(250,50,50,250,200,200).shape 03/30/2007 05:52:16 Humble try to commit reworked patch for HARMONY-1813 ([classlib][awt][test] java.awt test resources are located in wrong place)
added ayza  /harmony/enhanced/classlib/trunk/modules/awt/src/test/api/resources/shapes/java/awt/geom/cubic(450,100,50,250,150,50,300,250).shape 03/30/2007 05:52:16 Humble try to commit reworked patch for HARMONY-1813 ([classlib][awt][test] java.awt test resources are located in wrong place)
added ayza  /harmony/enhanced/classlib/trunk/modules/awt/src/test/api/resources/shapes/java/awt/geom/cubic(50,50,150,150,250,150,350,60).ico 03/30/2007 05:52:16 Humble try to commit reworked patch for HARMONY-1813 ([classlib][awt][test] java.awt test resources are located in wrong place)
added ayza  /harmony/enhanced/classlib/trunk/modules/awt/src/test/api/resources/shapes/java/awt/geom/arc(50,50,400,400,-50,170,CHORD).shape 03/30/2007 05:52:16 Humble try to commit reworked patch for HARMONY-1813 ([classlib][awt][test] java.awt test resources are located in wrong place)
added ayza  /harmony/enhanced/classlib/trunk/modules/awt/src/test/api/resources/shapes/java/awt/geom/arc(50,50,400,200,0,-60,CHORD).ico 03/30/2007 05:52:16 Humble try to commit reworked patch for HARMONY-1813 ([classlib][awt][test] java.awt test resources are located in wrong place)
added ayza  /harmony/enhanced/classlib/trunk/modules/awt/src/test/api/resources/shapes/java/awt/geom/arc(50,50,400,400,-350,390,CHORD).ico 03/30/2007 05:52:16 Humble try to commit reworked patch for HARMONY-1813 ([classlib][awt][test] java.awt test resources are located in wrong place)
added ayza  /harmony/enhanced/classlib/trunk/modules/awt/src/test/api/resources/shapes/java/awt/geom/arc(50,50,200,200,-300,-361,CHORD).ico 03/30/2007 05:52:16 Humble try to commit reworked patch for HARMONY-1813 ([classlib][awt][test] java.awt test resources are located in wrong place)
added ayza  /harmony/enhanced/classlib/trunk/modules/awt/src/test/api/resources/shapes/java/awt/geom/quad(250,50,50,250,200,200).ico 03/30/2007 05:52:16 Humble try to commit reworked patch for HARMONY-1813 ([classlib][awt][test] java.awt test resources are located in wrong place)
added ayza  /harmony/enhanced/classlib/trunk/modules/awt/src/test/api/resources/shapes/java/awt/geom/arc(50,50,200,200,200,359,CHORD).shape 03/30/2007 05:52:16 Humble try to commit reworked patch for HARMONY-1813 ([classlib][awt][test] java.awt test resources are located in wrong place)
added ayza  /harmony/enhanced/classlib/trunk/modules/awt/src/test/api/resources/shapes/org/apache/harmony/awt/gl 03/30/2007 05:52:16 Humble try to commit reworked patch for HARMONY-1813 ([classlib][awt][test] java.awt test resources are located in wrong place)
added ayza  /harmony/enhanced/classlib/trunk/modules/awt/src/test/api/resources/shapes/java/awt/geom/round(50,50,400,200,140,100)_flat(5).ico 03/30/2007 05:52:16 Humble try to commit reworked patch for HARMONY-1813 ([classlib][awt][test] java.awt test resources are located in wrong place)
added ayza  /harmony/enhanced/classlib/trunk/modules/awt/src/test/api/resources/serialization/java/awt/java.awt.Point[x=1,y=2].ser 03/30/2007 05:52:16 Humble try to commit reworked patch for HARMONY-1813 ([classlib][awt][test] java.awt test resources are located in wrong place)
added ayza  /harmony/enhanced/classlib/trunk/modules/awt/src/test/api/resources/shapes/org/apache/harmony/awt/gl/star.rect 03/30/2007 05:52:16 Humble try to commit reworked patch for HARMONY-1813 ([classlib][awt][test] java.awt test resources are located in wrong place)
added ayza  /harmony/enhanced/classlib/trunk/modules/awt/src/test/api/resources/shapes/java/awt/geom/arc(50,50,200,400,350,-390,PIE).ico 03/30/2007 05:52:16 Humble try to commit reworked patch for HARMONY-1813 ([classlib][awt][test] java.awt test resources are located in wrong place)
added ayza  /harmony/enhanced/classlib/trunk/modules/awt/src/test/api/resources/shapes/java/awt/geom/arc(50,50,400,200,300,361,OPEN).ico 03/30/2007 05:52:16 Humble try to commit reworked patch for HARMONY-1813 ([classlib][awt][test] java.awt test resources are located in wrong place)
added ayza  /harmony/enhanced/classlib/trunk/modules/awt/src/test/api/resources/shapes/java/awt/geom/arc(50,50,400,200,-200,-359,PIE).shape 03/30/2007 05:52:16 Humble try to commit reworked patch for HARMONY-1813 ([classlib][awt][test] java.awt test resources are located in wrong place)
added ayza  /harmony/enhanced/classlib/trunk/modules/awt/src/test/api/resources/shapes/java/awt/geom/arc(50,50,200,200,200,359,CHORD).ico 03/30/2007 05:52:16 Humble try to commit reworked patch for HARMONY-1813 ([classlib][awt][test] java.awt test resources are located in wrong place)
added ayza  /harmony/enhanced/classlib/trunk/modules/awt/src/test/api/resources/shapes/java/awt/geom/arc(50,50,200,400,150,-270,CHORD).shape 03/30/2007 05:52:16 Humble try to commit reworked patch for HARMONY-1813 ([classlib][awt][test] java.awt test resources are located in wrong place)
added ayza  /harmony/enhanced/classlib/trunk/modules/awt/src/test/api/resources/shapes/java/awt/geom/cubic(50,300,150,250,150,100,300,50).shape 03/30/2007 05:52:16 Humble try to commit reworked patch for HARMONY-1813 ([classlib][awt][test] java.awt test resources are located in wrong place)
modified ayza  /harmony/enhanced/classlib/trunk/modules/awt/src/test/api/java/common/java/awt/geom/RoundRectangle2DTest.java 03/30/2007 05:52:16 Humble try to commit reworked patch for HARMONY-1813 ([classlib][awt][test] java.awt test resources are located in wrong place)
added ayza  /harmony/enhanced/classlib/trunk/modules/awt/src/test/api/resources/shapes/java/awt/geom/arc(50,50,400,400,250,-360,OPEN).shape 03/30/2007 05:52:16 Humble try to commit reworked patch for HARMONY-1813 ([classlib][awt][test] java.awt test resources are located in wrong place)
added ayza  /harmony/enhanced/classlib/trunk/modules/awt/src/test/api/resources/shapes/java/awt/geom/rect(50,50,100,200).shape 03/30/2007 05:52:16 Humble try to commit reworked patch for HARMONY-1813 ([classlib][awt][test] java.awt test resources are located in wrong place)
added ayza  /harmony/enhanced/classlib/trunk/modules/awt/src/test/api/resources/shapes/java/awt/geom/arc(50,50,200,400,-450,730,OPEN).shape 03/30/2007 05:52:16 Humble try to commit reworked patch for HARMONY-1813 ([classlib][awt][test] java.awt test resources are located in wrong place)
added ayza  /harmony/enhanced/classlib/trunk/modules/awt/src/test/api/resources/shapes/java/awt/geom/arc(50,50,400,400,-150,270,OPEN).ico 03/30/2007 05:52:16 Humble try to commit reworked patch for HARMONY-1813 ([classlib][awt][test] java.awt test resources are located in wrong place)
added ayza  /harmony/enhanced/classlib/trunk/modules/awt/src/test/api/resources/serialization/java 03/30/2007 05:52:16 Humble try to commit reworked patch for HARMONY-1813 ([classlib][awt][test] java.awt test resources are located in wrong place)
added ayza  /harmony/enhanced/classlib/trunk/modules/awt/src/test/api/resources/shapes/java/awt/geom/arc(50,50,400,400,250,-360,OPEN).ico 03/30/2007 05:52:16 Humble try to commit reworked patch for HARMONY-1813 ([classlib][awt][test] java.awt test resources are located in wrong place)
added ayza  /harmony/enhanced/classlib/trunk/modules/awt/src/test/api/resources/shapes/java/awt/geom/rect(50,50,100,200).ico 03/30/2007 05:52:16 Humble try to commit reworked patch for HARMONY-1813 ([classlib][awt][test] java.awt test resources are located in wrong place)
added ayza  /harmony/enhanced/classlib/trunk/modules/awt/src/test/api/resources/serialization/java/awt/java.awt.Rectangle[x=1,y=2,width=3,height=4].ser 03/30/2007 05:52:16 Humble try to commit reworked patch for HARMONY-1813 ([classlib][awt][test] java.awt test resources are located in wrong place)
added ayza  /harmony/enhanced/classlib/trunk/modules/awt/src/test/api/resources/shapes/java/awt/geom/polygon(50,50,150,250,250,150).ico 03/30/2007 05:52:16 Humble try to commit reworked patch for HARMONY-1813 ([classlib][awt][test] java.awt test resources are located in wrong place)
added ayza  /harmony/enhanced/classlib/trunk/modules/awt/src/test/api/resources/shapes/java/awt/geom/arc(50,50,200,200,0,60,OPEN).shape 03/30/2007 05:52:16 Humble try to commit reworked patch for HARMONY-1813 ([classlib][awt][test] java.awt test resources are located in wrong place)
added ayza  /harmony/enhanced/classlib/trunk/modules/awt/src/test/api/resources/shapes/java/awt/geom/arc(50,50,200,200,0,60,CHORD)_flat(10).ico 03/30/2007 05:52:16 Humble try to commit reworked patch for HARMONY-1813 ([classlib][awt][test] java.awt test resources are located in wrong place)
added ayza  /harmony/enhanced/classlib/trunk/modules/awt/src/test/api/resources/shapes/java/awt/geom/round(50,50,200,400,100,140)_affine(1,0,0,1,30,20).shape 03/30/2007 05:52:16 Humble try to commit reworked patch for HARMONY-1813 ([classlib][awt][test] java.awt test resources are located in wrong place)
added ayza  /harmony/enhanced/classlib/trunk/modules/awt/src/test/api/resources/shapes/java/awt/geom/arc(50,50,200,400,40,-80,CHORD).shape 03/30/2007 05:52:16 Humble try to commit reworked patch for HARMONY-1813 ([classlib][awt][test] java.awt test resources are located in wrong place)
modified ayza  /harmony/enhanced/classlib/trunk/modules/awt/src/test/api/java/common/java/awt/geom/ShapeTestCase.java 03/30/2007 05:52:16 Humble try to commit reworked patch for HARMONY-1813 ([classlib][awt][test] java.awt test resources are located in wrong place)
modified ayza  /harmony/enhanced/classlib/trunk/modules/awt/src/test/api/java/common/org/apache/harmony/awt/gl/MultiRectAreaRectCashTest.java 03/30/2007 05:52:16 Humble try to commit reworked patch for HARMONY-1813 ([classlib][awt][test] java.awt test resources are located in wrong place)
deleted ayza  /harmony/enhanced/classlib/trunk/modules/awt/src/test/api/java/common/java/awt/geom/serialization 03/30/2007 05:52:16 Humble try to commit reworked patch for HARMONY-1813 ([classlib][awt][test] java.awt test resources are located in wrong place)
added ayza  /harmony/enhanced/classlib/trunk/modules/awt/src/test/api/resources/shapes/java/awt/geom/round(50,50,400,200,140,100)_flat(10).ico 03/30/2007 05:52:16 Humble try to commit reworked patch for HARMONY-1813 ([classlib][awt][test] java.awt test resources are located in wrong place)
deleted ayza  /harmony/enhanced/classlib/trunk/modules/awt/src/test/api/java/common/java/awt/geom/shapes 03/30/2007 05:52:16 Humble try to commit reworked patch for HARMONY-1813 ([classlib][awt][test] java.awt test resources are located in wrong place)
added ayza  /harmony/enhanced/classlib/trunk/modules/awt/src/test/api/resources/shapes/java/awt/geom/arc(50,50,200,400,40,-80,CHORD).ico 03/30/2007 05:52:16 Humble try to commit reworked patch for HARMONY-1813 ([classlib][awt][test] java.awt test resources are located in wrong place)
added ayza  /harmony/enhanced/classlib/trunk/modules/awt/src/test/api/resources/serialization/java/awt/geom/java.awt.geom.AffineTransform[[1.0, 0.0, 0.0], [0.0, 1.0, 0.0]].ser 03/30/2007 05:52:16 Humble try to commit reworked patch for HARMONY-1813 ([classlib][awt][test] java.awt test resources are located in wrong place)
added ayza  /harmony/enhanced/classlib/trunk/modules/awt/src/test/api/resources/shapes/java/awt/geom/polygon(50,300,250,150,100,100,200,250,200,50).ico 03/30/2007 05:52:16 Humble try to commit reworked patch for HARMONY-1813 ([classlib][awt][test] java.awt test resources are located in wrong place)
modified ayza  /harmony/enhanced/classlib/trunk/modules/awt/src/test/api/java/common/java/awt/Tools.java 03/30/2007 05:52:16 Humble try to commit reworked patch for HARMONY-1813 ([classlib][awt][test] java.awt test resources are located in wrong place)
added ayza  /harmony/enhanced/classlib/trunk/modules/awt/src/test/api/resources/shapes/java/awt/geom/arc(50,50,200,200,100,200,PIE)_flat(20).shape 03/30/2007 05:52:16 Humble try to commit reworked patch for HARMONY-1813 ([classlib][awt][test] java.awt test resources are located in wrong place)
added ayza  /harmony/enhanced/classlib/trunk/modules/awt/src/test/api/resources/shapes/java/awt/geom/arc(50,50,400,400,20,-330,OPEN).shape 03/30/2007 05:52:16 Humble try to commit reworked patch for HARMONY-1813 ([classlib][awt][test] java.awt test resources are located in wrong place)
modified ayza  /harmony/enhanced/classlib/trunk/modules/awt/src/test/api/java/common/java/awt/geom/CubicCurve2DTest.java 03/30/2007 05:52:16 Humble try to commit reworked patch for HARMONY-1813 ([classlib][awt][test] java.awt test resources are located in wrong place)
modified ayza  /harmony/enhanced/classlib/trunk/modules/awt/src/test/api/java/common/java/awt/BasicStrokeTest.java 03/30/2007 05:52:16 Humble try to commit reworked patch for HARMONY-1813 ([classlib][awt][test] java.awt test resources are located in wrong place)
added ayza  /harmony/enhanced/classlib/trunk/modules/awt/src/test/api/resources/shapes/java/awt/geom/cubic(300,50,50,200,300,50,350,150).shape 03/30/2007 05:52:16 Humble try to commit reworked patch for HARMONY-1813 ([classlib][awt][test] java.awt test resources are located in wrong place)
modified ayza  /harmony/enhanced/classlib/trunk/modules/awt/src/test/api/java/common/java/awt/geom/AffineTransformTest.java 03/30/2007 05:52:16 Humble try to commit reworked patch for HARMONY-1813 ([classlib][awt][test] java.awt test resources are located in wrong place)
added ayza  /harmony/enhanced/classlib/trunk/modules/awt/src/test/api/resources/shapes/java/awt/geom/arc(50,50,400,400,20,-330,OPEN).ico 03/30/2007 05:52:16 Humble try to commit reworked patch for HARMONY-1813 ([classlib][awt][test] java.awt test resources are located in wrong place)
added ayza  /harmony/enhanced/classlib/trunk/modules/awt/src/test/api/resources/shapes/java/awt/geom/arc(50,50,200,400,40,-80,OPEN)_affine(2,0,0,2,0,0).shape 03/30/2007 05:52:16 Humble try to commit reworked patch for HARMONY-1813 ([classlib][awt][test] java.awt test resources are located in wrong place)
added ayza  /harmony/enhanced/classlib/trunk/modules/awt/src/test/api/resources/shapes/java/awt/geom/arc(50,50,400,400,-50,170,CHORD).ico 03/30/2007 05:52:16 Humble try to commit reworked patch for HARMONY-1813 ([classlib][awt][test] java.awt test resources are located in wrong place)
added ayza  /harmony/enhanced/classlib/trunk/modules/awt/src/test/api/resources/shapes/org/apache/harmony/awt/gl/twist.rect 03/30/2007 05:52:16 Humble try to commit reworked patch for HARMONY-1813 ([classlib][awt][test] java.awt test resources are located in wrong place)
added ayza  /harmony/enhanced/classlib/trunk/modules/awt/src/test/api/resources/shapes/org/apache/harmony/awt/gl/double.rect 03/30/2007 05:52:16 Humble try to commit reworked patch for HARMONY-1813 ([classlib][awt][test] java.awt test resources are located in wrong place)
added ayza  /harmony/enhanced/classlib/trunk/modules/awt/src/test/api/resources/shapes/java/awt/geom/ellipse(50,50,200,100)_flat(10).shape 03/30/2007 05:52:16 Humble try to commit reworked patch for HARMONY-1813 ([classlib][awt][test] java.awt test resources are located in wrong place)
modified ayza  /harmony/enhanced/classlib/trunk/modules/awt/src/test/api/java/common/java/awt/SerializeTestCase.java 03/30/2007 05:52:16 Humble try to commit reworked patch for HARMONY-1813 ([classlib][awt][test] java.awt test resources are located in wrong place)
added ayza  /harmony/enhanced/classlib/trunk/modules/awt/src/test/api/resources/shapes/java/awt/geom/cubic(300,50,50,200,300,50,350,150).ico 03/30/2007 05:52:16 Humble try to commit reworked patch for HARMONY-1813 ([classlib][awt][test] java.awt test resources are located in wrong place)
added ayza  /harmony/enhanced/classlib/trunk/modules/awt/src/test/api/resources/shapes/java/awt/geom/ellipse(50,50,200,100)_affine(1,0,0,1,20,30).shape 03/30/2007 05:52:16 Humble try to commit reworked patch for HARMONY-1813 ([classlib][awt][test] java.awt test resources are located in wrong place)
added ayza  /harmony/enhanced/classlib/trunk/modules/awt/src/test/api/resources/shapes/java/awt/geom/ellipse(50,50,200,100)_flat(10).ico 03/30/2007 05:52:16 Humble try to commit reworked patch for HARMONY-1813 ([classlib][awt][test] java.awt test resources are located in wrong place)
added ayza  /harmony/enhanced/classlib/trunk/modules/awt/src/test/api/resources/shapes/java/awt/geom/arc(50,50,400,400,50,-170,PIE).ico 03/30/2007 05:52:16 Humble try to commit reworked patch for HARMONY-1813 ([classlib][awt][test] java.awt test resources are located in wrong place)
added ayza  /harmony/enhanced/classlib/trunk/modules/awt/src/test/api/resources/shapes/java/awt/geom/arc(50,50,200,400,150,-270,CHORD).ico 03/30/2007 05:52:16 Humble try to commit reworked patch for HARMONY-1813 ([classlib][awt][test] java.awt test resources are located in wrong place)
added ayza  /harmony/enhanced/classlib/trunk/modules/awt/src/test/api/resources/shapes/java/awt/geom/ellipse(50,50,200,100)_affine(1,0,0,1,20,30).ico 03/30/2007 05:52:16 Humble try to commit reworked patch for HARMONY-1813 ([classlib][awt][test] java.awt test resources are located in wrong place)
added ayza  /harmony/enhanced/classlib/trunk/modules/awt/src/test/api/resources/shapes/java/awt/geom/arc(50,50,400,200,-400,-710,OPEN).shape 03/30/2007 05:52:16 Humble try to commit reworked patch for HARMONY-1813 ([classlib][awt][test] java.awt test resources are located in wrong place)
added ayza  /harmony/enhanced/classlib/trunk/modules/awt/src/test/api/resources/shapes/org/apache 03/30/2007 05:52:16 Humble try to commit reworked patch for HARMONY-1813 ([classlib][awt][test] java.awt test resources are located in wrong place)
added ayza  /harmony/enhanced/classlib/trunk/modules/awt/src/test/api/resources/shapes/java/awt/geom/cubic(50,300,150,250,150,100,300,50).ico 03/30/2007 05:52:16 Humble try to commit reworked patch for HARMONY-1813 ([classlib][awt][test] java.awt test resources are located in wrong place)
added ayza  /harmony/enhanced/classlib/trunk/modules/awt/src/test/api/resources/shapes/java/awt 03/30/2007 05:52:16 Humble try to commit reworked patch for HARMONY-1813 ([classlib][awt][test] java.awt test resources are located in wrong place)
added ayza  /harmony/enhanced/classlib/trunk/modules/awt/src/test/api/resources 03/30/2007 05:52:16 Humble try to commit reworked patch for HARMONY-1813 ([classlib][awt][test] java.awt test resources are located in wrong place)
added ayza  /harmony/enhanced/classlib/trunk/modules/awt/src/test/api/resources/shapes/java/awt/geom/arc(50,50,200,200,100,200,PIE).shape 03/30/2007 05:52:16 Humble try to commit reworked patch for HARMONY-1813 ([classlib][awt][test] java.awt test resources are located in wrong place)
modified ayza  /harmony/enhanced/classlib/trunk/modules/awt/src/test/api/java/common/org/apache/harmony/awt/gl/MultiRectAreaTest.java 03/30/2007 05:52:16 Humble try to commit reworked patch for HARMONY-1813 ([classlib][awt][test] java.awt test resources are located in wrong place)
added ayza  /harmony/enhanced/classlib/trunk/modules/awt/src/test/api/resources/shapes/org/apache/harmony/awt 03/30/2007 05:52:16 Humble try to commit reworked patch for HARMONY-1813 ([classlib][awt][test] java.awt test resources are located in wrong place)
modified ayza  /harmony/enhanced/classlib/trunk/modules/awt/src/test/api/java/common/java/awt/geom/GeomTestCase.java 03/30/2007 05:52:16 Humble try to commit reworked patch for HARMONY-1813 ([classlib][awt][test] java.awt test resources are located in wrong place)
modified ayza  /harmony/enhanced/classlib/trunk/modules/awt/build.xml 03/30/2007 05:52:16 Humble try to commit reworked patch for HARMONY-1813 ([classlib][awt][test] java.awt test resources are located in wrong place)
added ayza  /harmony/enhanced/classlib/trunk/modules/awt/src/test/api/resources/shapes/java/awt/geom/arc(50,50,200,400,-250,360,PIE).ico 03/30/2007 05:52:16 Humble try to commit reworked patch for HARMONY-1813 ([classlib][awt][test] java.awt test resources are located in wrong place)
added ayza  /harmony/enhanced/classlib/trunk/modules/awt/src/test/api/resources/serialization/java/awt/java.awt.Polygon[3 [1,4,2,2] (1,2,3) (4,5,6)].ser 03/30/2007 05:52:16 Humble try to commit reworked patch for HARMONY-1813 ([classlib][awt][test] java.awt test resources are located in wrong place)
added ayza  /harmony/enhanced/classlib/trunk/modules/awt/src/test/api/resources/shapes/java/awt/geom/arc(50,50,200,200,400,710,PIE).shape 03/30/2007 05:52:16 Humble try to commit reworked patch for HARMONY-1813 ([classlib][awt][test] java.awt test resources are located in wrong place)
added ayza  /harmony/enhanced/classlib/trunk/modules/awt/src/test/api/resources/shapes/java/awt/geom/cubic(50,50,150,200,300,320,200,100).shape 03/30/2007 05:52:16 Humble try to commit reworked patch for HARMONY-1813 ([classlib][awt][test] java.awt test resources are located in wrong place)
modified ayza  /harmony/enhanced/classlib/trunk/modules/awt/src/test/api/java/common/java/awt/geom/Arc2DTest.java 03/30/2007 05:52:16 Humble try to commit reworked patch for HARMONY-1813 ([classlib][awt][test] java.awt test resources are located in wrong place)
added ayza  /harmony/enhanced/classlib/trunk/modules/awt/src/test/api/resources/shapes/java/awt/geom/round(50,50,400,200,140,100).shape 03/30/2007 05:52:16 Humble try to commit reworked patch for HARMONY-1813 ([classlib][awt][test] java.awt test resources are located in wrong place)
added ayza  /harmony/enhanced/classlib/trunk/modules/awt/src/test/api/resources/shapes/java/awt/geom/arc(50,50,400,400,20,330,PIE)_flat(10).shape 03/30/2007 05:52:16 Humble try to commit reworked patch for HARMONY-1813 ([classlib][awt][test] java.awt test resources are located in wrong place)
deleted ayza  /harmony/enhanced/classlib/trunk/modules/awt/src/test/api/java/common/org/apache/harmony/awt/gl/resources/rect.rect 03/30/2007 05:52:16 Humble try to commit reworked patch for HARMONY-1813 ([classlib][awt][test] java.awt test resources are located in wrong place)
added ayza  /harmony/enhanced/classlib/trunk/modules/awt/src/test/api/resources/shapes/java/awt/geom/round(50,50,200,400,100,140)_affine(1,0,0,1,30,20).ico 03/30/2007 05:52:16 Humble try to commit reworked patch for HARMONY-1813 ([classlib][awt][test] java.awt test resources are located in wrong place)
added ayza  /harmony/enhanced/classlib/trunk/modules/awt/src/test/api/resources/shapes/java/awt/geom/cubic(50,50,150,200,300,320,200,100).ico 03/30/2007 05:52:16 Humble try to commit reworked patch for HARMONY-1813 ([classlib][awt][test] java.awt test resources are located in wrong place)
added ayza  /harmony/enhanced/classlib/trunk/modules/awt/src/test/api/resources/shapes/java/awt/geom/arc(50,50,400,400,-350,390,CHORD).shape 03/30/2007 05:52:16 Humble try to commit reworked patch for HARMONY-1813 ([classlib][awt][test] java.awt test resources are located in wrong place)
added ayza  /harmony/enhanced/classlib/trunk/modules/awt/src/test/api/resources/shapes/java/awt/geom/arc(50,50,400,200,0,-60,CHORD).shape 03/30/2007 05:52:16 Humble try to commit reworked patch for HARMONY-1813 ([classlib][awt][test] java.awt test resources are located in wrong place)
added ayza  /harmony/enhanced/classlib/trunk/modules/awt/src/test/api/resources/shapes/java/awt/geom/quad(50,50,250,100,150,250).shape 03/30/2007 05:52:16 Humble try to commit reworked patch for HARMONY-1813 ([classlib][awt][test] java.awt test resources are located in wrong place)
added ayza  /harmony/enhanced/classlib/trunk/modules/awt/src/test/api/resources/shapes/java/awt/geom/arc(50,50,400,400,20,330,PIE).shape 03/30/2007 05:52:16 Humble try to commit reworked patch for HARMONY-1813 ([classlib][awt][test] java.awt test resources are located in wrong place)
deleted ayza  /harmony/enhanced/classlib/trunk/modules/awt/src/test/api/java/common/org/apache/harmony/awt/gl/resources/chess.rect 03/30/2007 05:52:16 Humble try to commit reworked patch for HARMONY-1813 ([classlib][awt][test] java.awt test resources are located in wrong place)
added ayza  /harmony/enhanced/classlib/trunk/modules/awt/src/test/api/resources/shapes/java/awt/geom/arc(50,50,200,400,40,-80,PIE)_affine(1,2,2,1,0,0).ico 03/30/2007 05:52:16 Humble try to commit reworked patch for HARMONY-1813 ([classlib][awt][test] java.awt test resources are located in wrong place)
added ayza  /harmony/enhanced/classlib/trunk/modules/awt/src/test/api/resources/shapes/java/awt/geom/ellipse(50,50,200,100)_flat(5).shape 03/30/2007 05:52:16 Humble try to commit reworked patch for HARMONY-1813 ([classlib][awt][test] java.awt test resources are located in wrong place)
added ayza  /harmony/enhanced/classlib/trunk/modules/awt/src/test/api/resources/shapes/java/awt/geom/arc(50,50,400,200,300,361,OPEN).shape 03/30/2007 05:52:16 Humble try to commit reworked patch for HARMONY-1813 ([classlib][awt][test] java.awt test resources are located in wrong place)
added ayza  /harmony/enhanced/classlib/trunk/modules/awt/src/test/api/resources/shapes/java/awt/geom/arc(50,50,200,400,350,-390,PIE).shape 03/30/2007 05:52:16 Humble try to commit reworked patch for HARMONY-1813 ([classlib][awt][test] java.awt test resources are located in wrong place)
added ayza  /harmony/enhanced/classlib/trunk/modules/awt/src/test/api/resources/shapes/java/awt/geom/cubic(450,100,50,250,150,50,300,250).ico 03/30/2007 05:52:16 Humble try to commit reworked patch for HARMONY-1813 ([classlib][awt][test] java.awt test resources are located in wrong place)
added ayza  /harmony/enhanced/classlib/trunk/modules/awt/src/test/api/resources/shapes/java/awt/geom/arc(50,50,200,200,100,200,PIE)_flat(20).ico 03/30/2007 05:52:16 Humble try to commit reworked patch for HARMONY-1813 ([classlib][awt][test] java.awt test resources are located in wrong place)
added ayza  /harmony/enhanced/classlib/trunk/modules/awt/src/test/api/resources/serialization/java/awt/geom/java.awt.geom.AffineTransform[[1.0, 3.0, 5.0], [2.0, 4.0, 6.0]].ser 03/30/2007 05:52:16 Humble try to commit reworked patch for HARMONY-1813 ([classlib][awt][test] java.awt test resources are located in wrong place)
modified ayza  /harmony/enhanced/classlib/trunk/modules/awt/src/test/api/java/common/org/apache/harmony/awt/gl/MultiRectAreaLineCashTest.java 03/30/2007 05:52:16 Humble try to commit reworked patch for HARMONY-1813 ([classlib][awt][test] java.awt test resources are located in wrong place)
added ayza  /harmony/enhanced/classlib/trunk/modules/awt/src/test/api/resources/shapes/java/awt/geom/ellipse(50,50,200,100)_flat(5).ico 03/30/2007 05:52:16 Humble try to commit reworked patch for HARMONY-1813 ([classlib][awt][test] java.awt test resources are located in wrong place)
added ayza  /harmony/enhanced/classlib/trunk/modules/awt/src/test/api/resources/shapes/java/awt/geom/arc(50,50,400,400,50,-170,PIE).shape 03/30/2007 05:52:16 Humble try to commit reworked patch for HARMONY-1813 ([classlib][awt][test] java.awt test resources are located in wrong place)
added ayza  /harmony/enhanced/classlib/trunk/modules/awt/src/test/api/resources/shapes/java/awt/geom/arc(50,50,200,400,40,-80,OPEN)_affine(2,0,0,2,0,0).ico 03/30/2007 05:52:16 Humble try to commit reworked patch for HARMONY-1813 ([classlib][awt][test] java.awt test resources are located in wrong place)
add cc-classlib log20070329083130Lbuild.89 03/29/2007 08:31:30classlib
modified ayza  /harmony/enhanced/classlib/trunk/support/src/test/java/tests/support/Support_Exec.java 03/29/2007 07:40:46 Support_Exec class was refactored, new functionality was added. With this fix Support_Exec.execJava() will supply extra VM arguments from hy.test.vmargs to forked JVM. See HARMONY-3311 for details.  
modified ayza  /harmony/enhanced/classlib/trunk/modules/archive/build.xml 03/29/2007 07:40:46 Support_Exec class was refactored, new functionality was added. With this fix Support_Exec.execJava() will supply extra VM arguments from hy.test.vmargs to forked JVM. See HARMONY-3311 for details.  
modified ayza  /harmony/enhanced/classlib/trunk/modules/auth/build.xml 03/29/2007 07:40:46 Support_Exec class was refactored, new functionality was added. With this fix Support_Exec.execJava() will supply extra VM arguments from hy.test.vmargs to forked JVM. See HARMONY-3311 for details.  
modified ayza  /harmony/enhanced/classlib/trunk/modules/logging/build.xml 03/29/2007 07:40:46 Support_Exec class was refactored, new functionality was added. With this fix Support_Exec.execJava() will supply extra VM arguments from hy.test.vmargs to forked JVM. See HARMONY-3311 for details.  
modified ayza  /harmony/enhanced/classlib/trunk/modules/luni/build.xml 03/29/2007 07:40:46 Support_Exec class was refactored, new functionality was added. With this fix Support_Exec.execJava() will supply extra VM arguments from hy.test.vmargs to forked JVM. See HARMONY-3311 for details.  
modified ayza  /harmony/enhanced/classlib/trunk/modules/security/build.xml 03/29/2007 07:40:46 Support_Exec class was refactored, new functionality was added. With this fix Support_Exec.execJava() will supply extra VM arguments from hy.test.vmargs to forked JVM. See HARMONY-3311 for details.  
modified ayza  /harmony/enhanced/classlib/trunk/modules/instrument/build.xml 03/29/2007 07:40:46 Support_Exec class was refactored, new functionality was added. With this fix Support_Exec.execJava() will supply extra VM arguments from hy.test.vmargs to forked JVM. See HARMONY-3311 for details.  
add cc-classlib log20070329034022Lbuild.88 03/29/2007 03:40:22classlib
modified liangyx  /harmony/enhanced/classlib/trunk/modules/luni/src/test/java/tests/api/java/net/URLClassLoaderTest.java 03/29/2007 03:31:43 tests.api.java.net.URLClassLoaderTest.testFindResource_H3461() fails on Windows
modified apetrenko  /harmony/enhanced/classlib/trunk/modules/portlib/src/main/native/port/windows/hysignal.c 03/29/2007 02:57:46 The patch for HARMONY-3124 has been reverted by request of Aleksey Ignatenko.He is going to prepare a better patch.
modified apetrenko  /harmony/enhanced/classlib/trunk/modules/portlib/src/main/native/port/windows/hysignal.h 03/29/2007 02:57:46 The patch for HARMONY-3124 has been reverted by request of Aleksey Ignatenko.He is going to prepare a better patch.
add cc-classlib log20070329023322Lbuild.87 03/29/2007 02:33:22classlib
modified apetrenko  /harmony/enhanced/classlib/trunk/modules/portlib/src/main/native/port/windows/hysignal.c 03/29/2007 02:27:58 Patch for HARMONY-3124 "[classlib][launcher] Generation of minidumps files on crash"
modified apetrenko  /harmony/enhanced/classlib/trunk/modules/portlib/src/main/native/port/windows/hysignal.h 03/29/2007 02:27:58 Patch for HARMONY-3124 "[classlib][launcher] Generation of minidumps files on crash"
modified pyang  /harmony/enhanced/classlib/trunk/support/src/test/java/tests/support/Support_HttpTests.java 03/29/2007 01:42:44 Apply patch for HARMONY-3434([classlib][luni]move out tests/api/java/net/URLConnectionTest.java)
modified pyang  /harmony/enhanced/classlib/trunk/support/src/test/java/tests/support/Support_HttpServer.java 03/29/2007 01:42:44 Apply patch for HARMONY-3434([classlib][luni]move out tests/api/java/net/URLConnectionTest.java)
modified pyang  /harmony/enhanced/classlib/trunk/support/src/test/java/tests/support/Support_Configuration.java 03/29/2007 01:42:44 Apply patch for HARMONY-3434([classlib][luni]move out tests/api/java/net/URLConnectionTest.java)
modified pyang  /harmony/enhanced/classlib/trunk/support/src/test/resources/config/localhosttest.ini 03/29/2007 01:42:44 Apply patch for HARMONY-3434([classlib][luni]move out tests/api/java/net/URLConnectionTest.java)
modified pyang  /harmony/enhanced/classlib/trunk/modules/luni/src/test/java/tests/api/java/net/URLConnectionTest.java 03/29/2007 01:42:44 Apply patch for HARMONY-3434([classlib][luni]move out tests/api/java/net/URLConnectionTest.java)
modified pyang  /harmony/enhanced/classlib/trunk/modules/luni/make/exclude.common 03/29/2007 01:42:44 Apply patch for HARMONY-3434([classlib][luni]move out tests/api/java/net/URLConnectionTest.java)
modified pyang  /harmony/enhanced/classlib/trunk/support/src/test/java/tests/support/Support_Jetty.java 03/29/2007 01:42:44 Apply patch for HARMONY-3434([classlib][luni]move out tests/api/java/net/URLConnectionTest.java)
modified pyang  /harmony/enhanced/classlib/trunk/modules/luni/.classpath 03/29/2007 01:39:39 roll back patch for HARMONY-617( [classlib][luni] HttpURLConnection does not support persistent connections), because it causes regression on JBoss application test and HARMONY-3434 test cases
modified pyang  /harmony/enhanced/classlib/trunk/modules/luni/src/main/java/org/apache/harmony/luni/internal/net/www/protocol/http/HttpURLConnection.java 03/29/2007 01:39:39 roll back patch for HARMONY-617( [classlib][luni] HttpURLConnection does not support persistent connections), because it causes regression on JBoss application test and HARMONY-3434 test cases
modified pyang  /harmony/enhanced/classlib/trunk/modules/luni/src/test/java/org/apache/harmony/luni/tests/internal/net/www/protocol/https/HttpsURLConnectionTest.java 03/29/2007 01:39:39 roll back patch for HARMONY-617( [classlib][luni] HttpURLConnection does not support persistent connections), because it causes regression on JBoss application test and HARMONY-3434 test cases
deleted pyang  /harmony/enhanced/classlib/trunk/modules/luni/src/main/java/org/apache/harmony/luni/internal/net/www/protocol/http/HttpConfiguration.java 03/29/2007 01:39:39 roll back patch for HARMONY-617( [classlib][luni] HttpURLConnection does not support persistent connections), because it causes regression on JBoss application test and HARMONY-3434 test cases
modified pyang  /harmony/enhanced/classlib/trunk/modules/luni/src/main/java/org/apache/harmony/luni/internal/net/www/protocol/https/HttpsURLConnection.java 03/29/2007 01:39:39 roll back patch for HARMONY-617( [classlib][luni] HttpURLConnection does not support persistent connections), because it causes regression on JBoss application test and HARMONY-3434 test cases
deleted pyang  /harmony/enhanced/classlib/trunk/modules/luni/src/main/java/org/apache/harmony/luni/internal/net/www/protocol/http/HttpConnectionManager.java 03/29/2007 01:39:39 roll back patch for HARMONY-617( [classlib][luni] HttpURLConnection does not support persistent connections), because it causes regression on JBoss application test and HARMONY-3434 test cases
deleted pyang  /harmony/enhanced/classlib/trunk/modules/luni/src/test/impl/org/apache/harmony/tests/internal/net/www/protocol/http/PersistenceTest.java 03/29/2007 01:39:39 roll back patch for HARMONY-617( [classlib][luni] HttpURLConnection does not support persistent connections), because it causes regression on JBoss application test and HARMONY-3434 test cases
deleted pyang  /harmony/enhanced/classlib/trunk/modules/luni/src/main/java/org/apache/harmony/luni/internal/net/www/protocol/http/HttpConnection.java 03/29/2007 01:39:39 roll back patch for HARMONY-617( [classlib][luni] HttpURLConnection does not support persistent connections), because it causes regression on JBoss application test and HARMONY-3434 test cases
modified pyang  /harmony/enhanced/classlib/trunk/modules/luni/src/test/java/org/apache/harmony/luni/tests/internal/net/www/protocol/http/HttpURLConnectionTest.java 03/29/2007 01:39:39 roll back patch for HARMONY-617( [classlib][luni] HttpURLConnection does not support persistent connections), because it causes regression on JBoss application test and HARMONY-3434 test cases
modified pyang  /harmony/enhanced/classlib/trunk/modules/luni/build.xml 03/29/2007 01:39:39 roll back patch for HARMONY-617( [classlib][luni] HttpURLConnection does not support persistent connections), because it causes regression on JBoss application test and HARMONY-3434 test cases
add cc-classlib log20070329003135Lbuild.86 03/29/2007 00:31:35classlib
modified apetrenko  /harmony/enhanced/classlib/trunk/modules/luni/src/main/java/java/util/Properties.java 03/29/2007 00:23:35 Patch for HARMONY-3518 "java.util.Properties.getProperty(): get() instead of super.get()"
modified apetrenko  /harmony/enhanced/classlib/trunk/modules/luni/src/test/java/tests/api/java/util/PropertiesTest.java 03/29/2007 00:23:35 Patch for HARMONY-3518 "java.util.Properties.getProperty(): get() instead of super.get()"
add cc-classlib log20070328092153Lbuild.85 03/28/2007 09:21:53classlib
modified hindessm  /harmony/enhanced/classlib/trunk/modules/portlib/src/main/native/thrstub 03/28/2007 09:10:49 Adding ignore properties for hy.no.thr mode on unix.
modified hindessm  /harmony/enhanced/classlib/trunk/modules/portlib/src/main/native/thrstub/unix 03/28/2007 09:10:49 Adding ignore properties for hy.no.thr mode on unix.
add cc-classlib log20070328052826Lbuild.84 03/28/2007 05:28:26classlib
added pyang  /harmony/enhanced/classlib/trunk/modules/luni/src/test/impl/org/apache/harmony/tests/internal/net 03/28/2007 04:56:14 Apply patch for HARMONY-617 ([classlib][luni] HttpURLConnection does not support persistent connections)
modified pyang  /harmony/enhanced/classlib/trunk/modules/luni/.classpath 03/28/2007 04:56:14 Apply patch for HARMONY-617 ([classlib][luni] HttpURLConnection does not support persistent connections)
modified pyang  /harmony/enhanced/classlib/trunk/modules/luni/src/main/java/org/apache/harmony/luni/internal/net/www/protocol/http/HttpURLConnection.java 03/28/2007 04:56:14 Apply patch for HARMONY-617 ([classlib][luni] HttpURLConnection does not support persistent connections)
modified pyang  /harmony/enhanced/classlib/trunk/modules/luni/src/test/java/org/apache/harmony/luni/tests/internal/net/www/protocol/https/HttpsURLConnectionTest.java 03/28/2007 04:56:14 Apply patch for HARMONY-617 ([classlib][luni] HttpURLConnection does not support persistent connections)
added pyang  /harmony/enhanced/classlib/trunk/modules/luni/src/test/impl/org/apache/harmony/tests/internal/net/www/protocol/http 03/28/2007 04:56:14 Apply patch for HARMONY-617 ([classlib][luni] HttpURLConnection does not support persistent connections)
modified pyang  /harmony/enhanced/classlib/trunk/modules/luni/src/main/java/org/apache/harmony/luni/internal/net/www/protocol/https/HttpsURLConnection.java 03/28/2007 04:56:14 Apply patch for HARMONY-617 ([classlib][luni] HttpURLConnection does not support persistent connections)
added pyang  /harmony/enhanced/classlib/trunk/modules/luni/src/test/impl 03/28/2007 04:56:14 Apply patch for HARMONY-617 ([classlib][luni] HttpURLConnection does not support persistent connections)
added pyang  /harmony/enhanced/classlib/trunk/modules/luni/src/test/impl/org/apache/harmony/tests/internal/net/www/protocol/http/PersistenceTest.java 03/28/2007 04:56:14 Apply patch for HARMONY-617 ([classlib][luni] HttpURLConnection does not support persistent connections)
added pyang  /harmony/enhanced/classlib/trunk/modules/luni/src/main/java/org/apache/harmony/luni/internal/net/www/protocol/http/HttpConnectionManager.java 03/28/2007 04:56:14 Apply patch for HARMONY-617 ([classlib][luni] HttpURLConnection does not support persistent connections)
added pyang  /harmony/enhanced/classlib/trunk/modules/luni/src/test/impl/org/apache/harmony/tests/internal 03/28/2007 04:56:14 Apply patch for HARMONY-617 ([classlib][luni] HttpURLConnection does not support persistent connections)
added pyang  /harmony/enhanced/classlib/trunk/modules/luni/src/main/java/org/apache/harmony/luni/internal/net/www/protocol/http/HttpConnection.java 03/28/2007 04:56:14 Apply patch for HARMONY-617 ([classlib][luni] HttpURLConnection does not support persistent connections)
added pyang  /harmony/enhanced/classlib/trunk/modules/luni/src/test/impl/org/apache 03/28/2007 04:56:14 Apply patch for HARMONY-617 ([classlib][luni] HttpURLConnection does not support persistent connections)
added pyang  /harmony/enhanced/classlib/trunk/modules/luni/src/test/impl/org/apache/harmony/tests/internal/net/www 03/28/2007 04:56:14 Apply patch for HARMONY-617 ([classlib][luni] HttpURLConnection does not support persistent connections)
added pyang  /harmony/enhanced/classlib/trunk/modules/luni/src/test/impl/org/apache/harmony/tests/internal/net/www/protocol 03/28/2007 04:56:14 Apply patch for HARMONY-617 ([classlib][luni] HttpURLConnection does not support persistent connections)
added pyang  /harmony/enhanced/classlib/trunk/modules/luni/src/main/java/org/apache/harmony/luni/internal/net/www/protocol/http/HttpConfiguration.java 03/28/2007 04:56:14 Apply patch for HARMONY-617 ([classlib][luni] HttpURLConnection does not support persistent connections)
added pyang  /harmony/enhanced/classlib/trunk/modules/luni/src/test/impl/org/apache/harmony 03/28/2007 04:56:14 Apply patch for HARMONY-617 ([classlib][luni] HttpURLConnection does not support persistent connections)
modified pyang  /harmony/enhanced/classlib/trunk/modules/luni/src/test/java/org/apache/harmony/luni/tests/internal/net/www/protocol/http/HttpURLConnectionTest.java 03/28/2007 04:56:14 Apply patch for HARMONY-617 ([classlib][luni] HttpURLConnection does not support persistent connections)
added pyang  /harmony/enhanced/classlib/trunk/modules/luni/src/test/impl/org/apache/harmony/tests 03/28/2007 04:56:14 Apply patch for HARMONY-617 ([classlib][luni] HttpURLConnection does not support persistent connections)
added pyang  /harmony/enhanced/classlib/trunk/modules/luni/src/test/impl/org 03/28/2007 04:56:14 Apply patch for HARMONY-617 ([classlib][luni] HttpURLConnection does not support persistent connections)
modified pyang  /harmony/enhanced/classlib/trunk/modules/luni/build.xml 03/28/2007 04:56:14 Apply patch for HARMONY-617 ([classlib][luni] HttpURLConnection does not support persistent connections)
modified hindessm  /harmony/enhanced/classlib/trunk/modules/luni/src/main/native/launcher/unix/makefile 03/28/2007 04:32:46 Removing trailing whitespace.
add cc-classlib log20070328042215Lbuild.83 03/28/2007 04:22:15classlib
modified hindessm  /harmony/enhanced/classlib/trunk/modules/awt/src/main/native/win32wrapper/windows/makefile 03/28/2007 04:16:49 Removed duplicate line.
modified ayza  /harmony/enhanced/classlib/trunk/modules/awt/build.xml 03/28/2007 04:02:57 Updated fix for HARMONY-3514 ([classlib][awt][build] test executed two times if "-Dtest.case=" is used)
modified pyang  /harmony/enhanced/classlib/trunk/modules/nio/src/main/java/org/apache/harmony/nio/internal/SocketChannelImpl.java 03/28/2007 03:55:05 Apply patch for HARMONY-3475( java.nio.SocketChannel's OutputStream cannot write a single byte)
modified pyang  /harmony/enhanced/classlib/trunk/modules/nio/src/test/java/common/org/apache/harmony/nio/tests/java/nio/channels/SocketChannelTest.java 03/28/2007 03:55:05 Apply patch for HARMONY-3475( java.nio.SocketChannel's OutputStream cannot write a single byte)
modified ayza  /harmony/enhanced/classlib/trunk/modules/awt/build.xml 03/28/2007 03:49:19 Committing fix for HARMONY-3514 ([classlib][awt][build] test executed two times if "-Dtest.case=" is used)
added hindessm  /harmony/enhanced/classlib/trunk/modules/portlib/src/main/native/thrstub 03/28/2007 03:27:23 New files for "[#HARMONY-3090] Create a new table based API for threadlibrary functions".  Note, that I've changed the unix library name toHYTHR_0.2 (from HYTHR_0.1) to give more obvious failures if the wronglibrary is used.
added hindessm  /harmony/enhanced/classlib/trunk/modules/portlib/src/main/native/thrstub/unix/makefile 03/28/2007 03:27:23 New files for "[#HARMONY-3090] Create a new table based API for threadlibrary functions".  Note, that I've changed the unix library name toHYTHR_0.2 (from HYTHR_0.1) to give more obvious failures if the wronglibrary is used.
added hindessm  /harmony/enhanced/classlib/trunk/modules/luni/src/main/native/launcher/windows/main_hlp.c 03/28/2007 03:27:23 New files for "[#HARMONY-3090] Create a new table based API for threadlibrary functions".  Note, that I've changed the unix library name toHYTHR_0.2 (from HYTHR_0.1) to give more obvious failures if the wronglibrary is used.
added hindessm  /harmony/enhanced/classlib/trunk/modules/portlib/src/main/native/thrstub/shared/hythread.h 03/28/2007 03:27:23 New files for "[#HARMONY-3090] Create a new table based API for threadlibrary functions".  Note, that I've changed the unix library name toHYTHR_0.2 (from HYTHR_0.1) to give more obvious failures if the wronglibrary is used.
added hindessm  /harmony/enhanced/classlib/trunk/modules/portlib/src/main/native/thrstub/unix/exports.txt 03/28/2007 03:27:23 New files for "[#HARMONY-3090] Create a new table based API for threadlibrary functions".  Note, that I've changed the unix library name toHYTHR_0.2 (from HYTHR_0.1) to give more obvious failures if the wronglibrary is used.
added hindessm  /harmony/enhanced/classlib/trunk/modules/portlib/src/main/native/thrstub/shared 03/28/2007 03:27:23 New files for "[#HARMONY-3090] Create a new table based API for threadlibrary functions".  Note, that I've changed the unix library name toHYTHR_0.2 (from HYTHR_0.1) to give more obvious failures if the wronglibrary is used.
added hindessm  /harmony/enhanced/classlib/trunk/modules/portlib/src/main/native/thrstub/windows/makefile 03/28/2007 03:27:23 New files for "[#HARMONY-3090] Create a new table based API for threadlibrary functions".  Note, that I've changed the unix library name toHYTHR_0.2 (from HYTHR_0.1) to give more obvious failures if the wronglibrary is used.
added hindessm  /harmony/enhanced/classlib/trunk/modules/portlib/src/main/native/thrstub/unix/DoxygenSupport.txt 03/28/2007 03:27:23 New files for "[#HARMONY-3090] Create a new table based API for threadlibrary functions".  Note, that I've changed the unix library name toHYTHR_0.2 (from HYTHR_0.1) to give more obvious failures if the wronglibrary is used.
added hindessm  /harmony/enhanced/classlib/trunk/modules/portlib/src/main/native/thrstub/windows/DoxygenSupport.txt 03/28/2007 03:27:23 New files for "[#HARMONY-3090] Create a new table based API for threadlibrary functions".  Note, that I've changed the unix library name toHYTHR_0.2 (from HYTHR_0.1) to give more obvious failures if the wronglibrary is used.
added hindessm  /harmony/enhanced/classlib/trunk/modules/portlib/src/main/native/thrstub/unix 03/28/2007 03:27:23 New files for "[#HARMONY-3090] Create a new table based API for threadlibrary functions".  Note, that I've changed the unix library name toHYTHR_0.2 (from HYTHR_0.1) to give more obvious failures if the wronglibrary is used.
added hindessm  /harmony/enhanced/classlib/trunk/modules/luni/src/main/native/launcher/shared/main_hlp.h 03/28/2007 03:27:23 New files for "[#HARMONY-3090] Create a new table based API for threadlibrary functions".  Note, that I've changed the unix library name toHYTHR_0.2 (from HYTHR_0.1) to give more obvious failures if the wronglibrary is used.
added hindessm  /harmony/enhanced/classlib/trunk/modules/portlib/src/main/native/thrstub/windows/hythr.def 03/28/2007 03:27:23 New files for "[#HARMONY-3090] Create a new table based API for threadlibrary functions".  Note, that I've changed the unix library name toHYTHR_0.2 (from HYTHR_0.1) to give more obvious failures if the wronglibrary is used.
added hindessm  /harmony/enhanced/classlib/trunk/modules/portlib/src/main/native/thrstub/windows 03/28/2007 03:27:23 New files for "[#HARMONY-3090] Create a new table based API for threadlibrary functions".  Note, that I've changed the unix library name toHYTHR_0.2 (from HYTHR_0.1) to give more obvious failures if the wronglibrary is used.
added hindessm  /harmony/enhanced/classlib/trunk/modules/portlib/src/main/native/thrstub/windows/hythr.rc 03/28/2007 03:27:23 New files for "[#HARMONY-3090] Create a new table based API for threadlibrary functions".  Note, that I've changed the unix library name toHYTHR_0.2 (from HYTHR_0.1) to give more obvious failures if the wronglibrary is used.
added hindessm  /harmony/enhanced/classlib/trunk/modules/luni/src/main/native/launcher/unix/main_hlp.c 03/28/2007 03:27:23 New files for "[#HARMONY-3090] Create a new table based API for threadlibrary functions".  Note, that I've changed the unix library name toHYTHR_0.2 (from HYTHR_0.1) to give more obvious failures if the wronglibrary is used.
added hindessm  /harmony/enhanced/classlib/trunk/modules/portlib/src/main/native/thrstub/shared/hythread.c 03/28/2007 03:27:23 New files for "[#HARMONY-3090] Create a new table based API for threadlibrary functions".  Note, that I've changed the unix library name toHYTHR_0.2 (from HYTHR_0.1) to give more obvious failures if the wronglibrary is used.
modified hindessm  /harmony/enhanced/classlib/trunk/modules/portlib/src/main/native/port/windows/makefile 03/28/2007 03:22:33 Changes for "[#HARMONY-3090] Create a new table based API for threadlibrary functions".  Currently as an option, -Dhy.no.thr=true, (defaultfalse) until all VMs are ready.  Note that hy.no.thr=true implieshy.no.sig=true because I was too lazy to port the unnecessary sig code.
modified hindessm  /harmony/enhanced/classlib/trunk/modules/portlib/build.xml 03/28/2007 03:22:33 Changes for "[#HARMONY-3090] Create a new table based API for threadlibrary functions".  Currently as an option, -Dhy.no.thr=true, (defaultfalse) until all VMs are ready.  Note that hy.no.thr=true implieshy.no.sig=true because I was too lazy to port the unnecessary sig code.
modified hindessm  /harmony/enhanced/classlib/trunk/modules/luni/src/main/native/launcher/unix/makefile 03/28/2007 03:22:33 Changes for "[#HARMONY-3090] Create a new table based API for threadlibrary functions".  Currently as an option, -Dhy.no.thr=true, (defaultfalse) until all VMs are ready.  Note that hy.no.thr=true implieshy.no.sig=true because I was too lazy to port the unnecessary sig code.
modified hindessm  /harmony/enhanced/classlib/trunk/modules/portlib/src/main/native/port/shared/hyport.c 03/28/2007 03:22:33 Changes for "[#HARMONY-3090] Create a new table based API for threadlibrary functions".  Currently as an option, -Dhy.no.thr=true, (defaultfalse) until all VMs are ready.  Note that hy.no.thr=true implieshy.no.sig=true because I was too lazy to port the unnecessary sig code.
modified hindessm  /harmony/enhanced/classlib/trunk/modules/portlib/src/main/native/port/shared/hytlshelpers.c 03/28/2007 03:22:33 Changes for "[#HARMONY-3090] Create a new table based API for threadlibrary functions".  Currently as an option, -Dhy.no.thr=true, (defaultfalse) until all VMs are ready.  Note that hy.no.thr=true implieshy.no.sig=true because I was too lazy to port the unnecessary sig code.
modified hindessm  /harmony/enhanced/classlib/trunk/modules/portlib/src/main/native/include/shared/hyport.h 03/28/2007 03:22:33 Changes for "[#HARMONY-3090] Create a new table based API for threadlibrary functions".  Currently as an option, -Dhy.no.thr=true, (defaultfalse) until all VMs are ready.  Note that hy.no.thr=true implieshy.no.sig=true because I was too lazy to port the unnecessary sig code.
modified hindessm  /harmony/enhanced/classlib/trunk/modules/portlib/src/main/native/port/shared/portpriv.h 03/28/2007 03:22:33 Changes for "[#HARMONY-3090] Create a new table based API for threadlibrary functions".  Currently as an option, -Dhy.no.thr=true, (defaultfalse) until all VMs are ready.  Note that hy.no.thr=true implieshy.no.sig=true because I was too lazy to port the unnecessary sig code.
modified hindessm  /harmony/enhanced/classlib/trunk/modules/portlib/src/main/native/port/unix/hysignal.c 03/28/2007 03:22:33 Changes for "[#HARMONY-3090] Create a new table based API for threadlibrary functions".  Currently as an option, -Dhy.no.thr=true, (defaultfalse) until all VMs are ready.  Note that hy.no.thr=true implieshy.no.sig=true because I was too lazy to port the unnecessary sig code.
modified hindessm  /harmony/enhanced/classlib/trunk/modules/portlib/src/main/native/port/shared/hynls.c 03/28/2007 03:22:33 Changes for "[#HARMONY-3090] Create a new table based API for threadlibrary functions".  Currently as an option, -Dhy.no.thr=true, (defaultfalse) until all VMs are ready.  Note that hy.no.thr=true implieshy.no.sig=true because I was too lazy to port the unnecessary sig code.
modified hindessm  /harmony/enhanced/classlib/trunk/modules/luni/src/main/native/launcher/shared/main.c 03/28/2007 03:22:33 Changes for "[#HARMONY-3090] Create a new table based API for threadlibrary functions".  Currently as an option, -Dhy.no.thr=true, (defaultfalse) until all VMs are ready.  Note that hy.no.thr=true implieshy.no.sig=true because I was too lazy to port the unnecessary sig code.
modified hindessm  /harmony/enhanced/classlib/trunk/modules/luni/src/main/native/launcher/windows/winmain.c 03/28/2007 03:22:33 Changes for "[#HARMONY-3090] Create a new table based API for threadlibrary functions".  Currently as an option, -Dhy.no.thr=true, (defaultfalse) until all VMs are ready.  Note that hy.no.thr=true implieshy.no.sig=true because I was too lazy to port the unnecessary sig code.
modified hindessm  /harmony/enhanced/classlib/trunk/modules/luni/src/main/native/launcher/windows/makefile.javaw 03/28/2007 03:22:33 Changes for "[#HARMONY-3090] Create a new table based API for threadlibrary functions".  Currently as an option, -Dhy.no.thr=true, (defaultfalse) until all VMs are ready.  Note that hy.no.thr=true implieshy.no.sig=true because I was too lazy to port the unnecessary sig code.
modified hindessm  /harmony/enhanced/classlib/trunk/modules/luni/src/main/native/launcher/shared/cmain.c 03/28/2007 03:22:33 Changes for "[#HARMONY-3090] Create a new table based API for threadlibrary functions".  Currently as an option, -Dhy.no.thr=true, (defaultfalse) until all VMs are ready.  Note that hy.no.thr=true implieshy.no.sig=true because I was too lazy to port the unnecessary sig code.
modified hindessm  /harmony/enhanced/classlib/trunk/modules/portlib/src/main/native/port/windows/hysignal.c 03/28/2007 03:22:33 Changes for "[#HARMONY-3090] Create a new table based API for threadlibrary functions".  Currently as an option, -Dhy.no.thr=true, (defaultfalse) until all VMs are ready.  Note that hy.no.thr=true implieshy.no.sig=true because I was too lazy to port the unnecessary sig code.
modified hindessm  /harmony/enhanced/classlib/trunk/depends/build/defines.mk 03/28/2007 03:22:33 Changes for "[#HARMONY-3090] Create a new table based API for threadlibrary functions".  Currently as an option, -Dhy.no.thr=true, (defaultfalse) until all VMs are ready.  Note that hy.no.thr=true implieshy.no.sig=true because I was too lazy to port the unnecessary sig code.
modified hindessm  /harmony/enhanced/classlib/trunk/depends/build/defines.mak 03/28/2007 03:22:33 Changes for "[#HARMONY-3090] Create a new table based API for threadlibrary functions".  Currently as an option, -Dhy.no.thr=true, (defaultfalse) until all VMs are ready.  Note that hy.no.thr=true implieshy.no.sig=true because I was too lazy to port the unnecessary sig code.
modified hindessm  /harmony/enhanced/classlib/trunk/make/properties.xml 03/28/2007 03:22:33 Changes for "[#HARMONY-3090] Create a new table based API for threadlibrary functions".  Currently as an option, -Dhy.no.thr=true, (defaultfalse) until all VMs are ready.  Note that hy.no.thr=true implieshy.no.sig=true because I was too lazy to port the unnecessary sig code.
modified hindessm  /harmony/enhanced/classlib/trunk/modules/portlib/src/main/native/port/unix/makefile 03/28/2007 03:22:33 Changes for "[#HARMONY-3090] Create a new table based API for threadlibrary functions".  Currently as an option, -Dhy.no.thr=true, (defaultfalse) until all VMs are ready.  Note that hy.no.thr=true implieshy.no.sig=true because I was too lazy to port the unnecessary sig code.
modified hindessm  /harmony/enhanced/classlib/trunk/modules/luni/src/main/native/vmls/shared/vmls.c 03/28/2007 03:22:33 Changes for "[#HARMONY-3090] Create a new table based API for threadlibrary functions".  Currently as an option, -Dhy.no.thr=true, (defaultfalse) until all VMs are ready.  Note that hy.no.thr=true implieshy.no.sig=true because I was too lazy to port the unnecessary sig code.
modified hindessm  /harmony/enhanced/classlib/trunk/modules/luni/src/main/native/launcher/windows/makefile.javae 03/28/2007 03:22:33 Changes for "[#HARMONY-3090] Create a new table based API for threadlibrary functions".  Currently as an option, -Dhy.no.thr=true, (defaultfalse) until all VMs are ready.  Note that hy.no.thr=true implieshy.no.sig=true because I was too lazy to port the unnecessary sig code.
modified hindessm  /harmony/enhanced/classlib/trunk/modules/archive/src/main/native/zip/shared/zipsup.c 03/28/2007 03:22:33 Changes for "[#HARMONY-3090] Create a new table based API for threadlibrary functions".  Currently as an option, -Dhy.no.thr=true, (defaultfalse) until all VMs are ready.  Note that hy.no.thr=true implieshy.no.sig=true because I was too lazy to port the unnecessary sig code.
modified hindessm  /harmony/enhanced/classlib/trunk/modules/awt/src/main/native/win32wrapper/windows/makefile 03/28/2007 03:22:33 Changes for "[#HARMONY-3090] Create a new table based API for threadlibrary functions".  Currently as an option, -Dhy.no.thr=true, (defaultfalse) until all VMs are ready.  Note that hy.no.thr=true implieshy.no.sig=true because I was too lazy to port the unnecessary sig code.
add cc-classlib log20070328031610Lbuild.82 03/28/2007 03:16:10classlib
modified ayza  /harmony/enhanced/classlib/trunk/make/build-test.xml 03/28/2007 03:15:08 Committing fix for HARMONY-3512 ([classlib][build] recompilation of test support classes during every test run)
add cc-classlib log20070327082721Lbuild.81 03/27/2007 08:27:21classlib
modified ayza  /harmony/enhanced/classlib/trunk/modules/luni/src/test/java/org/apache/harmony/luni/tests/java/lang/CharacterTest.java 03/27/2007 08:17:28 Applying patch for CharacterTest from HARMONY-2454 ([classlib][luni] ArrayIndexOutOfBoundsException when calling java.lang.Character.valueOf((char)512))
add cc-classlib log20070327062523Lbuild.80 03/27/2007 06:25:23classlib
added ayza  /harmony/enhanced/classlib/trunk/modules/pack200/src/main/java/org/apache/harmony/pack200/bytecode/ExceptionTableEntry.java 03/27/2007 05:46:41 Update of pack200 classes from HARMONY-3499 ([classlib][pack200] Ongoing implementation of pack200)
added ayza  /harmony/enhanced/classlib/trunk/modules/pack200/src/test/java/org/apache/harmony/pack200/tests/bytecode/ByteCodeTest.java 03/27/2007 05:46:41 Update of pack200 classes from HARMONY-3499 ([classlib][pack200] Ongoing implementation of pack200)
added ayza  /harmony/enhanced/classlib/trunk/modules/pack200/src/main/java/org/apache/harmony/pack200/IMatcher.java 03/27/2007 05:46:41 Update of pack200 classes from HARMONY-3499 ([classlib][pack200] Ongoing implementation of pack200)
added ayza  /harmony/enhanced/classlib/trunk/modules/pack200/src/main/java/org/apache/harmony/pack200/bytecode/ByteCode.java 03/27/2007 05:46:41 Update of pack200 classes from HARMONY-3499 ([classlib][pack200] Ongoing implementation of pack200)
added ayza  /harmony/enhanced/classlib/trunk/modules/pack200/src/main/java/org/apache/harmony/pack200/bytecode/CPRef.java 03/27/2007 05:46:41 Update of pack200 classes from HARMONY-3499 ([classlib][pack200] Ongoing implementation of pack200)
added ayza  /harmony/enhanced/classlib/trunk/modules/pack200/src/main/java/org/apache/harmony/pack200/bytecode/CPMethodRef.java 03/27/2007 05:46:41 Update of pack200 classes from HARMONY-3499 ([classlib][pack200] Ongoing implementation of pack200)
added ayza  /harmony/enhanced/classlib/trunk/modules/pack200/src/main/java/org/apache/harmony/pack200/bytecode/CPInterfaceMethodRef.java 03/27/2007 05:46:41 Update of pack200 classes from HARMONY-3499 ([classlib][pack200] Ongoing implementation of pack200)
added ayza  /harmony/enhanced/classlib/trunk/modules/pack200/src/test/java/org/apache/harmony/pack200/tests/SegmentUtilsTest.java 03/27/2007 05:46:41 Update of pack200 classes from HARMONY-3499 ([classlib][pack200] Ongoing implementation of pack200)
modified ayza  /harmony/enhanced/classlib/trunk/modules/pack200/src/main/java/org/apache/harmony/pack200/bytecode/Attribute.java 03/27/2007 05:46:41 Update of pack200 classes from HARMONY-3499 ([classlib][pack200] Ongoing implementation of pack200)
modified ayza  /harmony/enhanced/classlib/trunk/modules/pack200/src/main/java/org/apache/harmony/pack200/bytecode/CPFieldRef.java 03/27/2007 05:46:41 Update of pack200 classes from HARMONY-3499 ([classlib][pack200] Ongoing implementation of pack200)
modified ayza  /harmony/enhanced/classlib/trunk/modules/pack200/src/main/java/org/apache/harmony/pack200/bytecode/CPMethod.java 03/27/2007 05:46:41 Update of pack200 classes from HARMONY-3499 ([classlib][pack200] Ongoing implementation of pack200)
added ayza  /harmony/enhanced/classlib/trunk/modules/pack200/src/main/java/org/apache/harmony/pack200/SegmentUtils.java 03/27/2007 05:46:41 Update of pack200 classes from HARMONY-3499 ([classlib][pack200] Ongoing implementation of pack200)
modified ayza  /harmony/enhanced/classlib/trunk/modules/pack200/src/main/java/org/apache/harmony/pack200/bytecode/ClassFileEntry.java 03/27/2007 05:46:41 Update of pack200 classes from HARMONY-3499 ([classlib][pack200] Ongoing implementation of pack200)
add cc-classlib log20070326223031Lbuild.79 03/26/2007 22:30:31classlib
modified ayza  /harmony/enhanced/classlib/trunk/modules/swing/src/main/java/common/javax/swing/TransferHandler.java 03/26/2007 14:17:52 Applying patch from HARMONY-3479 ([classlib][swing][netbeans] TransferHandler.getPasteAction().actionPerformed() doesn't check if accessClipboard is allowed). TransferHandlerTest was removed from the exclude list for IBM VME.
modified ayza  /harmony/enhanced/classlib/trunk/modules/swing/make/exclude.windows.x86.ibm 03/26/2007 14:17:52 Applying patch from HARMONY-3479 ([classlib][swing][netbeans] TransferHandler.getPasteAction().actionPerformed() doesn't check if accessClipboard is allowed). TransferHandlerTest was removed from the exclude list for IBM VME.
modified ayza  /harmony/enhanced/classlib/trunk/modules/swing/src/test/api/java/common/javax/swing/TransferHandlerTest.java 03/26/2007 14:17:52 Applying patch from HARMONY-3479 ([classlib][swing][netbeans] TransferHandler.getPasteAction().actionPerformed() doesn't check if accessClipboard is allowed). TransferHandlerTest was removed from the exclude list for IBM VME.
modified ayza  /harmony/enhanced/classlib/trunk/modules/sql/src/main/java/org/apache/harmony/sql/internal/nls/messages.properties 03/26/2007 12:09:25 Applying patch from HARMONY-3492 ([classlib][sql] Implementation for SerialClob.getAsciiStream/setAsciiStream/setCharacterStream)
modified ayza  /harmony/enhanced/classlib/trunk/modules/sql/src/main/java/javax/sql/rowset/serial/SerialClob.java 03/26/2007 12:09:25 Applying patch from HARMONY-3492 ([classlib][sql] Implementation for SerialClob.getAsciiStream/setAsciiStream/setCharacterStream)
modified ayza  /harmony/enhanced/classlib/trunk/modules/sql/src/test/java/org/apache/harmony/sql/tests/javax/sql/rowset/serial/SerialClobTest.java 03/26/2007 12:09:25 Applying patch from HARMONY-3492 ([classlib][sql] Implementation for SerialClob.getAsciiStream/setAsciiStream/setCharacterStream)
modified smishura  /harmony/enhanced/classlib/trunk/modules/awt/src/main/java/common/java/awt/Container.java 03/26/2007 04:14:27 Rollback commit r521764:(Patch for HARMONY-3443 "[classlib][awt][netbeans] Container.paint() throws NPE"2 test cases from java.awt.font.LineBreakMeasurerTest fails on Linux. Will reopen JIRA issue
modified smishura  /harmony/enhanced/classlib/trunk/modules/awt/src/test/api/java/common/java/awt/ContainerRTest.java 03/26/2007 04:14:27 Rollback commit r521764:(Patch for HARMONY-3443 "[classlib][awt][netbeans] Container.paint() throws NPE"2 test cases from java.awt.font.LineBreakMeasurerTest fails on Linux. Will reopen JIRA issue
add cc-classlib log20070323112809Lbuild.78 03/23/2007 11:28:09classlib
modified apetrenko  /harmony/enhanced/classlib/trunk/modules/awt/src/main/java/common/java/awt/Container.java 03/23/2007 10:27:55 Patch for HARMONY-3443 "[classlib][awt][netbeans] Container.paint() throws NPE"
modified apetrenko  /harmony/enhanced/classlib/trunk/modules/awt/src/test/api/java/common/java/awt/ContainerRTest.java 03/23/2007 10:27:55 Patch for HARMONY-3443 "[classlib][awt][netbeans] Container.paint() throws NPE"
add cc-classlib log20070323102237Lbuild.77 03/23/2007 10:22:37classlib
modified ayza  /harmony/enhanced/classlib/trunk/modules/sql/src/main/java/org/apache/harmony/sql/internal/nls/messages.properties 03/23/2007 10:03:21 Applying patch from HARMONY-3459 ([classlib][sql] Implementation for SerialClob.truncate(long))
modified ayza  /harmony/enhanced/classlib/trunk/modules/sql/src/main/java/javax/sql/rowset/serial/SerialClob.java 03/23/2007 10:03:21 Applying patch from HARMONY-3459 ([classlib][sql] Implementation for SerialClob.truncate(long))
modified ayza  /harmony/enhanced/classlib/trunk/modules/sql/src/test/java/org/apache/harmony/sql/tests/javax/sql/rowset/serial/SerialClobTest.java 03/23/2007 10:03:21 Applying patch from HARMONY-3459 ([classlib][sql] Implementation for SerialClob.truncate(long))
modified apetrenko  /harmony/enhanced/classlib/trunk/modules/swing/make/exclude.windows.x86_64.drl 03/23/2007 09:36:30 Few tests has been added to the exclude list for Windows em64t platform in swing module.Part of HARMONY-3483 "[classlib][winx64][testing] initial exclude list for win on arch x86_64 should be created" patch
modified apetrenko  /harmony/enhanced/classlib/trunk/modules/luni/make/exclude.windows.x86_64.drl 03/23/2007 09:34:42 Few tests has been added to the exclude list for Windows em64t platform in luni module.Part of HARMONY-3483 "[classlib][winx64][testing] initial exclude list for win on arch x86_64 should be created" patch
modified apetrenko  /harmony/enhanced/classlib/trunk/modules/beans/make/exclude.windows.x86_64.drl 03/23/2007 09:34:10 Few tests has been added to the exclude list for Windows em64t platform in beans module.Part of HARMONY-3483 "[classlib][winx64][testing] initial exclude list for win on arch x86_64 should be created" patch
modified apetrenko  /harmony/enhanced/classlib/trunk/modules/awt/make/exclude.windows.x86_64.drl 03/23/2007 09:30:10 Exclude list for Windows em64t platform in awt module has been created.Part of HARMONY-3483 "[classlib][winx64][testing] initial exclude list for win on arch x86_64 should be created" patch
add cc-classlib log20070323091715Lbuild.76 03/23/2007 09:17:15classlib
modified ayza  /harmony/enhanced/classlib/trunk/modules/awt/make/exclude.linux.x86.ibm.interm 03/23/2007 08:35:20 java.awt.WindowTest was added to intermittent exclude list for IBM VME on linux because it periodically fails in CC environment.
add cc-classlib log20070323081159Lbuild.75 03/23/2007 08:11:59classlib
modified ayza  /harmony/enhanced/classlib/trunk/modules/luni/src/main/java/java/net/URLClassLoader.java 03/23/2007 07:51:25 Fixing encoding / decoding of resource name in URLClassLoader. See HARMONY-3461.
modified ayza  /harmony/enhanced/classlib/trunk/modules/luni/src/test/java/tests/api/java/net/URLClassLoaderTest.java 03/23/2007 07:51:25 Fixing encoding / decoding of resource name in URLClassLoader. See HARMONY-3461.
modified gshimansky  /harmony/enhanced/classlib/trunk/modules/portlib/src/main/native/include/shared/hycomp.h 03/23/2007 07:48:19 Applied HARMONY-3478 [classlib][winx64] Class library uses 32-bit UDATA and IDATA types
modified gshimansky  /harmony/enhanced/classlib/trunk/depends/build/defines.mak 03/23/2007 07:48:19 Applied HARMONY-3478 [classlib][winx64] Class library uses 32-bit UDATA and IDATA types
add cc-classlib log20070323061126Lbuild.74 03/23/2007 06:11:26classlib
added ayza  /harmony/enhanced/classlib/trunk/modules/imageio/make/exclude.linux.x86.ibm.interm 03/23/2007 05:20:05 Adding javax.imageio.ImageIOTest to intermittent exclude list for IBM VME since CC periodically reports about this failure
add cc-classlib log20070323050612Lbuild.73 03/23/2007 05:06:12classlib
modified liangyx  /harmony/enhanced/classlib/trunk/modules/luni/src/main/java/java/util/ArrayList.java 03/23/2007 04:16:58 Apply patch for HARMONY-3481([classlib][luni] ArrayList throw ArrayIndexOutOfBoundsException when invoking addAll(Collection) after removing some elements)
modified liangyx  /harmony/enhanced/classlib/trunk/modules/luni/src/test/java/tests/api/java/util/ArrayListTest.java 03/23/2007 04:16:58 Apply patch for HARMONY-3481([classlib][luni] ArrayList throw ArrayIndexOutOfBoundsException when invoking addAll(Collection) after removing some elements)
add cc-classlib log20070323011642Lbuild.72 03/23/2007 01:16:42classlib
modified smishura  /harmony/enhanced/classlib/trunk/modules/suncompat/build.xml 03/23/2007 00:33:20 Apply patch for the rest of modules from HARMONY-3187:([classlib][testing] test case should be run only once when specified through the command line)
modified smishura  /harmony/enhanced/classlib/trunk/modules/regex/build.xml 03/23/2007 00:33:20 Apply patch for the rest of modules from HARMONY-3187:([classlib][testing] test case should be run only once when specified through the command line)
modified smishura  /harmony/enhanced/classlib/trunk/modules/annotation/build.xml 03/23/2007 00:33:20 Apply patch for the rest of modules from HARMONY-3187:([classlib][testing] test case should be run only once when specified through the command line)
modified smishura  /harmony/enhanced/classlib/trunk/modules/imageio/build.xml 03/23/2007 00:33:20 Apply patch for the rest of modules from HARMONY-3187:([classlib][testing] test case should be run only once when specified through the command line)
modified smishura  /harmony/enhanced/classlib/trunk/modules/prefs/build.xml 03/23/2007 00:33:20 Apply patch for the rest of modules from HARMONY-3187:([classlib][testing] test case should be run only once when specified through the command line)
modified smishura  /harmony/enhanced/classlib/trunk/modules/crypto/build.xml 03/23/2007 00:33:20 Apply patch for the rest of modules from HARMONY-3187:([classlib][testing] test case should be run only once when specified through the command line)
modified smishura  /harmony/enhanced/classlib/trunk/modules/archive/build.xml 03/23/2007 00:33:20 Apply patch for the rest of modules from HARMONY-3187:([classlib][testing] test case should be run only once when specified through the command line)
modified smishura  /harmony/enhanced/classlib/trunk/modules/concurrent/build.xml 03/23/2007 00:33:20 Apply patch for the rest of modules from HARMONY-3187:([classlib][testing] test case should be run only once when specified through the command line)
modified smishura  /harmony/enhanced/classlib/trunk/modules/nio_char/build.xml 03/23/2007 00:33:20 Apply patch for the rest of modules from HARMONY-3187:([classlib][testing] test case should be run only once when specified through the command line)
modified smishura  /harmony/enhanced/classlib/trunk/modules/jndi/build.xml 03/23/2007 00:33:20 Apply patch for the rest of modules from HARMONY-3187:([classlib][testing] test case should be run only once when specified through the command line)
modified smishura  /harmony/enhanced/classlib/trunk/modules/text/build.xml 03/23/2007 00:33:20 Apply patch for the rest of modules from HARMONY-3187:([classlib][testing] test case should be run only once when specified through the command line)
modified smishura  /harmony/enhanced/classlib/trunk/modules/applet/build.xml 03/23/2007 00:33:20 Apply patch for the rest of modules from HARMONY-3187:([classlib][testing] test case should be run only once when specified through the command line)
modified smishura  /harmony/enhanced/classlib/trunk/modules/nio/build.xml 03/23/2007 00:33:20 Apply patch for the rest of modules from HARMONY-3187:([classlib][testing] test case should be run only once when specified through the command line)
modified smishura  /harmony/enhanced/classlib/trunk/modules/logging/build.xml 03/23/2007 00:33:20 Apply patch for the rest of modules from HARMONY-3187:([classlib][testing] test case should be run only once when specified through the command line)
modified smishura  /harmony/enhanced/classlib/trunk/modules/rmi/build.xml 03/23/2007 00:33:20 Apply patch for the rest of modules from HARMONY-3187:([classlib][testing] test case should be run only once when specified through the command line)
modified smishura  /harmony/enhanced/classlib/trunk/modules/swing/build.xml 03/23/2007 00:33:20 Apply patch for the rest of modules from HARMONY-3187:([classlib][testing] test case should be run only once when specified through the command line)
modified smishura  /harmony/enhanced/classlib/trunk/modules/accessibility/build.xml 03/23/2007 00:33:20 Apply patch for the rest of modules from HARMONY-3187:([classlib][testing] test case should be run only once when specified through the command line)
modified smishura  /harmony/enhanced/classlib/trunk/modules/sound/build.xml 03/23/2007 00:33:20 Apply patch for the rest of modules from HARMONY-3187:([classlib][testing] test case should be run only once when specified through the command line)
modified smishura  /harmony/enhanced/classlib/trunk/modules/beans/build.xml 03/23/2007 00:33:20 Apply patch for the rest of modules from HARMONY-3187:([classlib][testing] test case should be run only once when specified through the command line)
modified smishura  /harmony/enhanced/classlib/trunk/modules/math/build.xml 03/23/2007 00:33:20 Apply patch for the rest of modules from HARMONY-3187:([classlib][testing] test case should be run only once when specified through the command line)
modified smishura  /harmony/enhanced/classlib/trunk/modules/awt/build.xml 03/23/2007 00:33:20 Apply patch for the rest of modules from HARMONY-3187:([classlib][testing] test case should be run only once when specified through the command line)
modified smishura  /harmony/enhanced/classlib/trunk/modules/misc/build.xml 03/23/2007 00:33:20 Apply patch for the rest of modules from HARMONY-3187:([classlib][testing] test case should be run only once when specified through the command line)
modified smishura  /harmony/enhanced/classlib/trunk/modules/x-net/build.xml 03/23/2007 00:33:20 Apply patch for the rest of modules from HARMONY-3187:([classlib][testing] test case should be run only once when specified through the command line)
modified smishura  /harmony/enhanced/classlib/trunk/modules/print/build.xml 03/23/2007 00:33:20 Apply patch for the rest of modules from HARMONY-3187:([classlib][testing] test case should be run only once when specified through the command line)
modified smishura  /harmony/enhanced/classlib/trunk/modules/sql/build.xml 03/23/2007 00:33:20 Apply patch for the rest of modules from HARMONY-3187:([classlib][testing] test case should be run only once when specified through the command line)
modified smishura  /harmony/enhanced/classlib/trunk/modules/pack200/build.xml 03/23/2007 00:33:20 Apply patch for the rest of modules from HARMONY-3187:([classlib][testing] test case should be run only once when specified through the command line)
modified smishura  /harmony/enhanced/classlib/trunk/modules/tools/build.xml 03/23/2007 00:33:20 Apply patch for the rest of modules from HARMONY-3187:([classlib][testing] test case should be run only once when specified through the command line)
modified smishura  /harmony/enhanced/classlib/trunk/modules/auth/build.xml 03/23/2007 00:33:20 Apply patch for the rest of modules from HARMONY-3187:([classlib][testing] test case should be run only once when specified through the command line)
modified smishura  /harmony/enhanced/classlib/trunk/modules/luni/build.xml 03/23/2007 00:33:20 Apply patch for the rest of modules from HARMONY-3187:([classlib][testing] test case should be run only once when specified through the command line)
modified smishura  /harmony/enhanced/classlib/trunk/modules/security/build.xml 03/23/2007 00:33:20 Apply patch for the rest of modules from HARMONY-3187:([classlib][testing] test case should be run only once when specified through the command line)
modified smishura  /harmony/enhanced/classlib/trunk/modules/instrument/build.xml 03/23/2007 00:33:20 Apply patch for the rest of modules from HARMONY-3187:([classlib][testing] test case should be run only once when specified through the command line)
add cc-classlib log20070322112718Lbuild.71 03/22/2007 11:27:18classlib
modified odeakin  /harmony/enhanced/classlib/trunk/modules/luni/src/main/native/launcher/shared/cmain.c 03/22/2007 10:41:10 Fix compilation errors on Windows x86 with -Dhy.no.sig=true.
modified odeakin  /harmony/enhanced/classlib/trunk/modules/portlib/src/main/native/port/shared/hyportcontrol.c 03/22/2007 10:41:10 Fix compilation errors on Windows x86 with -Dhy.no.sig=true.
modified odeakin  /harmony/enhanced/classlib/trunk/modules/nio/src/main/native/nio/windows/makefile 03/22/2007 10:41:10 Fix compilation errors on Windows x86 with -Dhy.no.sig=true.
add cc-classlib log20070322073927Lbuild.70 03/22/2007 07:39:27classlib
modified apetrenko  /harmony/enhanced/classlib/trunk/modules/luni/src/main/java/java/util/PropertyPermission.java 03/22/2007 06:49:21 Patch for HARMONY-3468 "[classlib][luni]toLowerCase in Constructor of PropertyPermission could be optimized"
add cc-classlib log20070322054039Lbuild.69 03/22/2007 05:40:39classlib
modified apetrenko  /harmony/enhanced/classlib/trunk/modules/luni/src/main/java/java/io/ByteArrayOutputStream.java 03/22/2007 05:39:34 Patch for HARMONY-3373 "[classlib][luni]java.io.ByteArrayOutputStream: avoid to use exception mechanism as logic in write(int)"
modified smishura  /harmony/enhanced/classlib/trunk/modules/security/src/test/api/java/org/apache/harmony/security/tests/java/security/cert/X509Certificate2Test.java 03/22/2007 05:19:37 Format + fix JUnit-style
add cc-classlib log20070322043428Lbuild.68 03/22/2007 04:34:28classlib
modified pyang  /harmony/enhanced/classlib/trunk/modules/portlib/src/main/native/port/unix/hysock.c 03/22/2007 04:04:41 Apply patch for HARMONY-2387([classlib][luni] org.apache.harmony.tests.internal.net.www.protocol.http.HttpURLConnectionTest.testUsingProxy() intermittently fails)
modified pyang  /harmony/enhanced/classlib/trunk/modules/luni/src/main/native/luni/unix/OSFileSystemLinux32.c 03/22/2007 04:02:25 Apply patch for HARMONY-3334([classlib][luni-native] Native Method XXX_transferImpl in luni/src/main/native/luni/unix/OSFileSystemLinux32.c did not handle endian properly)
add cc-classlib log20070322022024Lbuild.67 03/22/2007 02:20:24classlib
modified liangyx  /harmony/enhanced/classlib/trunk/modules/annotation/src/test/java/org/apache/harmony/annotation/tests/java/lang/annotation/IncompleteAnnotationExceptionTest.java 03/22/2007 01:49:51 Apply patch for HARMONY-3466([classlib][luni] Add testcases for package java.lang.annotation)
added liangyx  /harmony/enhanced/classlib/trunk/modules/annotation/src/test/java/org/apache/harmony/annotation/tests/java/lang/annotation/ElementTypeTest.java 03/22/2007 01:49:51 Apply patch for HARMONY-3466([classlib][luni] Add testcases for package java.lang.annotation)
added liangyx  /harmony/enhanced/classlib/trunk/modules/annotation/src/test/java/org/apache/harmony/annotation/tests/java/lang/annotation/AnnotationFormatErrorTest.java 03/22/2007 01:49:51 Apply patch for HARMONY-3466([classlib][luni] Add testcases for package java.lang.annotation)
added liangyx  /harmony/enhanced/classlib/trunk/modules/annotation/src/test/java/org/apache/harmony/annotation/tests/java/lang/annotation/AnnotationTypeMismatchExceptionTest.java 03/22/2007 01:49:51 Apply patch for HARMONY-3466([classlib][luni] Add testcases for package java.lang.annotation)
added liangyx  /harmony/enhanced/classlib/trunk/modules/annotation/src/test/java/org/apache/harmony/annotation/tests/java/lang/annotation/RetentionPolicyTest.java 03/22/2007 01:49:51 Apply patch for HARMONY-3466([classlib][luni] Add testcases for package java.lang.annotation)
add cc-classlib log20070321221358Lbuild.66 03/21/2007 22:13:58classlib
modified smishura  /harmony/enhanced/classlib/trunk/modules/security/src/test/support/common/java/org/apache/harmony/security/tests/support/cert/TestUtils.java 03/21/2007 22:09:57 Fix and regression test for HARMONY-3384:([classlib][security]java.security.cert.X509Certificate.toString() throws NullPointerException)
modified smishura  /harmony/enhanced/classlib/trunk/modules/security/src/main/java/common/org/apache/harmony/security/x509/AuthorityKeyIdentifier.java 03/21/2007 22:09:57 Fix and regression test for HARMONY-3384:([classlib][security]java.security.cert.X509Certificate.toString() throws NullPointerException)
modified smishura  /harmony/enhanced/classlib/trunk/modules/security/src/test/api/java/org/apache/harmony/security/tests/java/security/cert/X509Certificate2Test.java 03/21/2007 22:09:57 Fix and regression test for HARMONY-3384:([classlib][security]java.security.cert.X509Certificate.toString() throws NullPointerException)
add cc-classlib log20070321145438Lbuild.65 03/21/2007 14:54:38classlib
modified ayza  /harmony/enhanced/classlib/trunk/modules/luni/src/main/java/java/net/URLClassLoader.java 03/21/2007 14:50:13 Applying fix for URLClassLoader and a new test for URLClassLoaderTest. Inspired by HARMONY-3461 ([classlib][net] URLClassLoader cannot find a resource if a file name contains whitespaces).
modified ayza  /harmony/enhanced/classlib/trunk/modules/luni/src/test/java/tests/api/java/net/URLClassLoaderTest.java 03/21/2007 14:50:13 Applying fix for URLClassLoader and a new test for URLClassLoaderTest. Inspired by HARMONY-3461 ([classlib][net] URLClassLoader cannot find a resource if a file name contains whitespaces).
add cc-classlib log20070321120234Lbuild.64 03/21/2007 12:02:34classlib
modified ayza  /harmony/enhanced/classlib/trunk/modules/archive/src/test/java/org/apache/harmony/archive/tests/java/util/jar/JarEntryTest.java 03/21/2007 11:17:51 Applying patch from HARMONY-3424 ([classlib][archive]java.util.jar.JarEntry fails to get certificate while another instance jarEntry of the same jarFile has readed all the data of the same entry)
modified ayza  /harmony/enhanced/classlib/trunk/modules/archive/src/main/java/java/util/jar/JarVerifier.java 03/21/2007 11:17:51 Applying patch from HARMONY-3424 ([classlib][archive]java.util.jar.JarEntry fails to get certificate while another instance jarEntry of the same jarFile has readed all the data of the same entry)
modified ayza  /harmony/enhanced/classlib/trunk/modules/archive/src/main/java/java/util/jar/JarFile.java 03/21/2007 11:17:51 Applying patch from HARMONY-3424 ([classlib][archive]java.util.jar.JarEntry fails to get certificate while another instance jarEntry of the same jarFile has readed all the data of the same entry)
modified ayza  /harmony/enhanced/classlib/trunk/modules/archive/src/main/java/java/util/jar/JarEntry.java 03/21/2007 11:17:51 Applying patch from HARMONY-3424 ([classlib][archive]java.util.jar.JarEntry fails to get certificate while another instance jarEntry of the same jarFile has readed all the data of the same entry)
add cc-classlib log20070321071808Lbuild.63 03/21/2007 07:18:08classlib
modified ayza  /harmony/enhanced/classlib/trunk/make/build-test.xml 03/21/2007 06:35:43 Committing patch from HARMONY-3014 ([classlib][exclude] runtime name should be defined automatically)
modified ayza  /harmony/enhanced/classlib/trunk/make/properties.xml 03/21/2007 06:35:43 Committing patch from HARMONY-3014 ([classlib][exclude] runtime name should be defined automatically)
add cc-classlib log20070321061327Lbuild.62 03/21/2007 06:13:27classlib
modified ayza  /harmony/enhanced/classlib/trunk/modules/imageio/src/test/java/javax/imageio/ImageIOTest.java 03/21/2007 05:29:24 Log message was added
add cc-classlib log20070321051017Lbuild.61 03/21/2007 05:10:17classlib
modified apetrenko  /harmony/enhanced/classlib/trunk/modules/swing/src/test/api/java/common/javax/swing/UIDefaultsTest.java 03/21/2007 04:08:47 Patch for HARMONY-3445 "[classlib][swing] UIDefaultsTest restructurized"
add cc-classlib log20070321040642Lbuild.60 03/21/2007 04:06:42classlib
modified apetrenko  /harmony/enhanced/classlib/trunk/modules/luni/make/exclude.linux.x86_64.drl 03/21/2007 03:44:06 Patch for HARMONY-3454 "[classlib][swing] JEditorPane.createEditorKitForContentType() uses wrong classloader"
modified apetrenko  /harmony/enhanced/classlib/trunk/modules/luni/src/test/java/tests/api/java/net/MulticastSocketTest.java 03/21/2007 03:44:06 Patch for HARMONY-3454 "[classlib][swing] JEditorPane.createEditorKitForContentType() uses wrong classloader"
modified apetrenko  /harmony/enhanced/classlib/trunk/modules/luni/make/exclude.windows.x86_64.drl 03/21/2007 03:44:06 Patch for HARMONY-3454 "[classlib][swing] JEditorPane.createEditorKitForContentType() uses wrong classloader"
modified apetrenko  /harmony/enhanced/classlib/trunk/modules/luni/make/exclude.common 03/21/2007 03:44:06 Patch for HARMONY-3454 "[classlib][swing] JEditorPane.createEditorKitForContentType() uses wrong classloader"
modified apetrenko  /harmony/enhanced/classlib/trunk/modules/luni/src/test/java/tests/api/java/net/SocketImplTest.java 03/21/2007 03:36:01 Patch for HARMONY-3435 "[classlib][luni]move out src/test/java/tests/api/java/net/SocketImplTest.java"
modified apetrenko  /harmony/enhanced/classlib/trunk/modules/luni/src/test/java/tests/api/java/net/ExcludedProxyTest.java 03/21/2007 03:36:01 Patch for HARMONY-3435 "[classlib][luni]move out src/test/java/tests/api/java/net/SocketImplTest.java"
modified apetrenko  /harmony/enhanced/classlib/trunk/modules/luni/make/exclude.common 03/21/2007 03:36:01 Patch for HARMONY-3435 "[classlib][luni]move out src/test/java/tests/api/java/net/SocketImplTest.java"
add cc-classlib log20070321030302Lbuild.59 03/21/2007 03:03:02classlib
modified apetrenko  /harmony/enhanced/classlib/trunk/modules/luni/src/main/java/java/util/TreeMap.java 03/21/2007 02:14:32 Patch for HARMONY-2474 "[classlib][luni] java.util.TreeSet.remove() throw ClassCastException while trying to remove element from empty TreeSet"
modified apetrenko  /harmony/enhanced/classlib/trunk/modules/luni/src/test/java/tests/api/java/util/TreeMapTest.java 03/21/2007 02:14:32 Patch for HARMONY-2474 "[classlib][luni] java.util.TreeSet.remove() throw ClassCastException while trying to remove element from empty TreeSet"
add cc-classlib log20070320222752Lbuild.58 03/20/2007 22:27:52classlib
added smishura  /harmony/enhanced/classlib/trunk/modules/imageio/make/exclude.linux.x86_64.drl 03/20/2007 22:17:31 Add javax.imageio.ImageIOTest to exclude list for x86_64/Linux/DRL VMsee HARMONY-3135:([classlib][imageio] unexpected InterruptedException after loading png-image)
add cc-classlib log20070320095340Lbuild.57 03/20/2007 09:53:40classlib
modified ayza  /harmony/enhanced/classlib/trunk/modules/sql/src/main/java/javax/sql/rowset/serial/SerialClob.java 03/20/2007 09:19:56 Applying patch from HARMONY-3438 ([classlib][sql] Implementation for SerialClob.position(Clob, long))
modified ayza  /harmony/enhanced/classlib/trunk/modules/sql/src/test/java/org/apache/harmony/sql/tests/javax/sql/rowset/serial/SerialClobTest.java 03/20/2007 09:19:56 Applying patch from HARMONY-3438 ([classlib][sql] Implementation for SerialClob.position(Clob, long))
add cc-classlib log20070320085050Lbuild.56 03/20/2007 08:50:50classlib
modified ayza  /harmony/enhanced/classlib/trunk/modules/imageio/build.xml 03/20/2007 08:07:44 Fixing threading issue in ImageIO. See HARMONY-3135 ([classlib][imageio] unexpected InterruptedException after loading png-image)
added ayza  /harmony/enhanced/classlib/trunk/modules/imageio/src/test/java/javax 03/20/2007 08:07:44 Fixing threading issue in ImageIO. See HARMONY-3135 ([classlib][imageio] unexpected InterruptedException after loading png-image)
added ayza  /harmony/enhanced/classlib/trunk/modules/imageio/src/test/resources 03/20/2007 08:07:44 Fixing threading issue in ImageIO. See HARMONY-3135 ([classlib][imageio] unexpected InterruptedException after loading png-image)
modified ayza  /harmony/enhanced/classlib/trunk/modules/imageio/src/main/java/org/apache/harmony/x/imageio/plugins/png/PNGImageReader.java 03/20/2007 08:07:44 Fixing threading issue in ImageIO. See HARMONY-3135 ([classlib][imageio] unexpected InterruptedException after loading png-image)
modified ayza  /harmony/enhanced/classlib/trunk/modules/imageio/src/main/java/org/apache/harmony/x/imageio/plugins/jpeg/JPEGImageReader.java 03/20/2007 08:07:44 Fixing threading issue in ImageIO. See HARMONY-3135 ([classlib][imageio] unexpected InterruptedException after loading png-image)
added ayza  /harmony/enhanced/classlib/trunk/modules/imageio/src/test/java/javax/imageio/ImageIOTest.java 03/20/2007 08:07:44 Fixing threading issue in ImageIO. See HARMONY-3135 ([classlib][imageio] unexpected InterruptedException after loading png-image)
added ayza  /harmony/enhanced/classlib/trunk/modules/imageio/src/test/resources/images 03/20/2007 08:07:44 Fixing threading issue in ImageIO. See HARMONY-3135 ([classlib][imageio] unexpected InterruptedException after loading png-image)
added ayza  /harmony/enhanced/classlib/trunk/modules/imageio/src/test/resources/images/utest.jpg 03/20/2007 08:07:44 Fixing threading issue in ImageIO. See HARMONY-3135 ([classlib][imageio] unexpected InterruptedException after loading png-image)
added ayza  /harmony/enhanced/classlib/trunk/modules/imageio/src/test/java/javax/imageio 03/20/2007 08:07:44 Fixing threading issue in ImageIO. See HARMONY-3135 ([classlib][imageio] unexpected InterruptedException after loading png-image)
added ayza  /harmony/enhanced/classlib/trunk/modules/imageio/src/test/resources/images/utest.png 03/20/2007 08:07:44 Fixing threading issue in ImageIO. See HARMONY-3135 ([classlib][imageio] unexpected InterruptedException after loading png-image)
add cc-classlib log20070320065506Lbuild.55 03/20/2007 06:55:06classlib
modified pyang  /harmony/enhanced/classlib/trunk/modules/luni/src/main/java/java/net/URLClassLoader.java 03/20/2007 06:21:49 Apply patch for HARMONY-3332 ([classlib][luni]URLClassLoader throws NullPointerException while load an implementation class of a security provider in a jar which is signed.)
modified pyang  /harmony/enhanced/classlib/trunk/modules/archive/src/main/java/java/util/jar/JarVerifier.java 03/20/2007 06:21:49 Apply patch for HARMONY-3332 ([classlib][luni]URLClassLoader throws NullPointerException while load an implementation class of a security provider in a jar which is signed.)
modified pyang  /harmony/enhanced/classlib/trunk/modules/luni/src/test/java/org/apache/harmony/luni/tests/java/lang/ClassTest.java 03/20/2007 06:21:49 Apply patch for HARMONY-3332 ([classlib][luni]URLClassLoader throws NullPointerException while load an implementation class of a security provider in a jar which is signed.)
modified pyang  /harmony/enhanced/classlib/trunk/modules/luni/src/test/java/tests/api/java/net/JarURLConnectionTest.java 03/20/2007 06:18:25 Apply patch for HARMONY-3436 ([classlib][luni]java.net.JarURLConnection gets different jarFile when the inputstream has been closed if cache is not used.)
modified pyang  /harmony/enhanced/classlib/trunk/modules/luni/src/main/java/org/apache/harmony/luni/internal/net/www/protocol/jar/JarURLConnection.java 03/20/2007 06:18:25 Apply patch for HARMONY-3436 ([classlib][luni]java.net.JarURLConnection gets different jarFile when the inputstream has been closed if cache is not used.)
modified pyang  /harmony/enhanced/classlib/trunk/modules/luni/src/main/java/org/apache/harmony/luni/util/ExternalMessages.properties 03/20/2007 06:18:25 Apply patch for HARMONY-3436 ([classlib][luni]java.net.JarURLConnection gets different jarFile when the inputstream has been closed if cache is not used.)
add cc-classlib log20070320003453Lbuild.54 03/20/2007 00:34:53classlib
added smishura  /harmony/enhanced/classlib/trunk/modules/security/src/main/java/common/org/apache/harmony/security/x509/X509PublicKey.java 03/19/2007 23:51:39 Fix bug revealed after HARMONY-3384 evaluation:([classlib][security]java.security.cert.X509Certificate.toString() throws NullPointerException)SubjectPublicKeyInfo.getPublicKey() returned null and printed an exception stack trace if key's algorithm is unknown. Now in this case key object (that contains parsed data:oid,key bytes) is returned.
modified smishura  /harmony/enhanced/classlib/trunk/modules/security/src/test/api/java/org/apache/harmony/security/tests/java/security/cert/X509CertSelectorTest.java 03/19/2007 23:51:39 Fix bug revealed after HARMONY-3384 evaluation:([classlib][security]java.security.cert.X509Certificate.toString() throws NullPointerException)SubjectPublicKeyInfo.getPublicKey() returned null and printed an exception stack trace if key's algorithm is unknown. Now in this case key object (that contains parsed data:oid,key bytes) is returned.
modified smishura  /harmony/enhanced/classlib/trunk/modules/security/src/main/java/common/org/apache/harmony/security/x509/SubjectPublicKeyInfo.java 03/19/2007 23:51:39 Fix bug revealed after HARMONY-3384 evaluation:([classlib][security]java.security.cert.X509Certificate.toString() throws NullPointerException)SubjectPublicKeyInfo.getPublicKey() returned null and printed an exception stack trace if key's algorithm is unknown. Now in this case key object (that contains parsed data:oid,key bytes) is returned.
add cc-classlib log20070319102147Lbuild.53 03/19/2007 10:21:47classlib
modified apetrenko  /harmony/enhanced/classlib/trunk/modules/swing/src/main/java/common/javax/swing/plaf/basic/BasicProgressBarUI.java 03/19/2007 09:53:15 Patch for HARMONY-2698 "[classlib][swing] javax.swing.plaf.basic.BasicProgressBarUI.getPreferredInnerHorizontal() returns null while RI throws NPE"
modified apetrenko  /harmony/enhanced/classlib/trunk/modules/swing/src/test/api/java/common/javax/swing/plaf/basic/BasicProgressBarUITest.java 03/19/2007 09:53:15 Patch for HARMONY-2698 "[classlib][swing] javax.swing.plaf.basic.BasicProgressBarUI.getPreferredInnerHorizontal() returns null while RI throws NPE"
modified apetrenko  /harmony/enhanced/classlib/trunk/modules/swing/src/main/java/common/javax/swing/UIDefaults.java 03/19/2007 09:21:43 Patch for HARMONY-3420 "[classlib][swing] UIDefaults.ProxyLazyValue.createValue() uses wrong classloader"
modified apetrenko  /harmony/enhanced/classlib/trunk/modules/swing/src/test/api/java/common/javax/swing/UIDefaultsTest.java 03/19/2007 09:21:43 Patch for HARMONY-3420 "[classlib][swing] UIDefaults.ProxyLazyValue.createValue() uses wrong classloader"
add cc-classlib log20070319091928Lbuild.52 03/19/2007 09:19:28classlib
modified apetrenko  /harmony/enhanced/classlib/trunk/modules/swing/src/main/java/common/javax/swing/UIDefaults.java 03/19/2007 09:02:14 Patch for HARMONY-3398 "[classlib][swing] UIDefaults.getUIClass() uses wrong classloader"
modified apetrenko  /harmony/enhanced/classlib/trunk/modules/swing/src/test/api/java/common/javax/swing/UIDefaultsTest.java 03/19/2007 09:02:14 Patch for HARMONY-3398 "[classlib][swing] UIDefaults.getUIClass() uses wrong classloader"
add cc-classlib log20070319054035Lbuild.51 03/19/2007 05:40:35classlib
modified ayza  /harmony/enhanced/classlib/trunk/modules/swing/src/main/java/common/javax/swing/UIDefaults.java 03/19/2007 05:01:45 Applying patch from HARMONY-3385 ([classlib][swing][netbeans] UIDefaults.getUI() uses wrong classloader)
modified ayza  /harmony/enhanced/classlib/trunk/modules/swing/src/test/api/java/common/javax/swing/UIDefaultsTest.java 03/19/2007 05:01:45 Applying patch from HARMONY-3385 ([classlib][swing][netbeans] UIDefaults.getUI() uses wrong classloader)
add cc-classlib log20070317114636Lbuild.50 03/17/2007 11:46:36classlib
modified apetrenko  /harmony/enhanced/classlib/trunk/modules/swing/src/main/java/common/javax/swing/RepaintManager.java 03/17/2007 11:01:58 Patch for HARMONY-3418 "[classlib][swing] RepaintManager constructor must be public"
add cc-classlib log20070317061258Lbuild.49 03/17/2007 06:12:58classlib
modified apetrenko  /harmony/enhanced/classlib/trunk/modules/awt/src/main/java/windows/org/apache/harmony/awt/gl/windows/WinGDIPGraphics2D.java 03/17/2007 05:41:02 Patch for HARMONY-2050 "[classlib][awt] Incorrect drawing of dashed line"
add cc-classlib log20070317051108Lbuild.48 03/17/2007 05:11:08classlib
modified apetrenko  /harmony/enhanced/classlib/trunk/modules/swing/src/main/java/common/javax/swing/plaf/basic/BasicFileChooserUI.java 03/17/2007 04:34:29 This patch is a correct fix for HARMONY-2606 "[classlib][swing][plaf] javax.swing.plaf.basic.BasicFileChooserUI.ensureFileIsVisible(..) throws unexpected NPE" and it also removes a regression introduced by previous patch
add cc-classlib log20070316160615Lbuild.47 03/16/2007 16:06:15classlib
modified ayza  /harmony/enhanced/classlib/trunk/modules/awt/make/exclude.windows.x86.drl.interm 03/16/2007 15:16:13 Moving java.awt.WindowTest to intermittent exclude list for DRLVM on Win32
add cc-classlib log20070316141259Lbuild.46 03/16/2007 14:12:59classlib
modified apetrenko  /harmony/enhanced/classlib/trunk/modules/awt/src/main/java/common/java/awt/Component.java 03/16/2007 13:41:14 Patch for HARMONY-3416 "[classlib][awt] Unneeded Dimension object copying in Component.minimumSize method"
add cc-classlib log20070316121921Lbuild.45 03/16/2007 12:19:21classlib
modified ayza  /harmony/enhanced/classlib/trunk/modules/swing/src/test/api/java/common/javax/swing/text/GapContent_GapVectorTest.java 03/16/2007 12:17:30 Committing patches from HARMONY-2198 ([classlib][swing] compatibility: j.s.text.GapContent.replace is not compatible with RI)
modified ayza  /harmony/enhanced/classlib/trunk/modules/swing/src/main/java/common/javax/swing/text/GapContent.java 03/16/2007 12:17:30 Committing patches from HARMONY-2198 ([classlib][swing] compatibility: j.s.text.GapContent.replace is not compatible with RI)
add cc-classlib log20070316111749Lbuild.44 03/16/2007 11:17:49classlib
modified ayza  /harmony/enhanced/classlib/trunk/modules/awt/make/exclude.linux.x86.ibm.interm 03/16/2007 11:11:52 Removing extra space after "java/awt/AccessibleAWTWindowTest.java"
add cc-classlib log20070316101636Lbuild.43 03/16/2007 10:16:36classlib
modified ayza  /harmony/enhanced/classlib/trunk/modules/awt/src/test/api/java/common/java/awt/FrameRTest.java 03/16/2007 10:05:55 Applying patch from HARMONY-3318 ([classlib][awt] java.awt.Frame.setTitle(String) does not treat null as empty string)
modified ayza  /harmony/enhanced/classlib/trunk/modules/awt/src/main/java/common/java/awt/Window.java 03/16/2007 10:05:55 Applying patch from HARMONY-3318 ([classlib][awt] java.awt.Frame.setTitle(String) does not treat null as empty string)
modified ayza  /harmony/enhanced/classlib/trunk/modules/awt/src/test/api/java/common/java/awt/CanvasRTest.java 03/16/2007 09:32:24 Applying patch from HARMONY-1717 ([classlib][awt]Junit AWTRunner does not display progress bar)
modified ayza  /harmony/enhanced/classlib/trunk/modules/awt/src/main/java/common/java/awt/Canvas.java 03/16/2007 09:32:24 Applying patch from HARMONY-1717 ([classlib][awt]Junit AWTRunner does not display progress bar)
add cc-classlib log20070316091518Lbuild.42 03/16/2007 09:15:18classlib
deleted ayza  /harmony/enhanced/classlib/trunk/modules/auth/make/exclude.linux.x86_64.ibm 03/16/2007 08:57:22 64bit version of IBM VME for Harmony is not available. Corresponding exclude list files were removed.
deleted ayza  /harmony/enhanced/classlib/trunk/modules/prefs/make/exclude.windows.x86_64.ibm 03/16/2007 08:57:22 64bit version of IBM VME for Harmony is not available. Corresponding exclude list files were removed.
deleted ayza  /harmony/enhanced/classlib/trunk/modules/archive/make/exclude.windows.x86_64.ibm 03/16/2007 08:57:22 64bit version of IBM VME for Harmony is not available. Corresponding exclude list files were removed.
deleted ayza  /harmony/enhanced/classlib/trunk/modules/nio_char/make/exclude.windows.x86_64.ibm 03/16/2007 08:57:22 64bit version of IBM VME for Harmony is not available. Corresponding exclude list files were removed.
deleted ayza  /harmony/enhanced/classlib/trunk/modules/prefs/make/exclude.linux.x86_64.ibm 03/16/2007 08:57:22 64bit version of IBM VME for Harmony is not available. Corresponding exclude list files were removed.
deleted ayza  /harmony/enhanced/classlib/trunk/modules/nio/make/exclude.windows.x86_64.ibm 03/16/2007 08:57:22 64bit version of IBM VME for Harmony is not available. Corresponding exclude list files were removed.
deleted ayza  /harmony/enhanced/classlib/trunk/modules/archive/make/exclude.linux.x86_64.ibm 03/16/2007 08:57:22 64bit version of IBM VME for Harmony is not available. Corresponding exclude list files were removed.
deleted ayza  /harmony/enhanced/classlib/trunk/modules/logging/make/exclude.windows.x86_64.ibm 03/16/2007 08:57:22 64bit version of IBM VME for Harmony is not available. Corresponding exclude list files were removed.
deleted ayza  /harmony/enhanced/classlib/trunk/modules/rmi/make/exclude.windows.x86_64.ibm 03/16/2007 08:57:22 64bit version of IBM VME for Harmony is not available. Corresponding exclude list files were removed.
deleted ayza  /harmony/enhanced/classlib/trunk/modules/nio_char/make/exclude.linux.x86_64.ibm 03/16/2007 08:57:22 64bit version of IBM VME for Harmony is not available. Corresponding exclude list files were removed.
deleted ayza  /harmony/enhanced/classlib/trunk/modules/beans/make/exclude.windows.x86_64.ibm 03/16/2007 08:57:22 64bit version of IBM VME for Harmony is not available. Corresponding exclude list files were removed.
deleted ayza  /harmony/enhanced/classlib/trunk/modules/nio/make/exclude.linux.x86_64.ibm 03/16/2007 08:57:22 64bit version of IBM VME for Harmony is not available. Corresponding exclude list files were removed.
deleted ayza  /harmony/enhanced/classlib/trunk/modules/logging/make/exclude.linux.x86_64.ibm 03/16/2007 08:57:22 64bit version of IBM VME for Harmony is not available. Corresponding exclude list files were removed.
deleted ayza  /harmony/enhanced/classlib/trunk/modules/rmi/make/exclude.linux.x86_64.ibm 03/16/2007 08:57:22 64bit version of IBM VME for Harmony is not available. Corresponding exclude list files were removed.
deleted ayza  /harmony/enhanced/classlib/trunk/modules/print/make/exclude.windows.x86_64.ibm 03/16/2007 08:57:22 64bit version of IBM VME for Harmony is not available. Corresponding exclude list files were removed.
deleted ayza  /harmony/enhanced/classlib/trunk/modules/beans/make/exclude.linux.x86_64.ibm 03/16/2007 08:57:22 64bit version of IBM VME for Harmony is not available. Corresponding exclude list files were removed.
deleted ayza  /harmony/enhanced/classlib/trunk/modules/pack200/make/exclude.windows.x86_64.ibm 03/16/2007 08:57:22 64bit version of IBM VME for Harmony is not available. Corresponding exclude list files were removed.
deleted ayza  /harmony/enhanced/classlib/trunk/modules/print/make/exclude.linux.x86_64.ibm 03/16/2007 08:57:22 64bit version of IBM VME for Harmony is not available. Corresponding exclude list files were removed.
deleted ayza  /harmony/enhanced/classlib/trunk/modules/pack200/make/exclude.linux.x86_64.ibm 03/16/2007 08:57:22 64bit version of IBM VME for Harmony is not available. Corresponding exclude list files were removed.
deleted ayza  /harmony/enhanced/classlib/trunk/modules/luni/make/exclude.windows.x86_64.ibm 03/16/2007 08:57:22 64bit version of IBM VME for Harmony is not available. Corresponding exclude list files were removed.
deleted ayza  /harmony/enhanced/classlib/trunk/modules/instrument/make/exclude.windows.x86_64.ibm 03/16/2007 08:57:22 64bit version of IBM VME for Harmony is not available. Corresponding exclude list files were removed.
deleted ayza  /harmony/enhanced/classlib/trunk/modules/luni/make/exclude.linux.x86_64.ibm 03/16/2007 08:57:22 64bit version of IBM VME for Harmony is not available. Corresponding exclude list files were removed.
deleted ayza  /harmony/enhanced/classlib/trunk/modules/instrument/make/exclude.linux.x86_64.ibm 03/16/2007 08:57:22 64bit version of IBM VME for Harmony is not available. Corresponding exclude list files were removed.
deleted ayza  /harmony/enhanced/classlib/trunk/modules/text/make/exclude.windows.x86_64.ibm 03/16/2007 08:57:22 64bit version of IBM VME for Harmony is not available. Corresponding exclude list files were removed.
deleted ayza  /harmony/enhanced/classlib/trunk/modules/swing/make/exclude.windows.x86_64.ibm 03/16/2007 08:57:22 64bit version of IBM VME for Harmony is not available. Corresponding exclude list files were removed.
deleted ayza  /harmony/enhanced/classlib/trunk/modules/sound/make/exclude.windows.x86_64.ibm 03/16/2007 08:57:22 64bit version of IBM VME for Harmony is not available. Corresponding exclude list files were removed.
deleted ayza  /harmony/enhanced/classlib/trunk/modules/text/make/exclude.linux.x86_64.ibm 03/16/2007 08:57:22 64bit version of IBM VME for Harmony is not available. Corresponding exclude list files were removed.
deleted ayza  /harmony/enhanced/classlib/trunk/modules/lang-management/make/exclude.windows.x86_64.ibm 03/16/2007 08:57:22 64bit version of IBM VME for Harmony is not available. Corresponding exclude list files were removed.
deleted ayza  /harmony/enhanced/classlib/trunk/modules/swing/make/exclude.linux.x86_64.ibm 03/16/2007 08:57:22 64bit version of IBM VME for Harmony is not available. Corresponding exclude list files were removed.
deleted ayza  /harmony/enhanced/classlib/trunk/modules/sound/make/exclude.linux.x86_64.ibm 03/16/2007 08:57:22 64bit version of IBM VME for Harmony is not available. Corresponding exclude list files were removed.
deleted ayza  /harmony/enhanced/classlib/trunk/modules/lang-management/make/exclude.linux.x86_64.ibm 03/16/2007 08:57:22 64bit version of IBM VME for Harmony is not available. Corresponding exclude list files were removed.
deleted ayza  /harmony/enhanced/classlib/trunk/modules/auth/make/exclude.windows.x86_64.ibm 03/16/2007 08:57:22 64bit version of IBM VME for Harmony is not available. Corresponding exclude list files were removed.
deleted ayza  /harmony/enhanced/classlib/trunk/modules/awt/make/exclude.windows.x86_64.ibm 03/16/2007 08:38:28 Removing exclude list files for IBM VME on 64bit Linux since such VM is not available.
deleted ayza  /harmony/enhanced/classlib/trunk/modules/awt/make/exclude.linux.x86_64.ibm 03/16/2007 08:38:28 Removing exclude list files for IBM VME on 64bit Linux since such VM is not available.
modified ayza  /harmony/enhanced/classlib/trunk/modules/awt/make/exclude.windows.x86.drl.interm 03/16/2007 08:36:29 Adding more tests to intermittent exclude list for IBM VME. According to CC these tests fail. However, I cannot reproduce the failures by myself. This commit relates to HARMONY-1979.
added ayza  /harmony/enhanced/classlib/trunk/modules/awt/make/exclude.linux.x86.ibm.interm 03/16/2007 08:36:29 Adding more tests to intermittent exclude list for IBM VME. According to CC these tests fail. However, I cannot reproduce the failures by myself. This commit relates to HARMONY-1979.
modified ayza  /harmony/enhanced/classlib/trunk/modules/awt/make/exclude.windows.x86.drl.interm 03/16/2007 08:23:49 Adding java.awt.ButtonRTest and java.awt.ScrollPaneAdjustableTest to intermittent exclude list for Windows 32 since CC reports failures of these two tests.
add cc-classlib log20070316081408Lbuild.41 03/16/2007 08:14:08classlib
modified ayza  /harmony/enhanced/classlib/trunk/modules/awt/make/exclude.linux.x86_64.drl 03/16/2007 08:12:40 java.awt.font.LineBreakMeasurerTest has been added to Linux 64bit exclude list since it fails on this platform. See HARMONY-1979.
modified ayza  /harmony/enhanced/classlib/trunk/modules/awt/make/exclude.common 03/16/2007 07:51:46 Removing ShapeTest form exclude list since this test was deleted from repository.
modified ayza  /harmony/enhanced/classlib/trunk/modules/awt/make/exclude.common 03/16/2007 07:47:54 Removing redundant java.awt.geom.ShapeTest . All functionality of ShapeTest was inherited by ShapeTestCase. See HARMONY-1979.
deleted ayza  /harmony/enhanced/classlib/trunk/modules/awt/src/test/api/java/common/java/awt/geom/ShapeTest.java 03/16/2007 07:47:54 Removing redundant java.awt.geom.ShapeTest . All functionality of ShapeTest was inherited by ShapeTestCase. See HARMONY-1979.
add cc-classlib log20070316071311Lbuild.40 03/16/2007 07:13:11classlib
modified gshimansky  /harmony/enhanced/classlib/trunk/modules/imageio/src/main/native/pngencoder 03/16/2007 07:05:12 More ignored files generated by pngdecoder natives
modified gshimansky  /harmony/enhanced/classlib/trunk/modules/imageio/src/main/native/pngencoder/unix 03/16/2007 07:05:12 More ignored files generated by pngdecoder natives
modified gshimansky  /harmony/enhanced/classlib/trunk/modules/imageio/src/main/native/pngencoder 03/16/2007 07:00:48 Added manifest and output log file to ignored
modified gshimansky  /harmony/enhanced/classlib/trunk/depends/libs/build 03/16/2007 07:00:48 Added manifest and output log file to ignored
add cc-classlib log20070316061027Lbuild.39 03/16/2007 06:10:27classlib
added liangyx  /harmony/enhanced/classlib/trunk/modules/luni/src/test/java/tests/api/java/net/ExcludedProxyTest.java 03/16/2007 05:33:32 Apply patch for HARMONY-2097([classlib][luni] rewrite tests/api/java/net/HttpURLConnectionTest.java which was excluded)
modified liangyx  /harmony/enhanced/classlib/trunk/modules/luni/src/test/java/tests/api/java/net/HttpURLConnectionTest.java 03/16/2007 05:33:32 Apply patch for HARMONY-2097([classlib][luni] rewrite tests/api/java/net/HttpURLConnectionTest.java which was excluded)
modified liangyx  /harmony/enhanced/classlib/trunk/modules/luni/make/exclude.common 03/16/2007 05:33:32 Apply patch for HARMONY-2097([classlib][luni] rewrite tests/api/java/net/HttpURLConnectionTest.java which was excluded)
modified liangyx  /harmony/enhanced/classlib/trunk/modules/luni/build.xml 03/16/2007 05:33:32 Apply patch for HARMONY-2097([classlib][luni] rewrite tests/api/java/net/HttpURLConnectionTest.java which was excluded)
modified ayza  /harmony/enhanced/classlib/trunk/modules/awt/make/exclude.common 03/16/2007 05:26:34 Big cleanup of AWT exclude lists. Many passing tests were removed. Inspired by HARMONY-1979.
modified ayza  /harmony/enhanced/classlib/trunk/modules/awt/build.xml 03/16/2007 05:26:34 Big cleanup of AWT exclude lists. Many passing tests were removed. Inspired by HARMONY-1979.
modified ayza  /harmony/enhanced/classlib/trunk/modules/awt/make/exclude.linux.x86.ibm 03/16/2007 05:26:34 Big cleanup of AWT exclude lists. Many passing tests were removed. Inspired by HARMONY-1979.
modified ayza  /harmony/enhanced/classlib/trunk/modules/awt/make/exclude.windows.x86.drl.interm 03/16/2007 05:26:34 Big cleanup of AWT exclude lists. Many passing tests were removed. Inspired by HARMONY-1979.
modified ayza  /harmony/enhanced/classlib/trunk/modules/awt/make/exclude.linux.x86_64.drl 03/16/2007 05:26:34 Big cleanup of AWT exclude lists. Many passing tests were removed. Inspired by HARMONY-1979.
modified ayza  /harmony/enhanced/classlib/trunk/modules/awt/make/exclude.interm 03/16/2007 05:26:34 Big cleanup of AWT exclude lists. Many passing tests were removed. Inspired by HARMONY-1979.
modified ayza  /harmony/enhanced/classlib/trunk/modules/awt/make/exclude.windows.x86.drl 03/16/2007 05:26:34 Big cleanup of AWT exclude lists. Many passing tests were removed. Inspired by HARMONY-1979.
modified ayza  /harmony/enhanced/classlib/trunk/modules/awt/make/exclude.linux.x86_64.ibm 03/16/2007 05:26:34 Big cleanup of AWT exclude lists. Many passing tests were removed. Inspired by HARMONY-1979.
modified ayza  /harmony/enhanced/classlib/trunk/modules/awt/make/exclude.linux.x86.drl 03/16/2007 05:26:34 Big cleanup of AWT exclude lists. Many passing tests were removed. Inspired by HARMONY-1979.
modified ayza  /harmony/enhanced/classlib/trunk/modules/awt/make/exclude.windows.x86.ibm 03/16/2007 05:26:34 Big cleanup of AWT exclude lists. Many passing tests were removed. Inspired by HARMONY-1979.
modified apetrenko  /harmony/enhanced/classlib/trunk/modules/swing/src/test/api/java/common/javax/swing/plaf/basic/BasicInternalFrameUITest.java 03/16/2007 05:17:26 Patch for HARMONY-2709 "[classlib][swing] javax.swing.plaf.basic.BasicInternalFrameUI.setupMenuOpenKey() throws unspecified IllegalArgumentException"
modified apetrenko  /harmony/enhanced/classlib/trunk/modules/swing/src/main/java/common/javax/swing/plaf/basic/BasicInternalFrameUI.java 03/16/2007 05:17:26 Patch for HARMONY-2709 "[classlib][swing] javax.swing.plaf.basic.BasicInternalFrameUI.setupMenuOpenKey() throws unspecified IllegalArgumentException"
modified liangyx  /harmony/enhanced/classlib/trunk/support/src/test/java/tests/support/Support_Jetty.java 03/16/2007 05:17:17 add license info
modified liangyx  /harmony/enhanced/classlib/trunk/make/build-test.xml 03/16/2007 05:15:58 Apply patch for HARMONY-2096([classlib]wrap embedding jetty API to support start a web server with document root)
added liangyx  /harmony/enhanced/classlib/trunk/support/src/test/java/tests/support/Support_Jetty.java 03/16/2007 05:15:58 Apply patch for HARMONY-2096([classlib]wrap embedding jetty API to support start a web server with document root)
modified liangyx  /harmony/enhanced/classlib/trunk/modules/imageio/src/main/native/pngencoder/windows 03/16/2007 05:10:32 config svn:ignore
modified liangyx  /harmony/enhanced/classlib/trunk/modules/imageio/src/main/native/pngencoder 03/16/2007 05:10:32 config svn:ignore
modified liangyx  /harmony/enhanced/classlib/trunk/modules/imageio/src/main/native/pngencoder/shared 03/16/2007 05:10:32 config svn:ignore
add cc-classlib log20070316050915Lbuild.38 03/16/2007 05:09:15classlib
modified liangyx  /harmony/enhanced/classlib/trunk/modules/portlib/src/main/native/include/shared/hyporterror.h 03/16/2007 04:46:28 Apply patch for HARMONY-2476([classlib][nio]FileChannel.read(ByteBuffer) does not throw IOException if underlying file is locked)
modified liangyx  /harmony/enhanced/classlib/trunk/modules/portlib/src/main/native/port/windows/hyfile.c 03/16/2007 04:46:28 Apply patch for HARMONY-2476([classlib][nio]FileChannel.read(ByteBuffer) does not throw IOException if underlying file is locked)
modified liangyx  /harmony/enhanced/classlib/trunk/modules/luni/src/main/native/luni/shared/OSFileSystem.c 03/16/2007 04:46:28 Apply patch for HARMONY-2476([classlib][nio]FileChannel.read(ByteBuffer) does not throw IOException if underlying file is locked)
modified liangyx  /harmony/enhanced/classlib/trunk/modules/nio/make/exclude.linux.x86_64.ibm 03/16/2007 04:46:28 Apply patch for HARMONY-2476([classlib][nio]FileChannel.read(ByteBuffer) does not throw IOException if underlying file is locked)
modified liangyx  /harmony/enhanced/classlib/trunk/modules/nio/make/exclude.linux.x86.drl 03/16/2007 04:46:28 Apply patch for HARMONY-2476([classlib][nio]FileChannel.read(ByteBuffer) does not throw IOException if underlying file is locked)
added liangyx  /harmony/enhanced/classlib/trunk/modules/nio/src/test/java/common/org/apache/harmony/nio/tests/java/nio/channels/FileChannelWin32OnlyTest.java 03/16/2007 04:46:28 Apply patch for HARMONY-2476([classlib][nio]FileChannel.read(ByteBuffer) does not throw IOException if underlying file is locked)
modified liangyx  /harmony/enhanced/classlib/trunk/modules/luni/src/main/native/luni/windows/OSFileSystemWin32.c 03/16/2007 04:46:28 Apply patch for HARMONY-2476([classlib][nio]FileChannel.read(ByteBuffer) does not throw IOException if underlying file is locked)
modified liangyx  /harmony/enhanced/classlib/trunk/modules/nio/make/exclude.linux.x86.ibm 03/16/2007 04:46:28 Apply patch for HARMONY-2476([classlib][nio]FileChannel.read(ByteBuffer) does not throw IOException if underlying file is locked)
modified liangyx  /harmony/enhanced/classlib/trunk/modules/luni/src/main/native/luni/shared/nethelp.c 03/16/2007 04:46:28 Apply patch for HARMONY-2476([classlib][nio]FileChannel.read(ByteBuffer) does not throw IOException if underlying file is locked)
modified liangyx  /harmony/enhanced/classlib/trunk/modules/nio/make/exclude.linux.x86_64.drl 03/16/2007 04:46:28 Apply patch for HARMONY-2476([classlib][nio]FileChannel.read(ByteBuffer) does not throw IOException if underlying file is locked)
modified liangyx  /harmony/enhanced/classlib/trunk/modules/luni/src/test/java/tests/api/java/io/ObjectInputStreamTest.java 03/16/2007 04:20:04 Apply patch for HARMONY-3400([classlib][luni] Add testcase for ObjectInputStream's resolveObject(Object) function)
add cc-classlib log20070316022630Lbuild.37 03/16/2007 02:26:30classlib
modified apetrenko  /harmony/enhanced/classlib/trunk/modules/swing/src/main/java/common/javax/swing/plaf/basic/BasicScrollBarUI.java 03/16/2007 02:20:03 Patch for HARMONY-2853 "[classlib][swing] j.s.plaf.basic.BasicScrollBarUI.configureScrollBarColors() doesn't throw NPE"
modified apetrenko  /harmony/enhanced/classlib/trunk/modules/swing/src/test/api/java/common/javax/swing/plaf/basic/BasicScrollBarUITest.java 03/16/2007 02:20:03 Patch for HARMONY-2853 "[classlib][swing] j.s.plaf.basic.BasicScrollBarUI.configureScrollBarColors() doesn't throw NPE"
add cc-classlib log20070315150929Lbuild.36 03/15/2007 15:09:29classlib
modified hindessm  /harmony/enhanced/classlib/trunk/modules/prefs/src/main/native/prefs/windows/makefile 03/15/2007 14:35:50 Fix for -Dhy.no.sig=true mode on windows - please can someone check this mode on windows?
add cc-classlib log20070315072405Lbuild.35 03/15/2007 07:24:05classlib
modified apetrenko  /harmony/enhanced/classlib/trunk/modules/imageio/build.xml 03/15/2007 06:37:16 Patch for HARMONY-3143 "javax.imageio.ImageIO.write doesn't work with png-images"
added apetrenko  /harmony/enhanced/classlib/trunk/modules/imageio/src/main/native/pngencoder/shared/pngencoder.c 03/15/2007 06:37:16 Patch for HARMONY-3143 "javax.imageio.ImageIO.write doesn't work with png-images"
added apetrenko  /harmony/enhanced/classlib/trunk/modules/imageio/src/main/native/pngencoder/windows/pngencoder.def 03/15/2007 06:37:16 Patch for HARMONY-3143 "javax.imageio.ImageIO.write doesn't work with png-images"
added apetrenko  /harmony/enhanced/classlib/trunk/modules/imageio/src/main/java/org/apache/harmony/x/imageio/internal/nls/Messages.java 03/15/2007 06:37:16 Patch for HARMONY-3143 "javax.imageio.ImageIO.write doesn't work with png-images"
modified apetrenko  /harmony/enhanced/classlib/trunk/modules/imageio/src/main/java/javax/imageio/spi/IIORegistry.java 03/15/2007 06:37:16 Patch for HARMONY-3143 "javax.imageio.ImageIO.write doesn't work with png-images"
added apetrenko  /harmony/enhanced/classlib/trunk/modules/imageio/src/main/native/pngencoder/windows/pngencoder.rc 03/15/2007 06:37:16 Patch for HARMONY-3143 "javax.imageio.ImageIO.write doesn't work with png-images"
added apetrenko  /harmony/enhanced/classlib/trunk/modules/imageio/src/main/native/pngencoder/unix 03/15/2007 06:37:16 Patch for HARMONY-3143 "javax.imageio.ImageIO.write doesn't work with png-images"
added apetrenko  /harmony/enhanced/classlib/trunk/modules/imageio/src/main/java/org/apache/harmony/x/imageio/internal/nls 03/15/2007 06:37:16 Patch for HARMONY-3143 "javax.imageio.ImageIO.write doesn't work with png-images"
added apetrenko  /harmony/enhanced/classlib/trunk/modules/imageio/src/main/java/org/apache/harmony/x/imageio/plugins/png/PNGImageWriter.java 03/15/2007 06:37:16 Patch for HARMONY-3143 "javax.imageio.ImageIO.write doesn't work with png-images"
added apetrenko  /harmony/enhanced/classlib/trunk/modules/imageio/src/main/java/org/apache/harmony/x/imageio/internal/nls/messages.properties 03/15/2007 06:37:16 Patch for HARMONY-3143 "javax.imageio.ImageIO.write doesn't work with png-images"
added apetrenko  /harmony/enhanced/classlib/trunk/modules/imageio/src/main/java/org/apache/harmony/x/imageio/internal 03/15/2007 06:37:16 Patch for HARMONY-3143 "javax.imageio.ImageIO.write doesn't work with png-images"
added apetrenko  /harmony/enhanced/classlib/trunk/modules/imageio/src/main/native/pngencoder/shared/include 03/15/2007 06:37:16 Patch for HARMONY-3143 "javax.imageio.ImageIO.write doesn't work with png-images"
added apetrenko  /harmony/enhanced/classlib/trunk/modules/imageio/src/main/native/pngencoder/windows 03/15/2007 06:37:16 Patch for HARMONY-3143 "javax.imageio.ImageIO.write doesn't work with png-images"
added apetrenko  /harmony/enhanced/classlib/trunk/modules/imageio/src/main/native/pngencoder/shared/include/org_apache_harmony_x_imageio_plugins_png_PNGImageWriter.h 03/15/2007 06:37:16 Patch for HARMONY-3143 "javax.imageio.ImageIO.write doesn't work with png-images"
added apetrenko  /harmony/enhanced/classlib/trunk/modules/imageio/src/main/native/pngencoder 03/15/2007 06:37:16 Patch for HARMONY-3143 "javax.imageio.ImageIO.write doesn't work with png-images"
added apetrenko  /harmony/enhanced/classlib/trunk/modules/imageio/src/main/native/pngencoder/unix/makefile 03/15/2007 06:37:16 Patch for HARMONY-3143 "javax.imageio.ImageIO.write doesn't work with png-images"
added apetrenko  /harmony/enhanced/classlib/trunk/modules/imageio/src/main/java/org/apache/harmony/x/imageio/plugins/png/PNGImageWriterSpi.java 03/15/2007 06:37:16 Patch for HARMONY-3143 "javax.imageio.ImageIO.write doesn't work with png-images"
added apetrenko  /harmony/enhanced/classlib/trunk/modules/imageio/src/main/native/pngencoder/shared/include/pngencoder.h 03/15/2007 06:37:16 Patch for HARMONY-3143 "javax.imageio.ImageIO.write doesn't work with png-images"
added apetrenko  /harmony/enhanced/classlib/trunk/modules/imageio/src/main/native/pngencoder/unix/exports.txt 03/15/2007 06:37:16 Patch for HARMONY-3143 "javax.imageio.ImageIO.write doesn't work with png-images"
added apetrenko  /harmony/enhanced/classlib/trunk/modules/imageio/src/main/native/pngencoder/shared 03/15/2007 06:37:16 Patch for HARMONY-3143 "javax.imageio.ImageIO.write doesn't work with png-images"
added apetrenko  /harmony/enhanced/classlib/trunk/modules/imageio/src/main/java/org/apache/harmony/x/imageio/plugins/png/PNGImageWriterParam.java 03/15/2007 06:37:16 Patch for HARMONY-3143 "javax.imageio.ImageIO.write doesn't work with png-images"
added apetrenko  /harmony/enhanced/classlib/trunk/modules/imageio/src/main/native/pngencoder/windows/makefile 03/15/2007 06:37:16 Patch for HARMONY-3143 "javax.imageio.ImageIO.write doesn't work with png-images"
add cc-classlib log20070315062329Lbuild.34 03/15/2007 06:23:29classlib
modified smishura  /harmony/enhanced/classlib/trunk/make/properties.xml 03/15/2007 06:16:32 Correct test.case convertion
add cc-classlib log20070315052301Lbuild.33 03/15/2007 05:23:01classlib
modified smishura  /harmony/enhanced/classlib/trunk/modules/lang-management/build.xml 03/15/2007 05:22:01 Apply modified patch to 'lang-management' module from HARMONY-3187:([classlib][testing] test case should be run only once when specified through the command line)
modified smishura  /harmony/enhanced/classlib/trunk/make/properties.xml 03/15/2007 05:22:01 Apply modified patch to 'lang-management' module from HARMONY-3187:([classlib][testing] test case should be run only once when specified through the command line)
modified apetrenko  /harmony/enhanced/classlib/trunk/modules/swing/src/main/java/common/javax/swing/JComponent.java 03/15/2007 05:04:09 Patch for HARMONY-3369 "[classlib][internationalization]Internationalization of the special strings in the swing module"
modified apetrenko  /harmony/enhanced/classlib/trunk/modules/swing/src/main/java/common/org/apache/harmony/x/swing/internal/nls/messages.properties 03/15/2007 05:04:09 Patch for HARMONY-3369 "[classlib][internationalization]Internationalization of the special strings in the swing module"
modified apetrenko  /harmony/enhanced/classlib/trunk/modules/swing/src/main/java/common/javax/swing/JMenu.java 03/15/2007 05:04:09 Patch for HARMONY-3369 "[classlib][internationalization]Internationalization of the special strings in the swing module"
modified apetrenko  /harmony/enhanced/classlib/trunk/modules/swing/src/main/java/common/javax/swing/text/html/CSS.java 03/15/2007 05:04:09 Patch for HARMONY-3369 "[classlib][internationalization]Internationalization of the special strings in the swing module"
modified apetrenko  /harmony/enhanced/classlib/trunk/modules/swing/src/main/java/common/org/apache/harmony/x/swing/text/html/cssparser/TokenMgrError.java 03/15/2007 05:04:09 Patch for HARMONY-3369 "[classlib][internationalization]Internationalization of the special strings in the swing module"
modified apetrenko  /harmony/enhanced/classlib/trunk/modules/swing/src/main/java/common/org/apache/harmony/x/swing/text/html/cssparser/CSSParserTokenManager.java 03/15/2007 05:04:09 Patch for HARMONY-3369 "[classlib][internationalization]Internationalization of the special strings in the swing module"
modified apetrenko  /harmony/enhanced/classlib/trunk/modules/swing/src/main/java/common/javax/swing/plaf/ComponentUI.java 03/15/2007 05:04:09 Patch for HARMONY-3369 "[classlib][internationalization]Internationalization of the special strings in the swing module"
modified apetrenko  /harmony/enhanced/classlib/trunk/modules/swing/src/main/java/common/org/apache/harmony/x/swing/text/html/cssparser/CSSParser.java 03/15/2007 05:04:09 Patch for HARMONY-3369 "[classlib][internationalization]Internationalization of the special strings in the swing module"
modified apetrenko  /harmony/enhanced/classlib/trunk/modules/swing/src/main/java/common/javax/swing/text/AbstractDocument.java 03/15/2007 05:04:09 Patch for HARMONY-3369 "[classlib][internationalization]Internationalization of the special strings in the swing module"
modified apetrenko  /harmony/enhanced/classlib/trunk/modules/swing/src/main/java/common/javax/swing/text/FlowView.java 03/15/2007 05:04:09 Patch for HARMONY-3369 "[classlib][internationalization]Internationalization of the special strings in the swing module"
modified apetrenko  /harmony/enhanced/classlib/trunk/modules/swing/src/main/java/common/javax/swing/text/DefaultStyledDocument.java 03/15/2007 05:04:09 Patch for HARMONY-3369 "[classlib][internationalization]Internationalization of the special strings in the swing module"
modified apetrenko  /harmony/enhanced/classlib/trunk/modules/swing/src/main/java/common/javax/swing/JTextPane.java 03/15/2007 05:04:09 Patch for HARMONY-3369 "[classlib][internationalization]Internationalization of the special strings in the swing module"
modified apetrenko  /harmony/enhanced/classlib/trunk/modules/swing/src/test/api/java/common/javax/swing/text/StyledEditorKit_StyledTextActionTest.java 03/15/2007 05:04:09 Patch for HARMONY-3369 "[classlib][internationalization]Internationalization of the special strings in the swing module"
modified apetrenko  /harmony/enhanced/classlib/trunk/modules/swing/src/main/java/common/javax/swing/JMenuBar.java 03/15/2007 05:04:09 Patch for HARMONY-3369 "[classlib][internationalization]Internationalization of the special strings in the swing module"
modified apetrenko  /harmony/enhanced/classlib/trunk/modules/swing/src/main/java/common/javax/swing/JFrame.java 03/15/2007 05:04:09 Patch for HARMONY-3369 "[classlib][internationalization]Internationalization of the special strings in the swing module"
modified apetrenko  /harmony/enhanced/classlib/trunk/modules/swing/src/main/java/common/javax/swing/UIDefaults.java 03/15/2007 05:04:09 Patch for HARMONY-3369 "[classlib][internationalization]Internationalization of the special strings in the swing module"
modified apetrenko  /harmony/enhanced/classlib/trunk/modules/swing/src/main/java/common/javax/swing/text/StyledEditorKit.java 03/15/2007 05:04:09 Patch for HARMONY-3369 "[classlib][internationalization]Internationalization of the special strings in the swing module"
modified apetrenko  /harmony/enhanced/classlib/trunk/modules/swing/src/main/java/common/org/apache/harmony/x/swing/text/html/cssparser/CSSLogger.java 03/15/2007 05:04:09 Patch for HARMONY-3369 "[classlib][internationalization]Internationalization of the special strings in the swing module"
modified varlax  /harmony/enhanced/classlib/trunk/make/build-test.xml 03/15/2007 05:02:07 Fixed HARMONY-3399 [classlib][build] short report misses crashed tests
add cc-classlib log20070314231909Lbuild.32 03/14/2007 23:19:09classlib
modified ndbeyer  /harmony/enhanced/classlib/trunk/modules/luni/src/test/java/tests/api/java/util/GregorianCalendarTest.java 03/14/2007 22:39:47 Apply second patch for HARMONY-2959: [classlib][luni]GregorianCalendar.get(DAY_OF_YEAR) returns incorrect value sometimes
modified smishura  /harmony/enhanced/classlib/trunk/modules/sql/src/main/java/javax/sql/rowset/serial/SerialClob.java 03/14/2007 22:33:06 Apply patch for HARMONY-3394:([classlib][sql] Implementation for SerialClob.position(String, long))
modified smishura  /harmony/enhanced/classlib/trunk/modules/sql/src/test/java/org/apache/harmony/sql/tests/javax/sql/rowset/serial/SerialClobTest.java 03/14/2007 22:33:06 Apply patch for HARMONY-3394:([classlib][sql] Implementation for SerialClob.position(String, long))
modified ndbeyer  /harmony/enhanced/classlib/trunk/modules/lang-management/build.xml 03/14/2007 20:55:34 =correct test folder deletions; remove tab characters
modified ndbeyer  /harmony/enhanced/classlib/trunk/modules/lang-management/make/hyproperties.xml 03/14/2007 20:55:34 =correct test folder deletions; remove tab characters
add cc-classlib log20070314201426Lbuild.31 03/14/2007 20:14:26classlib
modified ndbeyer  /harmony/enhanced/classlib/trunk/modules/luni/src/test/java/tests/api/java/util/GregorianCalendarTest.java 03/14/2007 20:08:42 correct spelling and add warning suppression
add cc-classlib log20070314081934Lbuild.30 03/14/2007 08:19:34classlib
modified apetrenko  /harmony/enhanced/classlib/trunk/modules/luni/src/main/java/java/lang/Character.java 03/14/2007 07:35:00 Patch for HARMONY-3392 "[Classlib][luni][performance] Improvement of java.lang.(Ineteger,Short,Long,Character).valueOf() methods"
modified apetrenko  /harmony/enhanced/classlib/trunk/modules/luni/src/main/java/java/lang/Integer.java 03/14/2007 07:35:00 Patch for HARMONY-3392 "[Classlib][luni][performance] Improvement of java.lang.(Ineteger,Short,Long,Character).valueOf() methods"
modified apetrenko  /harmony/enhanced/classlib/trunk/modules/luni/src/main/java/java/lang/Long.java 03/14/2007 07:35:00 Patch for HARMONY-3392 "[Classlib][luni][performance] Improvement of java.lang.(Ineteger,Short,Long,Character).valueOf() methods"
modified apetrenko  /harmony/enhanced/classlib/trunk/modules/luni/src/main/java/java/lang/Short.java 03/14/2007 07:35:00 Patch for HARMONY-3392 "[Classlib][luni][performance] Improvement of java.lang.(Ineteger,Short,Long,Character).valueOf() methods"
add cc-classlib log20070314044658Lbuild.29 03/14/2007 04:46:58classlib
modified liangyx  /harmony/enhanced/classlib/trunk/modules/archive/make/exclude.linux.x86.ibm 03/14/2007 04:40:17 Move JarExecTest out of excluded list on linux
modified liangyx  /harmony/enhanced/classlib/trunk/modules/luni/src/test/java/tests/api/java/io/NotSerializableExceptionTest.java 03/14/2007 04:14:58 Apply patch for HARMONY-3388([classlib][luni] Refactor the default constuctor of NotSerializableException)
add cc-classlib log20070314034626Lbuild.28 03/14/2007 03:46:26classlib
modified ayza  /harmony/enhanced/classlib/trunk/modules/awt/src/test/api/java/common/java/awt/RobotTest.java 03/14/2007 03:36:53 Some delays were updated. Hope this helps to make RobotTest more stable. 
modified liangyx  /harmony/enhanced/classlib/trunk/modules/nio_char/src/test/java/tests/api/java/nio/charset/UTF16CharsetDecoderTest.java 03/14/2007 02:52:45 Apply patch for HARMONY-3387([classlib][nio_char]move out 4 excluded tests)
modified liangyx  /harmony/enhanced/classlib/trunk/modules/nio_char/src/main/java/java/nio/charset/CharsetDecoder.java 03/14/2007 02:52:45 Apply patch for HARMONY-3387([classlib][nio_char]move out 4 excluded tests)
modified liangyx  /harmony/enhanced/classlib/trunk/modules/nio_char/make/exclude.common 03/14/2007 02:52:45 Apply patch for HARMONY-3387([classlib][nio_char]move out 4 excluded tests)
modified liangyx  /harmony/enhanced/classlib/trunk/modules/nio_char/src/main/java/java/nio/charset/CharsetEncoder.java 03/14/2007 02:52:45 Apply patch for HARMONY-3387([classlib][nio_char]move out 4 excluded tests)
add cc-classlib log20070314024529Lbuild.27 03/14/2007 02:45:29classlib
modified liangyx  /harmony/enhanced/classlib/trunk/modules/archive/src/main/java/java/util/jar/JarInputStream.java 03/14/2007 02:32:33 Apply patch for HARMONY-3386([classlib][archive]adopt toASCIIUpper(Lower)Case in JarVerifier and JarInputStream)
modified liangyx  /harmony/enhanced/classlib/trunk/modules/archive/src/main/java/java/util/jar/JarVerifier.java 03/14/2007 02:32:33 Apply patch for HARMONY-3386([classlib][archive]adopt toASCIIUpper(Lower)Case in JarVerifier and JarInputStream)
add cc-classlib log20070314005446Lbuild.26 03/14/2007 00:54:46classlib
modified liangyx  /harmony/enhanced/classlib/trunk/modules/luni/src/test/java/tests/api/java/net/SocketPermissionTest.java 03/13/2007 23:57:01 Fix bug of SocketPermissionTest when the target ip is resolved to host
add cc-classlib log20070313235453Lbuild.25 03/13/2007 23:54:53classlib
modified smishura  /harmony/enhanced/classlib/trunk/make/properties.xml 03/13/2007 23:17:14 Adjsut property name for exclude list: change 'interm.exclude.file' to 'platform.exclude.interm'
add cc-classlib log20070313120739Lbuild.24 03/13/2007 12:07:39classlib
modified apetrenko  /harmony/enhanced/classlib/trunk/modules/awt/src/main/java/common/org/apache/harmony/awt/internal/nls/messages.properties 03/13/2007 11:49:59 Patch for HARMONY-2884 "[classlib][awt] Compatibility: java.awt.image.Raster.createPackedRaster() throws RasterFormatException on RI while it doesn't on Harmony"
modified apetrenko  /harmony/enhanced/classlib/trunk/modules/awt/src/main/java/common/java/awt/image/Raster.java 03/13/2007 11:49:59 Patch for HARMONY-2884 "[classlib][awt] Compatibility: java.awt.image.Raster.createPackedRaster() throws RasterFormatException on RI while it doesn't on Harmony"
modified apetrenko  /harmony/enhanced/classlib/trunk/modules/awt/src/test/api/java/common/java/awt/image/RasterTest.java 03/13/2007 11:49:59 Patch for HARMONY-2884 "[classlib][awt] Compatibility: java.awt.image.Raster.createPackedRaster() throws RasterFormatException on RI while it doesn't on Harmony"
add cc-classlib log20070313110822Lbuild.23 03/13/2007 11:08:22classlib
added odeakin  /harmony/enhanced/classlib/trunk/modules/portlib/src/main/native/port/unix/linux/hyvmem.c 03/13/2007 10:14:17 Moving files to OS specific subdirectories to allow for further platform ports.
deleted odeakin  /harmony/enhanced/classlib/trunk/modules/portlib/src/main/native/port/unix/hyvmem.c 03/13/2007 10:14:17 Moving files to OS specific subdirectories to allow for further platform ports.
added odeakin  /harmony/enhanced/classlib/trunk/modules/portlib/src/main/native/port/unix/freebsd/hymmap.c 03/13/2007 10:14:17 Moving files to OS specific subdirectories to allow for further platform ports.
added odeakin  /harmony/enhanced/classlib/trunk/modules/portlib/src/main/native/port/unix/freebsd 03/13/2007 10:14:17 Moving files to OS specific subdirectories to allow for further platform ports.
added odeakin  /harmony/enhanced/classlib/trunk/modules/portlib/src/main/native/port/unix/linux/hymmap.c 03/13/2007 10:14:17 Moving files to OS specific subdirectories to allow for further platform ports.
modified odeakin  /harmony/enhanced/classlib/trunk/modules/portlib/src/main/native/port/unix/makefile 03/13/2007 10:14:17 Moving files to OS specific subdirectories to allow for further platform ports.
added odeakin  /harmony/enhanced/classlib/trunk/modules/portlib/src/main/native/port/unix/linux 03/13/2007 10:14:17 Moving files to OS specific subdirectories to allow for further platform ports.
added odeakin  /harmony/enhanced/classlib/trunk/modules/portlib/src/main/native/port/unix/freebsd/hyvmem.c 03/13/2007 10:14:17 Moving files to OS specific subdirectories to allow for further platform ports.
add cc-classlib log20070313100852Lbuild.22 03/13/2007 10:08:52classlib
modified apetrenko  /harmony/enhanced/classlib/trunk/modules/swing/src/test/api/java/common/javax/swing/plaf/basic/BasicTabbedPaneUITest.java 03/13/2007 09:34:17 Patch for HARMONY-1804 "[classlib][swing] javax.swing.plaf.basic.BasicTabbedPaneUI.paint(Graphics g, JComponent c) does not throw NullPointerException when g is null while RI does"
modified apetrenko  /harmony/enhanced/classlib/trunk/modules/swing/src/main/java/common/javax/swing/plaf/basic/BasicTabbedPaneUI.java 03/13/2007 09:34:17 Patch for HARMONY-1804 "[classlib][swing] javax.swing.plaf.basic.BasicTabbedPaneUI.paint(Graphics g, JComponent c) does not throw NullPointerException when g is null while RI does"
add cc-classlib log20070313090944Lbuild.21 03/13/2007 09:09:44classlib
modified hindessm  /harmony/enhanced/classlib/trunk/depends/build/rules.mk 03/13/2007 08:32:48 More makefile refactoring to support a non-gcc toolchain.
modified hindessm  /harmony/enhanced/classlib/trunk/depends/build/defines.mk 03/13/2007 08:32:48 More makefile refactoring to support a non-gcc toolchain.
modified ayza  /harmony/enhanced/classlib/trunk/modules/sql/src/main/java/org/apache/harmony/sql/internal/nls/messages.properties 03/13/2007 08:31:02 Appying patch from HARMONY-3366 ([classlib][sql] Implementation for SerialClob.setString).
modified ayza  /harmony/enhanced/classlib/trunk/modules/sql/src/main/java/javax/sql/rowset/serial/SerialClob.java 03/13/2007 08:31:02 Appying patch from HARMONY-3366 ([classlib][sql] Implementation for SerialClob.setString).
modified ayza  /harmony/enhanced/classlib/trunk/modules/sql/src/test/java/org/apache/harmony/sql/tests/javax/sql/rowset/serial/SerialClobTest.java 03/13/2007 08:31:02 Appying patch from HARMONY-3366 ([classlib][sql] Implementation for SerialClob.setString).
add cc-classlib log20070313081028Lbuild.20 03/13/2007 08:10:28classlib
modified apetrenko  /harmony/enhanced/classlib/trunk/modules/swing/src/main/java/common/org/apache/harmony/x/swing/internal/nls/messages.properties 03/13/2007 07:59:47 Patch for HARMONY-1779 "[classlib][swing]javax.swing.plaf.basic.BasicEditorPaneUI.installUI does not throw Error"
modified apetrenko  /harmony/enhanced/classlib/trunk/modules/swing/src/main/java/common/javax/swing/plaf/basic/BasicTextUI.java 03/13/2007 07:59:47 Patch for HARMONY-1779 "[classlib][swing]javax.swing.plaf.basic.BasicEditorPaneUI.installUI does not throw Error"
modified apetrenko  /harmony/enhanced/classlib/trunk/modules/swing/src/test/api/java/common/javax/swing/plaf/basic/BasicTextUITest.java 03/13/2007 07:59:47 Patch for HARMONY-1779 "[classlib][swing]javax.swing.plaf.basic.BasicEditorPaneUI.installUI does not throw Error"
add cc-classlib log20070313062212Lbuild.19 03/13/2007 06:22:12classlib
modified liangyx  /harmony/enhanced/classlib/trunk/modules/nio_char/src/test/java/tests/api/java/nio/charset/CharsetEncoderTest.java 03/13/2007 05:30:30 Apply patch for HARMONY-3378([classlib][nio_char]IllegalStateException was thrown when encode with malformed bytes.)
modified liangyx  /harmony/enhanced/classlib/trunk/modules/nio_char/src/main/java/java/nio/charset/CharsetEncoder.java 03/13/2007 05:30:30 Apply patch for HARMONY-3378([classlib][nio_char]IllegalStateException was thrown when encode with malformed bytes.)
modified ayza  /harmony/enhanced/classlib/trunk/modules/awt/make/exclude.common 03/13/2007 05:25:49 Moving java.awt.RobotTest from common exclude list to common intermittent exclude list.
added ayza  /harmony/enhanced/classlib/trunk/modules/awt/make/exclude.interm 03/13/2007 05:25:49 Moving java.awt.RobotTest from common exclude list to common intermittent exclude list.
add cc-classlib log20070313052318Lbuild.18 03/13/2007 05:23:18classlib
modified liangyx  /harmony/enhanced/classlib/trunk/modules/luni/src/test/java/tests/api/java/io/FileWriterTest.java 03/13/2007 05:22:18 Apply patch for HARMONY([classlib][test] Add test for java.io.FileWriter's constructor FileWriter(java.io.File, boolean))
modified liangyx  /harmony/enhanced/classlib/trunk/modules/luni/src/test/java/tests/api/java/io/NotActiveExceptionTest.java 03/13/2007 04:54:42 Apply patch for HARMONY-3354([classlib][test] Refactor test for java.io.NotActiveException's default constructor)
modified ayza  /harmony/enhanced/classlib/trunk/make/properties.xml 03/13/2007 04:53:19 Applying patch from HARMONY-3352 ([classlib][testing] intermittently failed tests should be selected to run by key)
modified hindessm  /harmony/enhanced/classlib/trunk/depends/build/rules.mk 03/13/2007 04:43:50 Make build rules more flexible for different tool chains.
modified hindessm  /harmony/enhanced/classlib/trunk/depends/build/defines.mk 03/13/2007 04:43:50 Make build rules more flexible for different tool chains.
add cc-classlib log20070313015613Lbuild.17 03/13/2007 01:56:13classlib
modified pyang  /harmony/enhanced/classlib/trunk/modules/luni/src/main/native/luni/unix/OSFileSystemLinux32.c 03/13/2007 01:32:39 revert patch for HARMONY-3334( [classlib][luni-native] Native Method XXX_transferImpl in luni/src/main/native/luni/unix/OSFileSystemLinux32.c did not handle endian properly), which fails on x86_64
add cc-classlib log20070313005630Lbuild.16 03/13/2007 00:56:30classlib
modified liangyx  /harmony/enhanced/classlib/trunk/modules/luni/make/exclude.common 03/13/2007 00:55:30 Move SocketPermissionTest out of exclude.common
modified liangyx  /harmony/enhanced/classlib/trunk/modules/nio_char/src/test/java/tests/api/java/nio/charset/CharsetProviderTest.java 03/13/2007 00:52:42 Apply patch for HARMONY-3327([classlib][nio_char]move CharsetProviderTest out from exclude list)
modified liangyx  /harmony/enhanced/classlib/trunk/modules/nio_char/make/exclude.common 03/13/2007 00:52:42 Apply patch for HARMONY-3327([classlib][nio_char]move CharsetProviderTest out from exclude list)
modified liangyx  /harmony/enhanced/classlib/trunk/modules/nio_char/src/main/java/java/nio/charset/Charset.java 03/13/2007 00:52:42 Apply patch for HARMONY-3327([classlib][nio_char]move CharsetProviderTest out from exclude list)
added liangyx  /harmony/enhanced/classlib/trunk/modules/archive/src/test/java/org/apache/harmony/archive/util/UtilTest.java 03/13/2007 00:13:42 Apply patch for HARMONY-3355([classlib][archive]optimize case-mapping operation)
added liangyx  /harmony/enhanced/classlib/trunk/modules/archive/src/test/java/org/apache/harmony/archive/util 03/13/2007 00:13:42 Apply patch for HARMONY-3355([classlib][archive]optimize case-mapping operation)
modified liangyx  /harmony/enhanced/classlib/trunk/modules/archive/src/main/java/java/util/jar/Attributes.java 03/13/2007 00:13:42 Apply patch for HARMONY-3355([classlib][archive]optimize case-mapping operation)
added liangyx  /harmony/enhanced/classlib/trunk/modules/archive/src/main/java/org/apache/harmony/archive/util/Util.java 03/13/2007 00:13:42 Apply patch for HARMONY-3355([classlib][archive]optimize case-mapping operation)
added liangyx  /harmony/enhanced/classlib/trunk/modules/archive/src/main/java/org/apache/harmony/archive/util 03/13/2007 00:13:42 Apply patch for HARMONY-3355([classlib][archive]optimize case-mapping operation)
modified liangyx  /harmony/enhanced/classlib/trunk/modules/archive/src/main/java/java/util/jar/InitManifest.java 03/13/2007 00:13:42 Apply patch for HARMONY-3355([classlib][archive]optimize case-mapping operation)
modified liangyx  /harmony/enhanced/classlib/trunk/modules/archive/src/main/java/java/util/jar/JarFile.java 03/13/2007 00:13:42 Apply patch for HARMONY-3355([classlib][archive]optimize case-mapping operation)
add cc-classlib log20070312230748Lbuild.15 03/12/2007 23:07:48classlib
modified liangyx  /harmony/enhanced/classlib/trunk/modules/luni/src/test/java/tests/api/java/net/SocketTest.java 03/12/2007 23:02:18 Apply patch for HARMONY-3356([testing]Move test.api.java.net.SocketTest out of the exclude list on IBMVME/linux x86)
modified liangyx  /harmony/enhanced/classlib/trunk/modules/luni/src/main/java/org/apache/harmony/luni/net/PlainSocketImpl.java 03/12/2007 23:02:18 Apply patch for HARMONY-3356([testing]Move test.api.java.net.SocketTest out of the exclude list on IBMVME/linux x86)
modified liangyx  /harmony/enhanced/classlib/trunk/modules/luni/make/exclude.linux.x86.ibm 03/12/2007 23:02:18 Apply patch for HARMONY-3356([testing]Move test.api.java.net.SocketTest out of the exclude list on IBMVME/linux x86)
modified liangyx  /harmony/enhanced/classlib/trunk/modules/security/src/test/api/java/tests/api/java/security/PermissionCollectionTest.java 03/12/2007 22:23:44 Apply patch for HARMONY-3337([classlib][security] tests.api.java.security.PermissionCollectionTest fails on both RI and Harmony)
modified liangyx  /harmony/enhanced/classlib/trunk/modules/security/make/exclude.common 03/12/2007 22:23:44 Apply patch for HARMONY-3337([classlib][security] tests.api.java.security.PermissionCollectionTest fails on both RI and Harmony)
modified liangyx  /harmony/enhanced/classlib/trunk/modules/luni/src/main/java/java/net/SocketPermission.java 03/12/2007 22:14:58 Apply patch for HARMONY-3333([classlib][luni]java.net.SocketPermission considers port even if the action is only 'resolve')
modified liangyx  /harmony/enhanced/classlib/trunk/modules/luni/src/test/java/tests/api/java/net/SocketPermissionTest.java 03/12/2007 22:14:58 Apply patch for HARMONY-3333([classlib][luni]java.net.SocketPermission considers port even if the action is only 'resolve')
add cc-classlib log20070312220650Lbuild.14 03/12/2007 22:06:50classlib
modified liangyx  /harmony/enhanced/classlib/trunk/modules/luni/src/test/java/tests/api/java/io/FileNotFoundExceptionTest.java 03/12/2007 21:46:49 Apply patch for HARMONY-3353([classlib][test] Refactor test for java.io.FileNotFoundException's constructor)
add cc-classlib log20070312103541Lbuild.13 03/12/2007 10:35:41classlib
modified ayza  /harmony/enhanced/classlib/trunk/modules/awt/src/test/api/java/common/java/awt/ButtonRTest.java 03/12/2007 10:00:47 Applying patch from HARMONY-2305 ([classlib][awt] Several components can be active at the same time)
modified ayza  /harmony/enhanced/classlib/trunk/modules/awt/src/main/java/common/org/apache/harmony/awt/ButtonStateController.java 03/12/2007 10:00:47 Applying patch from HARMONY-2305 ([classlib][awt] Several components can be active at the same time)
add cc-classlib log20070312093731Lbuild.12 03/12/2007 09:37:31classlib
modified ayza  /harmony/enhanced/classlib/trunk/modules/lang-management/make/exclude.common 03/12/2007 08:50:09 Exclude list cleanup. Applying updated version of the patch from HARMONY-3194.
modified ayza  /harmony/enhanced/classlib/trunk/modules/auth/make/exclude.common 03/12/2007 08:50:09 Exclude list cleanup. Applying updated version of the patch from HARMONY-3194.
modified ayza  /harmony/enhanced/classlib/trunk/modules/nio_char/make/exclude.common 03/12/2007 08:50:09 Exclude list cleanup. Applying updated version of the patch from HARMONY-3194.
modified ayza  /harmony/enhanced/classlib/trunk/modules/text/make/exclude.common 03/12/2007 08:50:09 Exclude list cleanup. Applying updated version of the patch from HARMONY-3194.
modified ayza  /harmony/enhanced/classlib/trunk/modules/luni/make/exclude.common 03/12/2007 08:50:09 Exclude list cleanup. Applying updated version of the patch from HARMONY-3194.
modified ayza  /harmony/enhanced/classlib/trunk/modules/rmi/make/exclude.common 03/12/2007 08:50:09 Exclude list cleanup. Applying updated version of the patch from HARMONY-3194.
modified ayza  /harmony/enhanced/classlib/trunk/modules/security/make/exclude.common 03/12/2007 08:50:09 Exclude list cleanup. Applying updated version of the patch from HARMONY-3194.
modified ayza  /harmony/enhanced/classlib/trunk/modules/sound/make/exclude.common 03/12/2007 08:50:09 Exclude list cleanup. Applying updated version of the patch from HARMONY-3194.
add cc-classlib log20070312083921Lbuild.11 03/12/2007 08:39:21classlib
modified apetrenko  /harmony/enhanced/classlib/trunk/modules/swing/src/main/java/common/javax/swing/plaf/basic/BasicSliderUI.java 03/12/2007 08:21:15 Patch for HARMONY-2879 "[classlib][swing] j.s.plaf.basic.BasicSliderUI.createXXXListener() methods modify slider field"
modified apetrenko  /harmony/enhanced/classlib/trunk/modules/swing/src/test/api/java/common/javax/swing/plaf/basic/BasicSliderUITest.java 03/12/2007 08:21:15 Patch for HARMONY-2879 "[classlib][swing] j.s.plaf.basic.BasicSliderUI.createXXXListener() methods modify slider field"
add cc-classlib log20070312065253Lbuild.10 03/12/2007 06:52:53classlib
modified apetrenko  /harmony/enhanced/classlib/trunk/modules/swing/make/exclude.common 03/12/2007 06:06:46 javax/swing/plaf/basic/BasicTableUITest.java failures should be fixed by HARMONY-2613 patch
modified apetrenko  /harmony/enhanced/classlib/trunk/modules/swing/src/test/api/java/common/javax/swing/plaf/basic/BasicTableUITest.java 03/12/2007 06:05:07 Patch for HARMONY-2613 "[classlib][swing][plaf] javax.swing.plaf.basic.BasicTableUI methods throw unspecified NPE if UI is not attached to a table"
modified apetrenko  /harmony/enhanced/classlib/trunk/modules/swing/src/main/java/common/javax/swing/plaf/basic/BasicTableHeaderUI.java 03/12/2007 06:05:07 Patch for HARMONY-2613 "[classlib][swing][plaf] javax.swing.plaf.basic.BasicTableUI methods throw unspecified NPE if UI is not attached to a table"
modified apetrenko  /harmony/enhanced/classlib/trunk/modules/swing/src/test/api/java/common/javax/swing/plaf/basic/BasicTableHeaderUITest.java 03/12/2007 06:05:07 Patch for HARMONY-2613 "[classlib][swing][plaf] javax.swing.plaf.basic.BasicTableUI methods throw unspecified NPE if UI is not attached to a table"
modified apetrenko  /harmony/enhanced/classlib/trunk/modules/swing/src/main/java/common/javax/swing/plaf/basic/BasicTableUI.java 03/12/2007 06:05:07 Patch for HARMONY-2613 "[classlib][swing][plaf] javax.swing.plaf.basic.BasicTableUI methods throw unspecified NPE if UI is not attached to a table"
add cc-classlib log20070312050640Lbuild.9 03/12/2007 05:06:40classlib
modified apetrenko  /harmony/enhanced/classlib/trunk/modules/awt/src/test/api/java/common/java/awt/EventDispatchThreadRTest.java 03/12/2007 05:05:40 Patch for HARMONY-2116 "[classlib][awt] Toolkit.getDesktopProperties () prints NullPointerException."
modified apetrenko  /harmony/enhanced/classlib/trunk/modules/awt/src/main/java/common/java/awt/EventDispatchThread.java 03/12/2007 05:05:40 Patch for HARMONY-2116 "[classlib][awt] Toolkit.getDesktopProperties () prints NullPointerException."
modified hindessm  /harmony/enhanced/classlib/trunk/modules/luni/src/main/native/luni/unix/OSNetworkSystemLinux.c 03/12/2007 05:02:47 Minor #define changes for Aix.
modified hindessm  /harmony/enhanced/classlib/trunk/modules/portlib/src/main/native/port/unix/hyipcmutex.c 03/12/2007 05:02:47 Minor #define changes for Aix.
modified hindessm  /harmony/enhanced/classlib/trunk/modules/luni/src/main/native/launcher/shared/main.c 03/12/2007 05:02:47 Minor #define changes for Aix.
modified apetrenko  /harmony/enhanced/classlib/trunk/modules/swing/src/main/java/common/javax/swing/JEditorPane.java 03/12/2007 04:50:36 Patch for HARMONY-2571 "[classlib][swing] javax.swing.JEditorPane.getEditorKitClassNameForContentType(null) does not throw unspecified NPE"
modified apetrenko  /harmony/enhanced/classlib/trunk/modules/swing/src/test/api/java/common/javax/swing/JEditorPaneTest.java 03/12/2007 04:50:36 Patch for HARMONY-2571 "[classlib][swing] javax.swing.JEditorPane.getEditorKitClassNameForContentType(null) does not throw unspecified NPE"
modified hindessm  /harmony/enhanced/classlib/trunk/modules/portlib/src/main/native/include/unix/hysock.h 03/12/2007 04:42:08 Minor header file changes for Aix.
modified hindessm  /harmony/enhanced/classlib/trunk/modules/portlib/src/main/native/port/unix/hyshsem.h 03/12/2007 04:42:08 Minor header file changes for Aix.
modified hindessm  /harmony/enhanced/classlib/trunk/modules/portlib/src/main/native/include/shared/hycomp.h 03/12/2007 04:42:08 Minor header file changes for Aix.
modified hindessm  /harmony/enhanced/classlib/trunk/modules/awt/src/main/native/oglwrapper/shared/nativelib_common.h 03/12/2007 04:42:08 Minor header file changes for Aix.
modified hindessm  /harmony/enhanced/classlib/trunk/modules/awt/src/main/native/x11wrapper/unix/nativelib_common.h 03/12/2007 04:42:08 Minor header file changes for Aix.
added ayza  /harmony/enhanced/classlib/trunk/modules/suncompat/src/main/java/sun/awt/AppContext.java 03/12/2007 04:28:09 A stub for sun.awt.AppContext was added to suncompat module. See HARMONY-3280.
added ayza  /harmony/enhanced/classlib/trunk/modules/suncompat/src/main/java/sun/awt 03/12/2007 04:28:09 A stub for sun.awt.AppContext was added to suncompat module. See HARMONY-3280.
modified pyang  /harmony/enhanced/classlib/trunk/modules/luni/src/main/native/luni/unix/OSFileSystemLinux32.c 03/12/2007 04:27:13 Oops, I commited wrong file for HARMONY-3334([classlib][luni-native] Native Method XXX_transferImpl in luni/src/main/native/luni/unix/OSFileSystemLinux32.c did not handle endian properly), recommit the right fix and recover the wrong one
modified pyang  /harmony/enhanced/classlib/trunk/modules/luni/src/main/native/launcher/shared/main.c 03/12/2007 04:27:13 Oops, I commited wrong file for HARMONY-3334([classlib][luni-native] Native Method XXX_transferImpl in luni/src/main/native/luni/unix/OSFileSystemLinux32.c did not handle endian properly), recommit the right fix and recover the wrong one
add cc-classlib log20070312005306Lbuild.8 03/12/2007 00:53:06classlib
modified pyang  /harmony/enhanced/classlib/trunk/modules/luni/src/main/native/launcher/shared/main.c 03/12/2007 00:42:17 apply patch for HARMONY-3334([classlib][luni-native] Native Method XXX_transferImpl in luni/src/main/native/luni/unix/OSFileSystemLinux32.c did not handle endian properly)
add cc-classlib log20070311221837Lbuild.7 03/11/2007 22:18:37classlib
modified liangyx  /harmony/enhanced/classlib/trunk/modules/nio_char/src/test/java/tests/api/java/nio/charset/AllTests.java 03/11/2007 21:45:40 Refactor ASCIICharsetEncoderTest
added liangyx  /harmony/enhanced/classlib/trunk/modules/nio_char/src/test/java/org/apache/harmony/nio_char/tests/java/nio/charset/ASCIICharsetEncoderTest.java 03/11/2007 21:45:40 Refactor ASCIICharsetEncoderTest
deleted liangyx  /harmony/enhanced/classlib/trunk/modules/nio_char/src/test/java/tests/api/java/nio/charset/ASCIICharsetEncoderTest.java 03/11/2007 21:45:40 Refactor ASCIICharsetEncoderTest
modified liangyx  /harmony/enhanced/classlib/trunk/modules/nio_char/src/test/java/tests/api/java/nio/charset/CharsetEncoderTest.java 03/11/2007 21:37:45 refactor CharsetEncoderTest
modified liangyx  /harmony/enhanced/classlib/trunk/modules/nio_char/src/test/java/tests/api/java/nio/charset/AllTests.java 03/11/2007 21:37:45 refactor CharsetEncoderTest
deleted liangyx  /harmony/enhanced/classlib/trunk/modules/nio_char/src/test/java/tests/api/java/nio/charset/ASCCharsetEncoderTest.java 03/11/2007 21:37:45 refactor CharsetEncoderTest
added liangyx  /harmony/enhanced/classlib/trunk/modules/nio_char/src/test/java/tests/api/java/nio/charset/ASCIICharsetEncoderTest.java 03/11/2007 21:37:45 refactor CharsetEncoderTest
add cc-classlib log20070309091101Lbuild.6 03/09/2007 09:11:01classlib
modified ayza  /harmony/enhanced/classlib/trunk/modules/swing/src/test/api/java/common/javax/swing/table/DefaultTableCellRendererTest.java 03/09/2007 09:05:05 Applying patch from HARMONY-1721 ([classlib][swing] javax.swing.table.DefaultTableCellRenderer.getBackground() returns some default value while RI returns null)
modified ayza  /harmony/enhanced/classlib/trunk/modules/swing/src/main/java/common/javax/swing/table/DefaultTableCellRenderer.java 03/09/2007 09:05:05 Applying patch from HARMONY-1721 ([classlib][swing] javax.swing.table.DefaultTableCellRenderer.getBackground() returns some default value while RI returns null)
modified ayza  /harmony/enhanced/classlib/trunk/modules/swing/src/main/java/common/javax/swing/JFileChooser.java 03/09/2007 08:28:40 Applying patch from HARMONY-2580 ([classlib][swing] javax.swing.JFileChooser.getName() returns class name instead of null)
modified ayza  /harmony/enhanced/classlib/trunk/modules/swing/src/test/api/java/common/javax/swing/table/DefaultTableCellRendererTest.java 03/09/2007 08:28:40 Applying patch from HARMONY-2580 ([classlib][swing] javax.swing.JFileChooser.getName() returns class name instead of null)
modified ayza  /harmony/enhanced/classlib/trunk/modules/swing/src/test/api/java/common/javax/swing/JFileChooserTest.java 03/09/2007 08:28:40 Applying patch from HARMONY-2580 ([classlib][swing] javax.swing.JFileChooser.getName() returns class name instead of null)
modified ayza  /harmony/enhanced/classlib/trunk/modules/swing/src/main/java/common/javax/swing/table/DefaultTableCellRenderer.java 03/09/2007 08:28:40 Applying patch from HARMONY-2580 ([classlib][swing] javax.swing.JFileChooser.getName() returns class name instead of null)
add cc-classlib log20070309072452Lbuild.5 03/09/2007 07:24:52classlib
modified gshimansky  /harmony/enhanced/classlib/trunk/modules/instrument/src/main/native/instrument 03/09/2007 06:52:49 Added *.manifest to svn:ignore
add cc-classlib log20070309053842Lbuild.4 03/09/2007 05:38:42classlib
modified apetrenko  /harmony/enhanced/classlib/trunk/modules/awt/make/exclude.linux.x86_64.drl 03/09/2007 04:41:15 RobotTest has been removed back from linux.x86_64.drl since it was added to common list
add cc-classlib log20070309044020Lbuild.3 03/09/2007 04:40:20classlib
modified apetrenko  /harmony/enhanced/classlib/trunk/modules/awt/make/exclude.linux.x86_64.drl 03/09/2007 04:31:46 RobotTest has been excluded for linux x86_64 DRLVM paltform
modified ayza  /harmony/enhanced/classlib/trunk/modules/awt/make/exclude.common 03/09/2007 04:30:53 java.awt.RobotTest was moved back to the exclude list. It seems RobotTest depends on whether mouse or keyboard were touched during the test. 
add cc-classlib log20070308021302Lbuild.2 03/08/2007 02:13:02classlib
modified pyang  /harmony/enhanced/classlib/trunk/modules/portlib/src/main/native/port/unix/hysock.c 03/08/2007 01:49:01 recover patch for HARMONY-2387([classlib][luni] org.apache.harmony.tests.internal.net.www.protocol.http.HttpURLConnectionTest.testUsingProxy() intermittently fails)
add cc-classlib log20070307221003Lbuild.1 03/07/2007 22:10:03classlib
modified pyang  /harmony/enhanced/classlib/trunk/modules/nio_char/src/test/java/org/apache/harmony/nio_char/tests/java/nio/charset/CharsetTest.java 03/07/2007 21:52:27 fix the system property recovery bug
modified pyang  /harmony/enhanced/classlib/trunk/modules/nio_char/make/exclude.common 03/07/2007 21:28:21 apply patch for HARMONY-3328 ([classlib][nio_char]3 Tests in this module could be move out from excluded list.)
modified liangyx  /harmony/enhanced/classlib/trunk/modules/luni/src/test/java/tests/api/java/net/SocketPermissionTest.java 03/07/2007 20:21:55 Apply patch for HARMONY-3245([classlib][luni]tests.api.java.net.SocketPermissionTest uses wrong values to evaluate equals())
modified ayza  /harmony/enhanced/classlib/trunk/modules/awt/make/exclude.common 03/07/2007 11:44:21 Applying patch from HARMONY-3286 ([classlib][awt] The method Robot.mouseMove() works incorrectly on windows). RobotTest was removed from the exclude list.
modified ayza  /harmony/enhanced/classlib/trunk/modules/awt/src/main/java/windows/org/apache/harmony/awt/wtk/windows/WinRobot.java 03/07/2007 11:44:21 Applying patch from HARMONY-3286 ([classlib][awt] The method Robot.mouseMove() works incorrectly on windows). RobotTest was removed from the exclude list.
modified ayza  /harmony/enhanced/classlib/trunk/modules/awt/build.xml 03/07/2007 11:31:57 Remove duplicate test run if -Dtest.case is specified. Someone may use -Dtest.case=<test class> -Djava.awt.headless=true in case of single headless test run.
modified ayza  /harmony/enhanced/classlib/trunk/modules/swing/make/exclude.common 03/07/2007 07:58:12 Applying patch from HARMONY-2703 ([classlib][swing] j.s.JComponent_MultithreadedTest is not stable)
modified ayza  /harmony/enhanced/classlib/trunk/modules/swing/src/test/api/java/common/javax/swing/JComponent_MultithreadedTest.java 03/07/2007 07:58:12 Applying patch from HARMONY-2703 ([classlib][swing] j.s.JComponent_MultithreadedTest is not stable)
modified ayza  /harmony/enhanced/classlib/trunk/modules/swing/src/main/java/common/javax/swing/plaf/basic/BasicRadioButtonUI.java 03/07/2007 07:35:03 Applying patch from HARMONY-2605 ([classlib][swing][plaf] javax.swing.plaf.basic.BasicCheckBoxUI.getMaximumSize(...) throws unexpected ClassCastException)
modified ayza  /harmony/enhanced/classlib/trunk/modules/swing/src/test/api/java/common/javax/swing/plaf/basic/BasicCheckBoxUITest.java 03/07/2007 07:35:03 Applying patch from HARMONY-2605 ([classlib][swing][plaf] javax.swing.plaf.basic.BasicCheckBoxUI.getMaximumSize(...) throws unexpected ClassCastException)
modified smishura  /harmony/enhanced/classlib/trunk/modules/security/src/test/api/java/tests/api/java/security/PermissionCollectionTest.java 03/07/2007 05:30:18 Fix JUnit-style
modified liangyx  /harmony/enhanced/classlib/trunk/modules/luni/src/test/java/tests/api/java/net/TestServerSocketInit.java 03/07/2007 02:38:22 add license header
modified liangyx  /harmony/enhanced/classlib/trunk/modules/luni/src/main/java/java/net/ServerSocket.java 03/07/2007 02:35:52 Apply patch for HARMONY-3265([classlib][luni]java.net.ServerSocket fails to call the OSNetworkSystem.oneTimeInitialization.)
modified liangyx  /harmony/enhanced/classlib/trunk/modules/luni/src/test/java/tests/api/java/net/ServerSocketTest.java 03/07/2007 02:35:52 Apply patch for HARMONY-3265([classlib][luni]java.net.ServerSocket fails to call the OSNetworkSystem.oneTimeInitialization.)
modified liangyx  /harmony/enhanced/classlib/trunk/modules/luni/src/main/java/org/apache/harmony/luni/platform/OSNetworkSystem.java 03/07/2007 02:35:52 Apply patch for HARMONY-3265([classlib][luni]java.net.ServerSocket fails to call the OSNetworkSystem.oneTimeInitialization.)
added liangyx  /harmony/enhanced/classlib/trunk/modules/luni/src/test/java/tests/api/java/net/TestServerSocketInit.java 03/07/2007 02:35:52 Apply patch for HARMONY-3265([classlib][luni]java.net.ServerSocket fails to call the OSNetworkSystem.oneTimeInitialization.)
modified varlax  /harmony/enhanced/drlvm/trunk/vm/vmcore/src/kernel_classes/native/java_lang_VMClassRegistry.cpp 03/07/2007 01:14:34 Fixed HARMONY-2644, loading array classes via Class.forNameTested on SUSE10@ia32 & WinXP
modified varlax  /harmony/enhanced/drlvm/trunk/vm/vmcore/src/kernel_classes/javasrc/java/lang/VMClassRegistry.java 03/07/2007 01:14:34 Fixed HARMONY-2644, loading array classes via Class.forNameTested on SUSE10@ia32 & WinXP
modified varlax  /harmony/enhanced/drlvm/trunk/vm/vmcore/src/kernel_classes/native/java_lang_VMClassRegistry.h 03/07/2007 01:14:34 Fixed HARMONY-2644, loading array classes via Class.forNameTested on SUSE10@ia32 & WinXP
modified varlax  /harmony/enhanced/drlvm/trunk/vm/vmcore/src/kernel_classes/javasrc/java/lang/Class.java 03/07/2007 01:14:34 Fixed HARMONY-2644, loading array classes via Class.forNameTested on SUSE10@ia32 & WinXP
modified varlax  /harmony/enhanced/classlib/trunk/modules/luni/src/test/java/org/apache/harmony/luni/tests/java/lang/ClassTest.java 03/07/2007 01:14:34 Fixed HARMONY-2644, loading array classes via Class.forNameTested on SUSE10@ia32 & WinXP

Mime
  • Unnamed multipart/mixed (inline, None, 0 bytes)
View raw message