harmony-alerts mailing list archives: March 2007

Site index · List index
Message list1 · 2 · Next »Thread · Author · Date
[build-test alert] BUILD FAILED Windows XP SP2 msvc debug: classlib over drlvm
nom...@intel.com   [build-test alert] BUILD FAILED Windows XP SP2 msvc debug: classlib over drlvm Thu, 01 Mar, 08:26
nom...@intel.com   [build-test alert] BUILD FAILED Windows XP SP2 msvc debug: classlib over drlvm Tue, 06 Mar, 10:39
nom...@intel.com   [build-test alert] BUILD FAILED Windows XP SP2 msvc debug: classlib over drlvm Fri, 16 Mar, 13:04
nom...@intel.com   [build-test alert] BUILD FAILED Windows XP SP2 msvc debug: classlib over drlvm Fri, 16 Mar, 19:48
nom...@intel.com   [build-test alert] BUILD FAILED Windows XP SP2 msvc debug: classlib over drlvm Sat, 17 Mar, 07:11
nom...@intel.com   [build-test alert] BUILD FAILED Windows XP SP2 msvc debug: classlib over drlvm Mon, 19 Mar, 14:22
nom...@intel.com   [build-test alert] BUILD FAILED Windows XP SP2 msvc debug: classlib over drlvm Mon, 26 Mar, 03:49
nom...@intel.com   [build-test alert] BUILD FAILED Windows XP SP2 msvc debug: classlib over drlvm Fri, 30 Mar, 11:46
[build-test alert] BUILD SUCCEEDED Linux SUSE 9 64bit gcc debug: classlib over drlvm
nom...@intel.com   [build-test alert] BUILD SUCCEEDED Linux SUSE 9 64bit gcc debug: classlib over drlvm Thu, 01 Mar, 09:03
nom...@intel.com   [build-test alert] BUILD SUCCEEDED Linux SUSE 9 64bit gcc debug: classlib over drlvm Thu, 01 Mar, 23:58
nom...@intel.com   [build-test alert] BUILD SUCCEEDED Linux SUSE 9 64bit gcc debug: classlib over drlvm Fri, 09 Mar, 13:19
nom...@intel.com   [build-test alert] BUILD SUCCEEDED Linux SUSE 9 64bit gcc debug: classlib over drlvm Wed, 14 Mar, 08:04
nom...@intel.com   [build-test alert] BUILD SUCCEEDED Linux SUSE 9 64bit gcc debug: classlib over drlvm Thu, 15 Mar, 16:55
nom...@intel.com   [build-test alert] BUILD SUCCEEDED Linux SUSE 9 64bit gcc debug: classlib over drlvm Fri, 16 Mar, 16:16
nom...@intel.com   [build-test alert] BUILD SUCCEEDED Linux SUSE 9 64bit gcc debug: classlib over drlvm Sat, 17 Mar, 09:24
nom...@intel.com   [build-test alert] BUILD SUCCEEDED Linux SUSE 9 64bit gcc debug: classlib over drlvm Tue, 20 Mar, 07:41
nom...@intel.com   [build-test alert] BUILD SUCCEEDED Linux SUSE 9 64bit gcc debug: classlib over drlvm Wed, 21 Mar, 05:16
nom...@intel.com   [build-test alert] BUILD SUCCEEDED Linux SUSE 9 64bit gcc debug: classlib over drlvm Wed, 21 Mar, 18:18
nom...@intel.com   [build-test alert] BUILD SUCCEEDED Linux SUSE 9 64bit gcc debug: classlib over drlvm Thu, 22 Mar, 19:05
nom...@intel.com   [build-test alert] BUILD SUCCEEDED Linux SUSE 9 64bit gcc debug: classlib over drlvm Sat, 24 Mar, 22:36
nom...@intel.com   [build-test alert] BUILD SUCCEEDED Linux SUSE 9 64bit gcc debug: classlib over drlvm Tue, 27 Mar, 08:50
nom...@intel.com   [build-test alert] BUILD SUCCEEDED Linux SUSE 9 64bit gcc debug: classlib over drlvm Tue, 27 Mar, 20:55
nom...@intel.com   [build-test alert] BUILD SUCCEEDED Linux SUSE 9 64bit gcc debug: classlib over drlvm Wed, 28 Mar, 05:04
nom...@intel.com   [build-test alert] BUILD SUCCEEDED Linux SUSE 9 64bit gcc debug: classlib over drlvm Fri, 30 Mar, 17:26
[build-test alert] BUILD FAILED lnx gcc debug: drlvm
ge...@apache.org   [build-test alert] BUILD FAILED lnx gcc debug: drlvm Thu, 01 Mar, 09:16
ge...@apache.org   [build-test alert] BUILD FAILED lnx gcc debug: drlvm Thu, 01 Mar, 14:40
ge...@apache.org   [build-test alert] BUILD FAILED lnx gcc debug: drlvm Thu, 01 Mar, 22:37
nom...@frigga.cs.uiuc.edu   [build-test alert] BUILD FAILED lnx gcc debug: drlvm Fri, 02 Mar, 04:07
ge...@apache.org   [build-test alert] BUILD FAILED lnx gcc debug: drlvm Fri, 02 Mar, 06:29
ge...@apache.org   [build-test alert] BUILD FAILED lnx gcc debug: drlvm Fri, 02 Mar, 09:36
ge...@apache.org   [build-test alert] BUILD FAILED lnx gcc debug: drlvm Fri, 02 Mar, 15:09
ge...@apache.org   [build-test alert] BUILD FAILED lnx gcc debug: drlvm Sat, 03 Mar, 01:17
ge...@apache.org   [build-test alert] BUILD FAILED lnx gcc debug: drlvm Sun, 04 Mar, 01:39
ge...@apache.org   [build-test alert] BUILD FAILED lnx gcc debug: drlvm Mon, 05 Mar, 15:13
ge...@apache.org   [build-test alert] BUILD FAILED lnx gcc debug: drlvm Tue, 06 Mar, 09:06
ge...@apache.org   [build-test alert] BUILD FAILED lnx gcc debug: drlvm Tue, 06 Mar, 12:02
ge...@apache.org   [build-test alert] BUILD FAILED lnx gcc debug: drlvm Wed, 07 Mar, 04:08
ge...@apache.org   [build-test alert] BUILD FAILED lnx gcc debug: drlvm Wed, 07 Mar, 13:45
ge...@apache.org   [build-test alert] BUILD FAILED lnx gcc debug: drlvm Wed, 07 Mar, 14:58
ge...@apache.org   [build-test alert] BUILD FAILED lnx gcc debug: drlvm Thu, 08 Mar, 02:13
ge...@apache.org   [build-test alert] BUILD FAILED lnx gcc debug: drlvm Thu, 08 Mar, 06:13
ge...@apache.org   [build-test alert] BUILD FAILED lnx gcc debug: drlvm Fri, 09 Mar, 05:51
ge...@apache.org   [build-test alert] BUILD FAILED lnx gcc debug: drlvm Fri, 09 Mar, 13:49
ge...@apache.org   [build-test alert] BUILD FAILED lnx gcc debug: drlvm Mon, 12 Mar, 10:18
ge...@apache.org   [build-test alert] BUILD FAILED lnx gcc debug: drlvm Mon, 12 Mar, 17:56
ge...@apache.org   [build-test alert] BUILD FAILED lnx gcc debug: drlvm Tue, 13 Mar, 12:57
ge...@apache.org   [build-test alert] BUILD FAILED lnx gcc debug: drlvm Tue, 13 Mar, 20:44
ge...@apache.org   [build-test alert] BUILD FAILED lnx gcc debug: drlvm Wed, 14 Mar, 05:59
ge...@apache.org   [build-test alert] BUILD FAILED lnx gcc debug: drlvm Wed, 14 Mar, 07:36
ge...@apache.org   [build-test alert] BUILD FAILED lnx gcc debug: drlvm Thu, 15 Mar, 11:18
ge...@apache.org   [build-test alert] BUILD FAILED lnx gcc debug: drlvm Thu, 15 Mar, 16:36
ge...@apache.org   [build-test alert] BUILD FAILED lnx gcc debug: drlvm Fri, 16 Mar, 10:22
ge...@apache.org   [build-test alert] BUILD FAILED lnx gcc debug: drlvm Fri, 16 Mar, 15:46
ge...@apache.org   [build-test alert] BUILD FAILED lnx gcc debug: drlvm Fri, 16 Mar, 21:17
ge...@apache.org   [build-test alert] BUILD FAILED lnx gcc debug: drlvm Sat, 17 Mar, 09:14
ge...@apache.org   [build-test alert] BUILD FAILED lnx gcc debug: drlvm Sun, 18 Mar, 08:00
ge...@apache.org   [build-test alert] BUILD FAILED lnx gcc debug: drlvm Mon, 19 Mar, 17:30
ge...@apache.org   [build-test alert] BUILD FAILED lnx gcc debug: drlvm Tue, 20 Mar, 08:33
ge...@apache.org   [build-test alert] BUILD FAILED lnx gcc debug: drlvm Tue, 20 Mar, 12:49
ge...@apache.org   [build-test alert] BUILD FAILED lnx gcc debug: drlvm Tue, 20 Mar, 13:41
ge...@apache.org   [build-test alert] BUILD FAILED lnx gcc debug: drlvm Tue, 20 Mar, 18:45
ge...@apache.org   [build-test alert] BUILD FAILED lnx gcc debug: drlvm Wed, 21 Mar, 16:13
ge...@apache.org   [build-test alert] BUILD FAILED lnx gcc debug: drlvm Thu, 22 Mar, 04:35
ge...@apache.org   [build-test alert] BUILD FAILED lnx gcc debug: drlvm Thu, 22 Mar, 08:41
ge...@apache.org   [build-test alert] BUILD FAILED lnx gcc debug: drlvm Fri, 23 Mar, 12:24
ge...@apache.org   [build-test alert] BUILD FAILED lnx gcc debug: drlvm Mon, 26 Mar, 17:51
ge...@apache.org   [build-test alert] BUILD FAILED lnx gcc debug: drlvm Tue, 27 Mar, 03:57
ge...@apache.org   [build-test alert] BUILD FAILED lnx gcc debug: drlvm Wed, 28 Mar, 05:49
ge...@apache.org   [build-test alert] BUILD FAILED lnx gcc debug: drlvm Wed, 28 Mar, 12:45
nbe...@kc.rr.com   [build-test alert] BUILD FAILED lnx gcc debug: drlvm Thu, 29 Mar, 04:59
[build-test alert] BUILD FAILED lnx gcc debug: classlib over drlvm
ge...@apache.org   [build-test alert] BUILD FAILED lnx gcc debug: classlib over drlvm Thu, 01 Mar, 09:16
ge...@apache.org   [build-test alert] BUILD FAILED lnx gcc debug: classlib over drlvm Mon, 05 Mar, 06:33
ge...@apache.org   [build-test alert] BUILD FAILED lnx gcc debug: classlib over drlvm Mon, 05 Mar, 13:07
nom...@frigga.cs.uiuc.edu   [build-test alert] BUILD FAILED lnx gcc debug: classlib over drlvm Fri, 09 Mar, 06:15
ge...@apache.org   [build-test alert] BUILD FAILED lnx gcc debug: classlib over drlvm Mon, 12 Mar, 08:29
ge...@apache.org   [build-test alert] BUILD FAILED lnx gcc debug: classlib over drlvm Tue, 13 Mar, 08:30
nom...@frigga.cs.uiuc.edu   [build-test alert] BUILD FAILED lnx gcc debug: classlib over drlvm Wed, 14 Mar, 15:34
[build-test alert] BUILD SUCCEEDED Windows XP SP2 msvc debug: classlib over drlvm
nom...@intel.com   [build-test alert] BUILD SUCCEEDED Windows XP SP2 msvc debug: classlib over drlvm Thu, 01 Mar, 09:22
nom...@intel.com   [build-test alert] BUILD SUCCEEDED Windows XP SP2 msvc debug: classlib over drlvm Tue, 06 Mar, 12:52
nom...@intel.com   [build-test alert] BUILD SUCCEEDED Windows XP SP2 msvc debug: classlib over drlvm Fri, 16 Mar, 17:33
nom...@intel.com   [build-test alert] BUILD SUCCEEDED Windows XP SP2 msvc debug: classlib over drlvm Fri, 16 Mar, 22:02
nom...@intel.com   [build-test alert] BUILD SUCCEEDED Windows XP SP2 msvc debug: classlib over drlvm Sat, 17 Mar, 09:37
nom...@intel.com   [build-test alert] BUILD SUCCEEDED Windows XP SP2 msvc debug: classlib over drlvm Mon, 19 Mar, 16:37
nom...@intel.com   [build-test alert] BUILD SUCCEEDED Windows XP SP2 msvc debug: classlib over drlvm Tue, 27 Mar, 15:04
nom...@intel.com   [build-test alert] BUILD SUCCEEDED Windows XP SP2 msvc debug: classlib over drlvm Fri, 30 Mar, 15:23
[build-test alert] BUILD SUCCEEDED lnx gcc debug: classlib
ge...@apache.org   [build-test alert] BUILD SUCCEEDED lnx gcc debug: classlib Thu, 01 Mar, 09:28
nom...@frigga.cs.uiuc.edu   [build-test alert] BUILD SUCCEEDED lnx gcc debug: classlib Thu, 01 Mar, 23:46
nbe...@kc.rr.com   [build-test alert] BUILD SUCCEEDED lnx gcc debug: classlib Thu, 29 Mar, 03:08
nbe...@kc.rr.com   [build-test alert] BUILD SUCCEEDED lnx gcc debug: classlib Thu, 29 Mar, 09:01
[build-test alert] BUILD SUCCEEDED Linux SUSE 9 gcc debug: classlib over drlvm
nom...@intel.com   [build-test alert] BUILD SUCCEEDED Linux SUSE 9 gcc debug: classlib over drlvm Thu, 01 Mar, 09:32
nom...@intel.com   [build-test alert] BUILD SUCCEEDED Linux SUSE 9 gcc debug: classlib over drlvm Thu, 08 Mar, 10:57
nom...@intel.com   [build-test alert] BUILD SUCCEEDED Linux SUSE 9 gcc debug: classlib over drlvm Thu, 15 Mar, 08:14
nom...@intel.com   [build-test alert] BUILD SUCCEEDED Linux SUSE 9 gcc debug: classlib over drlvm Mon, 19 Mar, 18:51
nom...@intel.com   [build-test alert] BUILD SUCCEEDED Linux SUSE 9 gcc debug: classlib over drlvm Wed, 21 Mar, 11:00
nom...@intel.com   [build-test alert] BUILD SUCCEEDED Linux SUSE 9 gcc debug: classlib over drlvm Tue, 27 Mar, 19:05
nom...@intel.com   [build-test alert] BUILD SUCCEEDED Linux SUSE 9 gcc debug: classlib over drlvm Wed, 28 Mar, 18:12
[build-test alert] BUILD SUCCEEDED lnx gcc debug: drlvm
ge...@apache.org   [build-test alert] BUILD SUCCEEDED lnx gcc debug: drlvm Thu, 01 Mar, 09:38
ge...@apache.org   [build-test alert] BUILD SUCCEEDED lnx gcc debug: drlvm Thu, 01 Mar, 11:47
ge...@apache.org   [build-test alert] BUILD SUCCEEDED lnx gcc debug: drlvm Thu, 01 Mar, 17:14
nom...@frigga.cs.uiuc.edu   [build-test alert] BUILD SUCCEEDED lnx gcc debug: drlvm Fri, 02 Mar, 04:17
ge...@apache.org   [build-test alert] BUILD SUCCEEDED lnx gcc debug: drlvm Fri, 02 Mar, 06:45
ge...@apache.org   [build-test alert] BUILD SUCCEEDED lnx gcc debug: drlvm Fri, 02 Mar, 08:53
ge...@apache.org   [build-test alert] BUILD SUCCEEDED lnx gcc debug: drlvm Fri, 02 Mar, 12:13
ge...@apache.org   [build-test alert] BUILD SUCCEEDED lnx gcc debug: drlvm Fri, 02 Mar, 22:26
ge...@apache.org   [build-test alert] BUILD SUCCEEDED lnx gcc debug: drlvm Sat, 03 Mar, 03:50
nom...@frigga.cs.uiuc.edu   [build-test alert] BUILD SUCCEEDED lnx gcc debug: drlvm Sat, 03 Mar, 04:45
ge...@apache.org   [build-test alert] BUILD SUCCEEDED lnx gcc debug: drlvm Sun, 04 Mar, 05:48
ge...@apache.org   [build-test alert] BUILD SUCCEEDED lnx gcc debug: drlvm Mon, 05 Mar, 18:39
ge...@apache.org   [build-test alert] BUILD SUCCEEDED lnx gcc debug: drlvm Tue, 06 Mar, 16:07
ge...@apache.org   [build-test alert] BUILD SUCCEEDED lnx gcc debug: drlvm Tue, 06 Mar, 21:16
ge...@apache.org   [build-test alert] BUILD SUCCEEDED lnx gcc debug: drlvm Wed, 07 Mar, 07:24
ge...@apache.org   [build-test alert] BUILD SUCCEEDED lnx gcc debug: drlvm Wed, 07 Mar, 15:57
ge...@apache.org   [build-test alert] BUILD SUCCEEDED lnx gcc debug: drlvm Wed, 07 Mar, 22:31
ge...@apache.org   [build-test alert] BUILD SUCCEEDED lnx gcc debug: drlvm Thu, 08 Mar, 05:54
ge...@apache.org   [build-test alert] BUILD SUCCEEDED lnx gcc debug: drlvm Thu, 08 Mar, 08:01
ge...@apache.org   [build-test alert] BUILD SUCCEEDED lnx gcc debug: drlvm Fri, 09 Mar, 07:59
ge...@apache.org   [build-test alert] BUILD SUCCEEDED lnx gcc debug: drlvm Fri, 09 Mar, 21:51
ge...@apache.org   [build-test alert] BUILD SUCCEEDED lnx gcc debug: drlvm Mon, 12 Mar, 12:34
ge...@apache.org   [build-test alert] BUILD SUCCEEDED lnx gcc debug: drlvm Mon, 12 Mar, 23:47
ge...@apache.org   [build-test alert] BUILD SUCCEEDED lnx gcc debug: drlvm Tue, 13 Mar, 15:20
ge...@apache.org   [build-test alert] BUILD SUCCEEDED lnx gcc debug: drlvm Tue, 13 Mar, 22:51
ge...@apache.org   [build-test alert] BUILD SUCCEEDED lnx gcc debug: drlvm Wed, 14 Mar, 08:28
ge...@apache.org   [build-test alert] BUILD SUCCEEDED lnx gcc debug: drlvm Wed, 14 Mar, 10:14
ge...@apache.org   [build-test alert] BUILD SUCCEEDED lnx gcc debug: drlvm Thu, 15 Mar, 14:01
ge...@apache.org   [build-test alert] BUILD SUCCEEDED lnx gcc debug: drlvm Fri, 16 Mar, 00:04
ge...@apache.org   [build-test alert] BUILD SUCCEEDED lnx gcc debug: drlvm Fri, 16 Mar, 12:55
ge...@apache.org   [build-test alert] BUILD SUCCEEDED lnx gcc debug: drlvm Fri, 16 Mar, 18:28
ge...@apache.org   [build-test alert] BUILD SUCCEEDED lnx gcc debug: drlvm Sat, 17 Mar, 00:02
ge...@apache.org   [build-test alert] BUILD SUCCEEDED lnx gcc debug: drlvm Sat, 17 Mar, 17:02
ge...@apache.org   [build-test alert] BUILD SUCCEEDED lnx gcc debug: drlvm Sun, 18 Mar, 10:31
ge...@apache.org   [build-test alert] BUILD SUCCEEDED lnx gcc debug: drlvm Mon, 19 Mar, 19:48
ge...@apache.org   [build-test alert] BUILD SUCCEEDED lnx gcc debug: drlvm Tue, 20 Mar, 10:57
ge...@apache.org   [build-test alert] BUILD SUCCEEDED lnx gcc debug: drlvm Tue, 20 Mar, 15:18
ge...@apache.org   [build-test alert] BUILD SUCCEEDED lnx gcc debug: drlvm Tue, 20 Mar, 16:25
ge...@apache.org   [build-test alert] BUILD SUCCEEDED lnx gcc debug: drlvm Tue, 20 Mar, 21:15
ge...@apache.org   [build-test alert] BUILD SUCCEEDED lnx gcc debug: drlvm Wed, 21 Mar, 18:39
ge...@apache.org   [build-test alert] BUILD SUCCEEDED lnx gcc debug: drlvm Thu, 22 Mar, 06:49
ge...@apache.org   [build-test alert] BUILD SUCCEEDED lnx gcc debug: drlvm Thu, 22 Mar, 11:09
ge...@apache.org   [build-test alert] BUILD SUCCEEDED lnx gcc debug: drlvm Fri, 23 Mar, 14:53
ge...@apache.org   [build-test alert] BUILD SUCCEEDED lnx gcc debug: drlvm Mon, 26 Mar, 20:22
ge...@apache.org   [build-test alert] BUILD SUCCEEDED lnx gcc debug: drlvm Tue, 27 Mar, 07:35
ge...@apache.org   [build-test alert] BUILD SUCCEEDED lnx gcc debug: drlvm Wed, 28 Mar, 08:08
ge...@apache.org   [build-test alert] BUILD SUCCEEDED lnx gcc debug: drlvm Wed, 28 Mar, 16:44
nbe...@kc.rr.com   [build-test alert] BUILD SUCCEEDED lnx gcc debug: drlvm Thu, 29 Mar, 03:36
[build-test alert] BUILD SUCCEEDED lnx gcc debug: classlib over drlvm
ge...@apache.org   [build-test alert] BUILD SUCCEEDED lnx gcc debug: classlib over drlvm Thu, 01 Mar, 10:13
nom...@frigga.cs.uiuc.edu   [build-test alert] BUILD SUCCEEDED lnx gcc debug: classlib over drlvm Fri, 02 Mar, 18:54
ge...@apache.org   [build-test alert] BUILD SUCCEEDED lnx gcc debug: classlib over drlvm Sat, 03 Mar, 23:48
ge...@apache.org   [build-test alert] BUILD SUCCEEDED lnx gcc debug: classlib over drlvm Mon, 05 Mar, 09:06
ge...@apache.org   [build-test alert] BUILD SUCCEEDED lnx gcc debug: classlib over drlvm Fri, 09 Mar, 14:38
nom...@frigga.cs.uiuc.edu   [build-test alert] BUILD SUCCEEDED lnx gcc debug: classlib over drlvm Sun, 11 Mar, 11:13
ge...@apache.org   [build-test alert] BUILD SUCCEEDED lnx gcc debug: classlib over drlvm Mon, 12 Mar, 11:01
[continuum] BUILD SUCCESSFUL: Classlib/linux.ia32 Build/Test
nom...@hursley.ibm.com   [continuum] BUILD SUCCESSFUL: Classlib/linux.ia32 Build/Test Thu, 01 Mar, 10:15
nom...@hursley.ibm.com   [continuum] BUILD SUCCESSFUL: Classlib/linux.ia32 Build/Test Thu, 01 Mar, 21:17
nom...@hursley.ibm.com   [continuum] BUILD SUCCESSFUL: Classlib/linux.ia32 Build/Test Fri, 02 Mar, 09:10
nom...@hursley.ibm.com   [continuum] BUILD SUCCESSFUL: Classlib/linux.ia32 Build/Test Mon, 05 Mar, 11:35
nom...@hursley.ibm.com   [continuum] BUILD SUCCESSFUL: Classlib/linux.ia32 Build/Test Fri, 09 Mar, 12:17
nom...@hursley.ibm.com   [continuum] BUILD SUCCESSFUL: Classlib/linux.ia32 Build/Test Tue, 13 Mar, 10:22
nom...@hursley.ibm.com   [continuum] BUILD SUCCESSFUL: Classlib/linux.ia32 Build/Test Wed, 14 Mar, 11:18
nom...@hursley.ibm.com   [continuum] BUILD SUCCESSFUL: Classlib/linux.ia32 Build/Test Thu, 15 Mar, 06:12
nom...@hursley.ibm.com   [continuum] BUILD SUCCESSFUL: Classlib/linux.ia32 Build/Test Fri, 16 Mar, 09:20
nom...@hursley.ibm.com   [continuum] BUILD SUCCESSFUL: Classlib/linux.ia32 Build/Test Fri, 16 Mar, 19:19
nom...@hursley.ibm.com   [continuum] BUILD SUCCESSFUL: Classlib/linux.ia32 Build/Test Sat, 17 Mar, 13:13
nom...@hursley.ibm.com   [continuum] BUILD SUCCESSFUL: Classlib/linux.ia32 Build/Test Tue, 20 Mar, 13:19
nom...@hursley.ibm.com   [continuum] BUILD SUCCESSFUL: Classlib/linux.ia32 Build/Test Wed, 21 Mar, 09:20
nom...@hursley.ibm.com   [continuum] BUILD SUCCESSFUL: Classlib/linux.ia32 Build/Test Thu, 22 Mar, 17:19
nom...@hursley.ibm.com   [continuum] BUILD SUCCESSFUL: Classlib/linux.ia32 Build/Test Fri, 23 Mar, 15:19
nom...@hursley.ibm.com   [continuum] BUILD SUCCESSFUL: Classlib/linux.ia32 Build/Test Mon, 26 Mar, 10:56
nom...@hursley.ibm.com   [continuum] BUILD SUCCESSFUL: Classlib/linux.ia32 Build/Test Mon, 26 Mar, 19:20
nom...@hursley.ibm.com   [continuum] BUILD SUCCESSFUL: Classlib/linux.ia32 Build/Test Thu, 29 Mar, 07:21
[build-test alert] BUILD FIXED SUSEL9 64bit gcc debug: classlib tests iterative
nom...@intel.com   [build-test alert] BUILD FIXED SUSEL9 64bit gcc debug: classlib tests iterative Thu, 01 Mar, 11:57
nom...@intel.com   [build-test alert] BUILD FIXED SUSEL9 64bit gcc debug: classlib tests iterative Tue, 06 Mar, 10:51
[continuum] BUILD FAILURE: Classlib/linux.ia32 Build/Test
nom...@hursley.ibm.com   [continuum] BUILD FAILURE: Classlib/linux.ia32 Build/Test Thu, 01 Mar, 18:22
nom...@hursley.ibm.com   [continuum] BUILD FAILURE: Classlib/linux.ia32 Build/Test Fri, 02 Mar, 07:22
nom...@hursley.ibm.com   [continuum] BUILD FAILURE: Classlib/linux.ia32 Build/Test Mon, 05 Mar, 05:45
nom...@hursley.ibm.com   [continuum] BUILD FAILURE: Classlib/linux.ia32 Build/Test Wed, 07 Mar, 19:16
nom...@hursley.ibm.com   [continuum] BUILD FAILURE: Classlib/linux.ia32 Build/Test Thu, 08 Mar, 04:17
nom...@hursley.ibm.com   [continuum] BUILD FAILURE: Classlib/linux.ia32 Build/Test Thu, 08 Mar, 06:53
nom...@hursley.ibm.com   [continuum] BUILD FAILURE: Classlib/linux.ia32 Build/Test Thu, 08 Mar, 09:18
nom...@hursley.ibm.com   [continuum] BUILD FAILURE: Classlib/linux.ia32 Build/Test Tue, 13 Mar, 13:03
nom...@hursley.ibm.com   [continuum] BUILD FAILURE: Classlib/linux.ia32 Build/Test Tue, 13 Mar, 15:18
nom...@hursley.ibm.com   [continuum] BUILD FAILURE: Classlib/linux.ia32 Build/Test Tue, 13 Mar, 17:56
nom...@hursley.ibm.com   [continuum] BUILD FAILURE: Classlib/linux.ia32 Build/Test Tue, 13 Mar, 20:38
nom...@hursley.ibm.com   [continuum] BUILD FAILURE: Classlib/linux.ia32 Build/Test Wed, 14 Mar, 06:19
nom...@hursley.ibm.com   [continuum] BUILD FAILURE: Classlib/linux.ia32 Build/Test Wed, 14 Mar, 09:19
nom...@hursley.ibm.com   [continuum] BUILD FAILURE: Classlib/linux.ia32 Build/Test Thu, 15 Mar, 02:41
nom...@hursley.ibm.com   [continuum] BUILD FAILURE: Classlib/linux.ia32 Build/Test Thu, 15 Mar, 04:16
nom...@hursley.ibm.com   [continuum] BUILD FAILURE: Classlib/linux.ia32 Build/Test Thu, 15 Mar, 21:23
nom...@hursley.ibm.com   [continuum] BUILD FAILURE: Classlib/linux.ia32 Build/Test Fri, 16 Mar, 13:21
nom...@hursley.ibm.com   [continuum] BUILD FAILURE: Classlib/linux.ia32 Build/Test Fri, 16 Mar, 15:20
nom...@hursley.ibm.com   [continuum] BUILD FAILURE: Classlib/linux.ia32 Build/Test Fri, 16 Mar, 17:13
nom...@hursley.ibm.com   [continuum] BUILD FAILURE: Classlib/linux.ia32 Build/Test Sat, 17 Mar, 11:17
nom...@hursley.ibm.com   [continuum] BUILD FAILURE: Classlib/linux.ia32 Build/Test Tue, 20 Mar, 06:31
nom...@hursley.ibm.com   [continuum] BUILD FAILURE: Classlib/linux.ia32 Build/Test Tue, 20 Mar, 15:12
nom...@hursley.ibm.com   [continuum] BUILD FAILURE: Classlib/linux.ia32 Build/Test Tue, 20 Mar, 17:18
nom...@hursley.ibm.com   [continuum] BUILD FAILURE: Classlib/linux.ia32 Build/Test Wed, 21 Mar, 05:20
nom...@hursley.ibm.com   [continuum] BUILD FAILURE: Classlib/linux.ia32 Build/Test Wed, 21 Mar, 11:12
nom...@hursley.ibm.com   [continuum] BUILD FAILURE: Classlib/linux.ia32 Build/Test Wed, 21 Mar, 13:19
nom...@hursley.ibm.com   [continuum] BUILD FAILURE: Classlib/linux.ia32 Build/Test Wed, 21 Mar, 18:22
nom...@hursley.ibm.com   [continuum] BUILD FAILURE: Classlib/linux.ia32 Build/Test Wed, 21 Mar, 21:19
nom...@hursley.ibm.com   [continuum] BUILD FAILURE: Classlib/linux.ia32 Build/Test Thu, 22 Mar, 04:36
nom...@hursley.ibm.com   [continuum] BUILD FAILURE: Classlib/linux.ia32 Build/Test Thu, 22 Mar, 08:19
nom...@hursley.ibm.com   [continuum] BUILD FAILURE: Classlib/linux.ia32 Build/Test Thu, 22 Mar, 12:27
nom...@hursley.ibm.com   [continuum] BUILD FAILURE: Classlib/linux.ia32 Build/Test Thu, 22 Mar, 14:10
nom...@hursley.ibm.com   [continuum] BUILD FAILURE: Classlib/linux.ia32 Build/Test Fri, 23 Mar, 07:21
nom...@hursley.ibm.com   [continuum] BUILD FAILURE: Classlib/linux.ia32 Build/Test Fri, 23 Mar, 11:17
nom...@hursley.ibm.com   [continuum] BUILD FAILURE: Classlib/linux.ia32 Build/Test Fri, 23 Mar, 13:09
nom...@hursley.ibm.com   [continuum] BUILD FAILURE: Classlib/linux.ia32 Build/Test Fri, 23 Mar, 17:25
nom...@hursley.ibm.com   [continuum] BUILD FAILURE: Classlib/linux.ia32 Build/Test Wed, 28 Mar, 10:53
nom...@hursley.ibm.com   [continuum] BUILD FAILURE: Classlib/linux.ia32 Build/Test Wed, 28 Mar, 13:40
nom...@hursley.ibm.com   [continuum] BUILD FAILURE: Classlib/linux.ia32 Build/Test Thu, 29 Mar, 08:09
nom...@hursley.ibm.com   [continuum] BUILD FAILURE: Classlib/linux.ia32 Build/Test Thu, 29 Mar, 10:31
nom...@hursley.ibm.com   [continuum] BUILD FAILURE: Classlib/linux.ia32 Build/Test Thu, 29 Mar, 14:27
nom...@hursley.ibm.com   [continuum] BUILD FAILURE: Classlib/linux.ia32 Build/Test Fri, 30 Mar, 12:22
nom...@hursley.ibm.com   [continuum] BUILD FAILURE: Classlib/linux.ia32 Build/Test Fri, 30 Mar, 16:18
[build-test alert] BUILD FAILED Linux SUSE 9 64bit gcc debug: classlib over drlvm
nom...@intel.com   [build-test alert] BUILD FAILED Linux SUSE 9 64bit gcc debug: classlib over drlvm Thu, 01 Mar, 23:22
nom...@intel.com   [build-test alert] BUILD FAILED Linux SUSE 9 64bit gcc debug: classlib over drlvm Mon, 05 Mar, 11:30
nom...@intel.com   [build-test alert] BUILD FAILED Linux SUSE 9 64bit gcc debug: classlib over drlvm Mon, 12 Mar, 11:15
nom...@intel.com   [build-test alert] BUILD FAILED Linux SUSE 9 64bit gcc debug: classlib over drlvm Thu, 15 Mar, 16:16
nom...@intel.com   [build-test alert] BUILD FAILED Linux SUSE 9 64bit gcc debug: classlib over drlvm Fri, 16 Mar, 12:44
nom...@intel.com   [build-test alert] BUILD FAILED Linux SUSE 9 64bit gcc debug: classlib over drlvm Sat, 17 Mar, 07:15
nom...@intel.com   [build-test alert] BUILD FAILED Linux SUSE 9 64bit gcc debug: classlib over drlvm Tue, 20 Mar, 05:45
nom...@intel.com   [build-test alert] BUILD FAILED Linux SUSE 9 64bit gcc debug: classlib over drlvm Tue, 20 Mar, 16:30
nom...@intel.com   [build-test alert] BUILD FAILED Linux SUSE 9 64bit gcc debug: classlib over drlvm Wed, 21 Mar, 16:37
nom...@intel.com   [build-test alert] BUILD FAILED Linux SUSE 9 64bit gcc debug: classlib over drlvm Thu, 22 Mar, 17:17
nom...@intel.com   [build-test alert] BUILD FAILED Linux SUSE 9 64bit gcc debug: classlib over drlvm Fri, 23 Mar, 19:03
nom...@intel.com   [build-test alert] BUILD FAILED Linux SUSE 9 64bit gcc debug: classlib over drlvm Mon, 26 Mar, 03:52
nom...@intel.com   [build-test alert] BUILD FAILED Linux SUSE 9 64bit gcc debug: classlib over drlvm Tue, 27 Mar, 09:21
nom...@intel.com   [build-test alert] BUILD FAILED Linux SUSE 9 64bit gcc debug: classlib over drlvm Tue, 27 Mar, 22:14
nom...@intel.com   [build-test alert] BUILD FAILED Linux SUSE 9 64bit gcc debug: classlib over drlvm Fri, 30 Mar, 15:12
[build-test alert] BUILD FAILED Linux SUSE 9 64bit gcc debug: drlvm reg.test
nom...@intel.com   [build-test alert] BUILD FAILED Linux SUSE 9 64bit gcc debug: drlvm reg.test Fri, 02 Mar, 08:29
nom...@intel.com   [build-test alert] BUILD FAILED Linux SUSE 9 64bit gcc debug: drlvm reg.test Thu, 15 Mar, 09:56
nom...@intel.com   [build-test alert] BUILD FAILED Linux SUSE 9 64bit gcc debug: drlvm reg.test Sat, 17 Mar, 07:14
nom...@intel.com   [build-test alert] BUILD FAILED Linux SUSE 9 64bit gcc debug: drlvm reg.test Mon, 19 Mar, 19:00
nom...@intel.com   [build-test alert] BUILD FAILED Linux SUSE 9 64bit gcc debug: drlvm reg.test Wed, 21 Mar, 12:27
nom...@intel.com   [build-test alert] BUILD FAILED Linux SUSE 9 64bit gcc debug: drlvm reg.test Tue, 27 Mar, 22:16
[build-test alert] BUILD FAILED SUSEL9 IA32 gcc debug: classlib tests iterative
nom...@intel.com   [build-test alert] BUILD FAILED SUSEL9 IA32 gcc debug: classlib tests iterative Fri, 02 Mar, 11:12
nom...@intel.com   [build-test alert] BUILD FAILED SUSEL9 IA32 gcc debug: classlib tests iterative Sat, 03 Mar, 18:58
nom...@intel.com   [build-test alert] BUILD FAILED SUSEL9 IA32 gcc debug: classlib tests iterative Tue, 06 Mar, 10:00
nom...@intel.com   [build-test alert] BUILD FAILED SUSEL9 IA32 gcc debug: classlib tests iterative Wed, 07 Mar, 15:00
nom...@intel.com   [build-test alert] BUILD FAILED SUSEL9 IA32 gcc debug: classlib tests iterative Thu, 08 Mar, 20:11
nom...@intel.com   [build-test alert] BUILD FAILED SUSEL9 IA32 gcc debug: classlib tests iterative Tue, 13 Mar, 09:16
nom...@intel.com   [build-test alert] BUILD FAILED SUSEL9 IA32 gcc debug: classlib tests iterative Thu, 15 Mar, 05:34
nom...@intel.com   [build-test alert] BUILD FAILED SUSEL9 IA32 gcc debug: classlib tests iterative Fri, 16 Mar, 13:14
nom...@intel.com   [build-test alert] BUILD FAILED SUSEL9 IA32 gcc debug: classlib tests iterative Sun, 18 Mar, 09:14
nom...@intel.com   [build-test alert] BUILD FAILED SUSEL9 IA32 gcc debug: classlib tests iterative Tue, 20 Mar, 05:25
nom...@intel.com   [build-test alert] BUILD FAILED SUSEL9 IA32 gcc debug: classlib tests iterative Wed, 21 Mar, 20:46
nom...@intel.com   [build-test alert] BUILD FAILED SUSEL9 IA32 gcc debug: classlib tests iterative Fri, 23 Mar, 07:00
nom...@intel.com   [build-test alert] BUILD FAILED SUSEL9 IA32 gcc debug: classlib tests iterative Sat, 24 Mar, 16:57
nom...@intel.com   [build-test alert] BUILD FAILED SUSEL9 IA32 gcc debug: classlib tests iterative Mon, 26 Mar, 05:13
nom...@intel.com   [build-test alert] BUILD FAILED SUSEL9 IA32 gcc debug: classlib tests iterative Tue, 27 Mar, 16:05
nom...@intel.com   [build-test alert] BUILD FAILED SUSEL9 IA32 gcc debug: classlib tests iterative Thu, 29 Mar, 01:53
nom...@intel.com   [build-test alert] BUILD FAILED SUSEL9 IA32 gcc debug: classlib tests iterative Fri, 30 Mar, 10:01
nom...@intel.com   [build-test alert] BUILD FAILED SUSEL9 IA32 gcc debug: classlib tests iterative Sat, 31 Mar, 18:46
[build-test alert] BUILD FAILED SUSEL9 64bit gcc debug: classlib tests iterative
nom...@intel.com   [build-test alert] BUILD FAILED SUSEL9 64bit gcc debug: classlib tests iterative Fri, 02 Mar, 18:00
nom...@intel.com   [build-test alert] BUILD FAILED SUSEL9 64bit gcc debug: classlib tests iterative Sat, 03 Mar, 23:25
nom...@intel.com   [build-test alert] BUILD FAILED SUSEL9 64bit gcc debug: classlib tests iterative Mon, 05 Mar, 05:03
nom...@intel.com   [build-test alert] BUILD FAILED SUSEL9 64bit gcc debug: classlib tests iterative Wed, 07 Mar, 14:17
nom...@intel.com   [build-test alert] BUILD FAILED SUSEL9 64bit gcc debug: classlib tests iterative Thu, 08 Mar, 17:47
nom...@intel.com   [build-test alert] BUILD FAILED SUSEL9 64bit gcc debug: classlib tests iterative Tue, 13 Mar, 08:14
nom...@intel.com   [build-test alert] BUILD FAILED SUSEL9 64bit gcc debug: classlib tests iterative Wed, 21 Mar, 12:25
nom...@intel.com   [build-test alert] BUILD FAILED SUSEL9 64bit gcc debug: classlib tests iterative Sat, 24 Mar, 02:22
nom...@intel.com   [build-test alert] BUILD FAILED SUSEL9 64bit gcc debug: classlib tests iterative Sun, 25 Mar, 16:28
nom...@intel.com   [build-test alert] BUILD FAILED SUSEL9 64bit gcc debug: classlib tests iterative Tue, 27 Mar, 02:36
nom...@intel.com   [build-test alert] BUILD FAILED SUSEL9 64bit gcc debug: classlib tests iterative Wed, 28 Mar, 15:07
[build-test alert] BUILD FAILED Windows XP SP2 msvc debug: drlvm reg.test
nom...@intel.com   [build-test alert] BUILD FAILED Windows XP SP2 msvc debug: drlvm reg.test Sat, 03 Mar, 20:43
nom...@intel.com   [build-test alert] BUILD FAILED Windows XP SP2 msvc debug: drlvm reg.test Thu, 15 Mar, 12:19
nom...@intel.com   [build-test alert] BUILD FAILED Windows XP SP2 msvc debug: drlvm reg.test Sat, 17 Mar, 07:10
[build-test alert] BUILD FAILED Linux SUSE 9 gcc debug: drlvm reg.test
nom...@intel.com   [build-test alert] BUILD FAILED Linux SUSE 9 gcc debug: drlvm reg.test Sat, 03 Mar, 21:01
nom...@intel.com   [build-test alert] BUILD FAILED Linux SUSE 9 gcc debug: drlvm reg.test Thu, 15 Mar, 11:51
nom...@intel.com   [build-test alert] BUILD FAILED Linux SUSE 9 gcc debug: drlvm reg.test Wed, 21 Mar, 06:34
[build-test alert] BUILD FAILED Linux SUSE 9 64bit gcc debug: drlvm tests
nom...@intel.com   [build-test alert] BUILD FAILED Linux SUSE 9 64bit gcc debug: drlvm tests Sat, 03 Mar, 22:09
nom...@intel.com   [build-test alert] BUILD FAILED Linux SUSE 9 64bit gcc debug: drlvm tests Mon, 05 Mar, 10:59
nom...@intel.com   [build-test alert] BUILD FAILED Linux SUSE 9 64bit gcc debug: drlvm tests Tue, 06 Mar, 13:05
nom...@intel.com   [build-test alert] BUILD FAILED Linux SUSE 9 64bit gcc debug: drlvm tests Tue, 06 Mar, 18:38
nom...@intel.com   [build-test alert] BUILD FAILED Linux SUSE 9 64bit gcc debug: drlvm tests Wed, 14 Mar, 13:56
nom...@intel.com   [build-test alert] BUILD FAILED Linux SUSE 9 64bit gcc debug: drlvm tests Sat, 17 Mar, 07:14
nom...@intel.com   [build-test alert] BUILD FAILED Linux SUSE 9 64bit gcc debug: drlvm tests Fri, 23 Mar, 13:16
nom...@intel.com   [build-test alert] BUILD FAILED Linux SUSE 9 64bit gcc debug: drlvm tests Mon, 26 Mar, 09:27
nom...@intel.com   [build-test alert] BUILD FAILED Linux SUSE 9 64bit gcc debug: drlvm tests Tue, 27 Mar, 00:32
nom...@intel.com   [build-test alert] BUILD FAILED Linux SUSE 9 64bit gcc debug: drlvm tests Tue, 27 Mar, 20:03
nom...@intel.com   [build-test alert] BUILD FAILED Linux SUSE 9 64bit gcc debug: drlvm tests Tue, 27 Mar, 22:16
nom...@intel.com   [build-test alert] BUILD FAILED Linux SUSE 9 64bit gcc debug: drlvm tests Wed, 28 Mar, 21:53
[build-test alert] BUILD SUCCEEDED Linux SUSE 9 64bit gcc debug: drlvm tests
nom...@intel.com   [build-test alert] BUILD SUCCEEDED Linux SUSE 9 64bit gcc debug: drlvm tests Sat, 03 Mar, 23:59
nom...@intel.com   [build-test alert] BUILD SUCCEEDED Linux SUSE 9 64bit gcc debug: drlvm tests Mon, 05 Mar, 13:10
nom...@intel.com   [build-test alert] BUILD SUCCEEDED Linux SUSE 9 64bit gcc debug: drlvm tests Tue, 06 Mar, 14:53
nom...@intel.com   [build-test alert] BUILD SUCCEEDED Linux SUSE 9 64bit gcc debug: drlvm tests Tue, 06 Mar, 20:04
nom...@intel.com   [build-test alert] BUILD SUCCEEDED Linux SUSE 9 64bit gcc debug: drlvm tests Wed, 14 Mar, 15:38
nom...@intel.com   [build-test alert] BUILD SUCCEEDED Linux SUSE 9 64bit gcc debug: drlvm tests Sat, 17 Mar, 08:56
nom...@intel.com   [build-test alert] BUILD SUCCEEDED Linux SUSE 9 64bit gcc debug: drlvm tests Fri, 23 Mar, 16:39
nom...@intel.com   [build-test alert] BUILD SUCCEEDED Linux SUSE 9 64bit gcc debug: drlvm tests Mon, 26 Mar, 12:59
nom...@intel.com   [build-test alert] BUILD SUCCEEDED Linux SUSE 9 64bit gcc debug: drlvm tests Tue, 27 Mar, 02:12
nom...@intel.com   [build-test alert] BUILD SUCCEEDED Linux SUSE 9 64bit gcc debug: drlvm tests Tue, 27 Mar, 21:47
nom...@intel.com   [build-test alert] BUILD SUCCEEDED Linux SUSE 9 64bit gcc debug: drlvm tests Wed, 28 Mar, 06:13
nom...@intel.com   [build-test alert] BUILD SUCCEEDED Linux SUSE 9 64bit gcc debug: drlvm tests Thu, 29 Mar, 04:03
nom...@intel.com [build-test alert] BUILD FIXED SUSEL9 IA32 gcc debug: classlib tests iterative Mon, 05 Mar, 02:38
[build-test alert] BUILD SUCCEEDED Linux SUSE 9 gcc debug: drlvm reg.test
nom...@intel.com   [build-test alert] BUILD SUCCEEDED Linux SUSE 9 gcc debug: drlvm reg.test Mon, 05 Mar, 10:39
nom...@intel.com   [build-test alert] BUILD SUCCEEDED Linux SUSE 9 gcc debug: drlvm reg.test Thu, 15 Mar, 14:15
nom...@intel.com   [build-test alert] BUILD SUCCEEDED Linux SUSE 9 gcc debug: drlvm reg.test Wed, 21 Mar, 10:19
[build-test alert] BUILD SUCCEEDED Windows XP SP2 msvc debug: drlvm reg.test
nom...@intel.com   [build-test alert] BUILD SUCCEEDED Windows XP SP2 msvc debug: drlvm reg.test Mon, 05 Mar, 11:09
nom...@intel.com   [build-test alert] BUILD SUCCEEDED Windows XP SP2 msvc debug: drlvm reg.test Thu, 15 Mar, 14:26
nom...@intel.com   [build-test alert] BUILD SUCCEEDED Windows XP SP2 msvc debug: drlvm reg.test Sat, 17 Mar, 07:54
[build-test alert] BUILD FAILED Linux SUSE 9 gcc debug: classlib over drlvm
nom...@intel.com   [build-test alert] BUILD FAILED Linux SUSE 9 gcc debug: classlib over drlvm Mon, 05 Mar, 11:13
nom...@intel.com   [build-test alert] BUILD FAILED Linux SUSE 9 gcc debug: classlib over drlvm Thu, 15 Mar, 05:54
nom...@intel.com   [build-test alert] BUILD FAILED Linux SUSE 9 gcc debug: classlib over drlvm Mon, 19 Mar, 16:24
nom...@intel.com   [build-test alert] BUILD FAILED Linux SUSE 9 gcc debug: classlib over drlvm Wed, 21 Mar, 06:33
nom...@intel.com   [build-test alert] BUILD FAILED Linux SUSE 9 gcc debug: classlib over drlvm Fri, 23 Mar, 18:03
nom...@intel.com   [build-test alert] BUILD FAILED Linux SUSE 9 gcc debug: classlib over drlvm Wed, 28 Mar, 17:23
[build-test alert] BUILD SUCCEEDED Linux SUSE 9 64bit gcc debug: drlvm reg.test
nom...@intel.com   [build-test alert] BUILD SUCCEEDED Linux SUSE 9 64bit gcc debug: drlvm reg.test Mon, 05 Mar, 12:06
nom...@intel.com   [build-test alert] BUILD SUCCEEDED Linux SUSE 9 64bit gcc debug: drlvm reg.test Thu, 15 Mar, 13:22
nom...@intel.com   [build-test alert] BUILD SUCCEEDED Linux SUSE 9 64bit gcc debug: drlvm reg.test Sat, 17 Mar, 08:00
nom...@intel.com   [build-test alert] BUILD SUCCEEDED Linux SUSE 9 64bit gcc debug: drlvm reg.test Mon, 19 Mar, 20:35
nom...@intel.com   [build-test alert] BUILD SUCCEEDED Linux SUSE 9 64bit gcc debug: drlvm reg.test Wed, 21 Mar, 14:13
nom...@intel.com   [build-test alert] BUILD SUCCEEDED Linux SUSE 9 64bit gcc debug: drlvm reg.test Wed, 28 Mar, 05:20
[build-test alert] BUILD SUCCEEDED lnx gcc debug: Eclipse Unit Tests
nom...@intel.com   [build-test alert] BUILD SUCCEEDED lnx gcc debug: Eclipse Unit Tests Tue, 06 Mar, 11:17
nom...@intel.com   [build-test alert] BUILD SUCCEEDED lnx gcc debug: Eclipse Unit Tests Fri, 09 Mar, 09:23
nom...@intel.com   [build-test alert] BUILD SUCCEEDED lnx gcc debug: Eclipse Unit Tests Mon, 12 Mar, 13:58
nom...@intel.com   [build-test alert] BUILD SUCCEEDED lnx gcc debug: Eclipse Unit Tests Thu, 15 Mar, 08:46
nom...@intel.com   [build-test alert] BUILD SUCCEEDED lnx gcc debug: Eclipse Unit Tests Fri, 16 Mar, 17:01
nom...@intel.com   [build-test alert] BUILD SUCCEEDED lnx gcc debug: Eclipse Unit Tests Fri, 16 Mar, 22:38
nom...@intel.com   [build-test alert] BUILD SUCCEEDED lnx gcc debug: Eclipse Unit Tests Wed, 28 Mar, 11:20
nom...@intel.com   [build-test alert] BUILD SUCCEEDED lnx gcc debug: Eclipse Unit Tests Thu, 29 Mar, 11:14
[build-test alert] BUILD SUCCEEDED win msvc debug: Eclipse Unit Tests
nom...@intel.com   [build-test alert] BUILD SUCCEEDED win msvc debug: Eclipse Unit Tests Tue, 06 Mar, 11:54
nom...@intel.com   [build-test alert] BUILD SUCCEEDED win msvc debug: Eclipse Unit Tests Mon, 12 Mar, 07:50
nom...@intel.com   [build-test alert] BUILD SUCCEEDED win msvc debug: Eclipse Unit Tests Fri, 16 Mar, 11:52
nom...@intel.com   [build-test alert] BUILD SUCCEEDED win msvc debug: Eclipse Unit Tests Thu, 29 Mar, 09:52
[build-test alert] BUILD FAILED Windows XP SP2 msvc debug: drlvm tests
nom...@intel.com   [build-test alert] BUILD FAILED Windows XP SP2 msvc debug: drlvm tests Tue, 06 Mar, 12:02
nom...@intel.com   [build-test alert] BUILD FAILED Windows XP SP2 msvc debug: drlvm tests Sat, 17 Mar, 07:11
nom...@intel.com   [build-test alert] BUILD FAILED Windows XP SP2 msvc debug: drlvm tests Wed, 28 Mar, 13:13
[build-test alert] BUILD SUCCEEDED Windows XP SP2 msvc debug: drlvm tests
nom...@intel.com   [build-test alert] BUILD SUCCEEDED Windows XP SP2 msvc debug: drlvm tests Tue, 06 Mar, 16:24
nom...@intel.com   [build-test alert] BUILD SUCCEEDED Windows XP SP2 msvc debug: drlvm tests Sat, 17 Mar, 09:07
nom...@intel.com   [build-test alert] BUILD SUCCEEDED Windows XP SP2 msvc debug: drlvm tests Thu, 29 Mar, 05:00
[build-test alert] BUILD FAILED Linux SUSE 9 gcc debug: drlvm test
nom...@intel.com   [build-test alert] BUILD FAILED Linux SUSE 9 gcc debug: drlvm test Wed, 07 Mar, 19:55
nom...@intel.com   [build-test alert] BUILD FAILED Linux SUSE 9 gcc debug: drlvm test Tue, 20 Mar, 13:59
nom...@intel.com   [build-test alert] BUILD FAILED Linux SUSE 9 gcc debug: drlvm test Tue, 20 Mar, 19:10
nom...@intel.com   [build-test alert] BUILD FAILED Linux SUSE 9 gcc debug: drlvm test Fri, 23 Mar, 14:18
nom...@intel.com   [build-test alert] BUILD FAILED Linux SUSE 9 gcc debug: drlvm test Mon, 26 Mar, 12:48
nom...@intel.com   [build-test alert] BUILD FAILED Linux SUSE 9 gcc debug: drlvm test Tue, 27 Mar, 09:31
nom...@intel.com   [build-test alert] BUILD FAILED Linux SUSE 9 gcc debug: drlvm test Fri, 30 Mar, 16:47
[build-test alert] BUILD SUCCEEDED Linux SUSE 9 gcc debug: drlvm test
nom...@intel.com   [build-test alert] BUILD SUCCEEDED Linux SUSE 9 gcc debug: drlvm test Wed, 07 Mar, 22:06
nom...@intel.com   [build-test alert] BUILD SUCCEEDED Linux SUSE 9 gcc debug: drlvm test Tue, 20 Mar, 16:36
nom...@intel.com   [build-test alert] BUILD SUCCEEDED Linux SUSE 9 gcc debug: drlvm test Wed, 21 Mar, 06:15
nom...@intel.com   [build-test alert] BUILD SUCCEEDED Linux SUSE 9 gcc debug: drlvm test Fri, 23 Mar, 17:05
nom...@intel.com   [build-test alert] BUILD SUCCEEDED Linux SUSE 9 gcc debug: drlvm test Mon, 26 Mar, 14:51
nom...@intel.com   [build-test alert] BUILD SUCCEEDED Linux SUSE 9 gcc debug: drlvm test Tue, 27 Mar, 18:08
nom...@intel.com   [build-test alert] BUILD SUCCEEDED Linux SUSE 9 gcc debug: drlvm test Fri, 30 Mar, 19:46
[build-test alert] BUILD SUCCEEDED Windows 2000 msvc debug: classlib
nbe...@kc.rr.com   [build-test alert] BUILD SUCCEEDED Windows 2000 msvc debug: classlib Thu, 08 Mar, 04:22
nbe...@kc.rr.com   [build-test alert] BUILD SUCCEEDED Windows 2000 msvc debug: classlib Thu, 08 Mar, 08:29
nbe...@kc.rr.com   [build-test alert] BUILD SUCCEEDED Windows 2000 msvc debug: classlib Fri, 09 Mar, 10:56
nbe...@kc.rr.com   [build-test alert] BUILD SUCCEEDED Windows 2000 msvc debug: classlib Fri, 09 Mar, 11:55
nbe...@kc.rr.com   [build-test alert] BUILD SUCCEEDED Windows 2000 msvc debug: classlib Fri, 09 Mar, 13:41
nbe...@kc.rr.com   [build-test alert] BUILD SUCCEEDED Windows 2000 msvc debug: classlib Fri, 09 Mar, 15:27
nbe...@kc.rr.com   [build-test alert] BUILD SUCCEEDED Windows 2000 msvc debug: classlib Mon, 12 Mar, 04:35
nbe...@kc.rr.com   [build-test alert] BUILD SUCCEEDED Windows 2000 msvc debug: classlib Mon, 12 Mar, 06:10
nbe...@kc.rr.com   [build-test alert] BUILD SUCCEEDED Windows 2000 msvc debug: classlib Mon, 12 Mar, 10:23
nbe...@kc.rr.com   [build-test alert] BUILD SUCCEEDED Windows 2000 msvc debug: classlib Mon, 12 Mar, 12:09
nbe...@kc.rr.com   [build-test alert] BUILD SUCCEEDED Windows 2000 msvc debug: classlib Mon, 12 Mar, 13:56
nbe...@kc.rr.com   [build-test alert] BUILD SUCCEEDED Windows 2000 msvc debug: classlib Mon, 12 Mar, 14:54
nbe...@kc.rr.com   [build-test alert] BUILD SUCCEEDED Windows 2000 msvc debug: classlib Mon, 12 Mar, 15:52
nbe...@kc.rr.com   [build-test alert] BUILD SUCCEEDED Windows 2000 msvc debug: classlib Tue, 13 Mar, 03:23
nbe...@kc.rr.com   [build-test alert] BUILD SUCCEEDED Windows 2000 msvc debug: classlib Tue, 13 Mar, 04:24
nbe...@kc.rr.com   [build-test alert] BUILD SUCCEEDED Windows 2000 msvc debug: classlib Tue, 13 Mar, 06:13
nbe...@kc.rr.com   [build-test alert] BUILD SUCCEEDED Windows 2000 msvc debug: classlib Tue, 13 Mar, 07:12
nbe...@kc.rr.com   [build-test alert] BUILD SUCCEEDED Windows 2000 msvc debug: classlib Tue, 13 Mar, 10:39
nbe...@kc.rr.com   [build-test alert] BUILD SUCCEEDED Windows 2000 msvc debug: classlib Tue, 13 Mar, 11:38
nbe...@kc.rr.com   [build-test alert] BUILD SUCCEEDED Windows 2000 msvc debug: classlib Tue, 13 Mar, 13:27
nbe...@kc.rr.com   [build-test alert] BUILD SUCCEEDED Windows 2000 msvc debug: classlib Tue, 13 Mar, 14:26
nbe...@kc.rr.com   [build-test alert] BUILD SUCCEEDED Windows 2000 msvc debug: classlib Tue, 13 Mar, 15:25
nbe...@kc.rr.com   [build-test alert] BUILD SUCCEEDED Windows 2000 msvc debug: classlib Tue, 13 Mar, 16:24
nbe...@kc.rr.com   [build-test alert] BUILD SUCCEEDED Windows 2000 msvc debug: classlib Tue, 13 Mar, 17:24
nbe...@kc.rr.com   [build-test alert] BUILD SUCCEEDED Windows 2000 msvc debug: classlib Wed, 14 Mar, 05:11
nbe...@kc.rr.com   [build-test alert] BUILD SUCCEEDED Windows 2000 msvc debug: classlib Wed, 14 Mar, 06:11
nbe...@kc.rr.com   [build-test alert] BUILD SUCCEEDED Windows 2000 msvc debug: classlib Wed, 14 Mar, 08:02
nbe...@kc.rr.com   [build-test alert] BUILD SUCCEEDED Windows 2000 msvc debug: classlib Wed, 14 Mar, 09:03
nbe...@kc.rr.com   [build-test alert] BUILD SUCCEEDED Windows 2000 msvc debug: classlib Wed, 14 Mar, 10:03
nbe...@kc.rr.com   [build-test alert] BUILD SUCCEEDED Windows 2000 msvc debug: classlib Wed, 14 Mar, 13:36
nbe...@kc.rr.com   [build-test alert] BUILD SUCCEEDED Windows 2000 msvc debug: classlib Thu, 15 Mar, 01:31
nbe...@kc.rr.com   [build-test alert] BUILD SUCCEEDED Windows 2000 msvc debug: classlib Thu, 15 Mar, 04:38
nbe...@kc.rr.com   [build-test alert] BUILD SUCCEEDED Windows 2000 msvc debug: classlib Thu, 15 Mar, 10:39
nbe...@kc.rr.com   [build-test alert] BUILD SUCCEEDED Windows 2000 msvc debug: classlib Thu, 15 Mar, 11:40
nbe...@kc.rr.com   [build-test alert] BUILD SUCCEEDED Windows 2000 msvc debug: classlib Thu, 15 Mar, 12:40
nbe...@kc.rr.com   [build-test alert] BUILD SUCCEEDED Windows 2000 msvc debug: classlib Thu, 15 Mar, 20:26
nbe...@kc.rr.com   [build-test alert] BUILD SUCCEEDED Windows 2000 msvc debug: classlib Fri, 16 Mar, 07:43
nbe...@kc.rr.com   [build-test alert] BUILD SUCCEEDED Windows 2000 msvc debug: classlib Fri, 16 Mar, 10:25
nbe...@kc.rr.com   [build-test alert] BUILD SUCCEEDED Windows 2000 msvc debug: classlib Fri, 16 Mar, 11:27
nbe...@kc.rr.com   [build-test alert] BUILD SUCCEEDED Windows 2000 msvc debug: classlib Fri, 16 Mar, 12:29
nbe...@kc.rr.com   [build-test alert] BUILD SUCCEEDED Windows 2000 msvc debug: classlib Fri, 16 Mar, 13:30
nbe...@kc.rr.com   [build-test alert] BUILD SUCCEEDED Windows 2000 msvc debug: classlib Fri, 16 Mar, 14:31
nbe...@kc.rr.com   [build-test alert] BUILD SUCCEEDED Windows 2000 msvc debug: classlib Fri, 16 Mar, 15:33
nbe...@kc.rr.com   [build-test alert] BUILD SUCCEEDED Windows 2000 msvc debug: classlib Fri, 16 Mar, 16:34
nbe...@kc.rr.com   [build-test alert] BUILD SUCCEEDED Windows 2000 msvc debug: classlib Fri, 16 Mar, 17:35
nbe...@kc.rr.com   [build-test alert] BUILD SUCCEEDED Windows 2000 msvc debug: classlib Fri, 16 Mar, 19:29
nbe...@kc.rr.com   [build-test alert] BUILD SUCCEEDED Windows 2000 msvc debug: classlib Fri, 16 Mar, 21:23
nbe...@kc.rr.com   [build-test alert] BUILD SUCCEEDED Windows 2000 msvc debug: classlib Sat, 17 Mar, 10:27
nbe...@kc.rr.com   [build-test alert] BUILD SUCCEEDED Windows 2000 msvc debug: classlib Sat, 17 Mar, 11:29
nbe...@kc.rr.com   [build-test alert] BUILD SUCCEEDED Windows 2000 msvc debug: classlib Sat, 17 Mar, 17:03
nbe...@kc.rr.com   [build-test alert] BUILD SUCCEEDED Windows 2000 msvc debug: classlib Mon, 19 Mar, 10:57
nbe...@kc.rr.com   [build-test alert] BUILD SUCCEEDED Windows 2000 msvc debug: classlib Mon, 19 Mar, 14:36
nbe...@kc.rr.com   [build-test alert] BUILD SUCCEEDED Windows 2000 msvc debug: classlib Mon, 19 Mar, 15:38
nbe...@kc.rr.com   [build-test alert] BUILD SUCCEEDED Windows 2000 msvc debug: classlib Tue, 20 Mar, 05:51
nbe...@kc.rr.com   [build-test alert] BUILD SUCCEEDED Windows 2000 msvc debug: classlib Tue, 20 Mar, 12:11
nbe...@kc.rr.com   [build-test alert] BUILD SUCCEEDED Windows 2000 msvc debug: classlib Tue, 20 Mar, 14:07
nbe...@kc.rr.com   [build-test alert] BUILD SUCCEEDED Windows 2000 msvc debug: classlib Tue, 20 Mar, 15:10
nbe...@kc.rr.com   [build-test alert] BUILD SUCCEEDED Windows 2000 msvc debug: classlib Wed, 21 Mar, 03:44
nbe...@kc.rr.com   [build-test alert] BUILD SUCCEEDED Windows 2000 msvc debug: classlib Wed, 21 Mar, 08:19
nbe...@kc.rr.com   [build-test alert] BUILD SUCCEEDED Windows 2000 msvc debug: classlib Wed, 21 Mar, 09:23
nbe...@kc.rr.com   [build-test alert] BUILD SUCCEEDED Windows 2000 msvc debug: classlib Wed, 21 Mar, 10:26
nbe...@kc.rr.com   [build-test alert] BUILD SUCCEEDED Windows 2000 msvc debug: classlib Wed, 21 Mar, 11:30
nbe...@kc.rr.com   [build-test alert] BUILD SUCCEEDED Windows 2000 msvc debug: classlib Wed, 21 Mar, 12:34
nbe...@kc.rr.com   [build-test alert] BUILD SUCCEEDED Windows 2000 msvc debug: classlib Wed, 21 Mar, 17:19
nbe...@kc.rr.com   [build-test alert] BUILD SUCCEEDED Windows 2000 msvc debug: classlib Wed, 21 Mar, 20:11
nbe...@kc.rr.com   [build-test alert] BUILD SUCCEEDED Windows 2000 msvc debug: classlib Thu, 22 Mar, 03:30
nbe...@kc.rr.com   [build-test alert] BUILD SUCCEEDED Windows 2000 msvc debug: classlib Thu, 22 Mar, 07:41
nbe...@kc.rr.com   [build-test alert] BUILD SUCCEEDED Windows 2000 msvc debug: classlib Thu, 22 Mar, 09:52
nbe...@kc.rr.com   [build-test alert] BUILD SUCCEEDED Windows 2000 msvc debug: classlib Thu, 22 Mar, 10:57
nbe...@kc.rr.com   [build-test alert] BUILD SUCCEEDED Windows 2000 msvc debug: classlib Thu, 22 Mar, 12:56
nbe...@kc.rr.com   [build-test alert] BUILD SUCCEEDED Windows 2000 msvc debug: classlib Thu, 22 Mar, 16:43
nbe...@kc.rr.com   [build-test alert] BUILD SUCCEEDED Windows 2000 msvc debug: classlib Fri, 23 Mar, 06:33
nbe...@kc.rr.com   [build-test alert] BUILD SUCCEEDED Windows 2000 msvc debug: classlib Fri, 23 Mar, 10:22
nbe...@kc.rr.com   [build-test alert] BUILD SUCCEEDED Windows 2000 msvc debug: classlib Fri, 23 Mar, 11:28
nbe...@kc.rr.com   [build-test alert] BUILD SUCCEEDED Windows 2000 msvc debug: classlib Fri, 23 Mar, 13:28
nbe...@kc.rr.com   [build-test alert] BUILD SUCCEEDED Windows 2000 msvc debug: classlib Fri, 23 Mar, 14:34
nbe...@kc.rr.com   [build-test alert] BUILD SUCCEEDED Windows 2000 msvc debug: classlib Fri, 23 Mar, 15:39
nbe...@kc.rr.com   [build-test alert] BUILD SUCCEEDED Windows 2000 msvc debug: classlib Fri, 23 Mar, 16:44
nbe...@kc.rr.com   [build-test alert] BUILD SUCCEEDED Windows 2000 msvc debug: classlib Tue, 27 Mar, 03:49
nbe...@kc.rr.com   [build-test alert] BUILD SUCCEEDED Windows 2000 msvc debug: classlib Tue, 27 Mar, 11:42
nbe...@kc.rr.com   [build-test alert] BUILD SUCCEEDED Windows 2000 msvc debug: classlib Tue, 27 Mar, 13:44
nbe...@kc.rr.com   [build-test alert] BUILD SUCCEEDED Windows 2000 msvc debug: classlib Wed, 28 Mar, 08:32
nbe...@kc.rr.com   [build-test alert] BUILD SUCCEEDED Windows 2000 msvc debug: classlib Wed, 28 Mar, 09:38
nbe...@kc.rr.com   [build-test alert] BUILD SUCCEEDED Windows 2000 msvc debug: classlib Wed, 28 Mar, 10:45
nbe...@kc.rr.com   [build-test alert] BUILD SUCCEEDED Windows 2000 msvc debug: classlib Wed, 28 Mar, 14:38
nbe...@kc.rr.com   [build-test alert] BUILD SUCCEEDED Windows 2000 msvc debug: classlib Thu, 29 Mar, 05:48
nbe...@kc.rr.com   [build-test alert] BUILD SUCCEEDED Windows 2000 msvc debug: classlib Thu, 29 Mar, 07:50
nbe...@kc.rr.com   [build-test alert] BUILD SUCCEEDED Windows 2000 msvc debug: classlib Thu, 29 Mar, 08:56
nbe...@kc.rr.com   [build-test alert] BUILD SUCCEEDED Windows 2000 msvc debug: classlib Thu, 29 Mar, 13:48
nbe...@kc.rr.com   [build-test alert] BUILD SUCCEEDED Windows 2000 msvc debug: classlib Fri, 30 Mar, 11:38
nbe...@kc.rr.com   [build-test alert] BUILD SUCCEEDED Windows 2000 msvc debug: classlib Fri, 30 Mar, 14:40
[build-test alert] BUILD FAILED Windows 2000 msvc debug: classlib over ibmvm
nbe...@kc.rr.com   [build-test alert] BUILD FAILED Windows 2000 msvc debug: classlib over ibmvm Thu, 08 Mar, 05:01
nbe...@kc.rr.com   [build-test alert] BUILD FAILED Windows 2000 msvc debug: classlib over ibmvm Thu, 08 Mar, 05:48
nbe...@kc.rr.com   [build-test alert] BUILD FAILED Windows 2000 msvc debug: classlib over ibmvm Thu, 08 Mar, 06:36
nbe...@kc.rr.com   [build-test alert] BUILD FAILED Windows 2000 msvc debug: classlib over ibmvm Thu, 08 Mar, 07:23
nbe...@kc.rr.com   [build-test alert] BUILD FAILED Windows 2000 msvc debug: classlib over ibmvm Thu, 08 Mar, 08:11
nbe...@kc.rr.com   [build-test alert] BUILD FAILED Windows 2000 msvc debug: classlib over ibmvm Thu, 08 Mar, 09:09
nbe...@kc.rr.com   [build-test alert] BUILD FAILED Windows 2000 msvc debug: classlib over ibmvm Thu, 08 Mar, 09:56
nbe...@kc.rr.com   [build-test alert] BUILD FAILED Windows 2000 msvc debug: classlib over ibmvm Thu, 08 Mar, 10:44
nbe...@kc.rr.com   [build-test alert] BUILD FAILED Windows 2000 msvc debug: classlib over ibmvm Thu, 08 Mar, 11:32
nbe...@kc.rr.com   [build-test alert] BUILD FAILED Windows 2000 msvc debug: classlib over ibmvm Thu, 08 Mar, 12:19
nbe...@kc.rr.com   [build-test alert] BUILD FAILED Windows 2000 msvc debug: classlib over ibmvm Thu, 08 Mar, 13:07
nbe...@kc.rr.com   [build-test alert] BUILD FAILED Windows 2000 msvc debug: classlib over ibmvm Thu, 08 Mar, 13:55
nbe...@kc.rr.com   [build-test alert] BUILD FAILED Windows 2000 msvc debug: classlib over ibmvm Thu, 08 Mar, 14:43
nbe...@kc.rr.com   [build-test alert] BUILD FAILED Windows 2000 msvc debug: classlib over ibmvm Thu, 08 Mar, 15:30
nbe...@kc.rr.com   [build-test alert] BUILD FAILED Windows 2000 msvc debug: classlib over ibmvm Thu, 08 Mar, 16:18
nbe...@kc.rr.com   [build-test alert] BUILD FAILED Windows 2000 msvc debug: classlib over ibmvm Thu, 08 Mar, 17:06
nbe...@kc.rr.com   [build-test alert] BUILD FAILED Windows 2000 msvc debug: classlib over ibmvm Thu, 08 Mar, 17:54
nbe...@kc.rr.com   [build-test alert] BUILD FAILED Windows 2000 msvc debug: classlib over ibmvm Thu, 08 Mar, 18:41
nbe...@kc.rr.com   [build-test alert] BUILD FAILED Windows 2000 msvc debug: classlib over ibmvm Thu, 08 Mar, 19:29
nbe...@kc.rr.com   [build-test alert] BUILD FAILED Windows 2000 msvc debug: classlib over ibmvm Thu, 08 Mar, 20:17
nbe...@kc.rr.com   [build-test alert] BUILD FAILED Windows 2000 msvc debug: classlib over ibmvm Thu, 08 Mar, 21:06
nbe...@kc.rr.com   [build-test alert] BUILD FAILED Windows 2000 msvc debug: classlib over ibmvm Thu, 08 Mar, 21:53
nbe...@kc.rr.com   [build-test alert] BUILD FAILED Windows 2000 msvc debug: classlib over ibmvm Thu, 08 Mar, 22:41
nbe...@kc.rr.com   [build-test alert] BUILD FAILED Windows 2000 msvc debug: classlib over ibmvm Thu, 08 Mar, 23:28
nbe...@kc.rr.com   [build-test alert] BUILD FAILED Windows 2000 msvc debug: classlib over ibmvm Fri, 09 Mar, 00:16
nbe...@kc.rr.com   [build-test alert] BUILD FAILED Windows 2000 msvc debug: classlib over ibmvm Fri, 09 Mar, 01:04
nbe...@kc.rr.com   [build-test alert] BUILD FAILED Windows 2000 msvc debug: classlib over ibmvm Fri, 09 Mar, 01:52
nbe...@kc.rr.com   [build-test alert] BUILD FAILED Windows 2000 msvc debug: classlib over ibmvm Fri, 09 Mar, 02:40
nbe...@kc.rr.com   [build-test alert] BUILD FAILED Windows 2000 msvc debug: classlib over ibmvm Fri, 09 Mar, 03:27
nbe...@kc.rr.com   [build-test alert] BUILD FAILED Windows 2000 msvc debug: classlib over ibmvm Fri, 09 Mar, 04:15
nbe...@kc.rr.com   [build-test alert] BUILD FAILED Windows 2000 msvc debug: classlib over ibmvm Fri, 09 Mar, 05:04
nbe...@kc.rr.com   [build-test alert] BUILD FAILED Windows 2000 msvc debug: classlib over ibmvm Fri, 09 Mar, 05:51
nbe...@kc.rr.com   [build-test alert] BUILD FAILED Windows 2000 msvc debug: classlib over ibmvm Fri, 09 Mar, 06:39
nbe...@kc.rr.com   [build-test alert] BUILD FAILED Windows 2000 msvc debug: classlib over ibmvm Fri, 09 Mar, 07:26
nbe...@kc.rr.com   [build-test alert] BUILD FAILED Windows 2000 msvc debug: classlib over ibmvm Fri, 09 Mar, 08:14
nbe...@kc.rr.com   [build-test alert] BUILD FAILED Windows 2000 msvc debug: classlib over ibmvm Fri, 09 Mar, 09:02
nbe...@kc.rr.com   [build-test alert] BUILD FAILED Windows 2000 msvc debug: classlib over ibmvm Fri, 09 Mar, 09:50
nbe...@kc.rr.com   [build-test alert] BUILD FAILED Windows 2000 msvc debug: classlib over ibmvm Fri, 09 Mar, 10:38
nbe...@kc.rr.com   [build-test alert] BUILD FAILED Windows 2000 msvc debug: classlib over ibmvm Fri, 09 Mar, 11:37
nbe...@kc.rr.com   [build-test alert] BUILD FAILED Windows 2000 msvc debug: classlib over ibmvm Fri, 09 Mar, 12:35
nbe...@kc.rr.com   [build-test alert] BUILD FAILED Windows 2000 msvc debug: classlib over ibmvm Fri, 09 Mar, 13:23
nbe...@kc.rr.com   [build-test alert] BUILD FAILED Windows 2000 msvc debug: classlib over ibmvm Fri, 09 Mar, 14:21
nbe...@kc.rr.com   [build-test alert] BUILD FAILED Windows 2000 msvc debug: classlib over ibmvm Fri, 09 Mar, 15:09
nbe...@kc.rr.com   [build-test alert] BUILD FAILED Windows 2000 msvc debug: classlib over ibmvm Fri, 09 Mar, 16:07
nbe...@kc.rr.com   [build-test alert] BUILD FAILED Windows 2000 msvc debug: classlib over ibmvm Fri, 09 Mar, 16:55
nbe...@kc.rr.com   [build-test alert] BUILD FAILED Windows 2000 msvc debug: classlib over ibmvm Fri, 09 Mar, 17:43
nbe...@kc.rr.com   [build-test alert] BUILD FAILED Windows 2000 msvc debug: classlib over ibmvm Fri, 09 Mar, 18:33
nbe...@kc.rr.com   [build-test alert] BUILD FAILED Windows 2000 msvc debug: classlib over ibmvm Fri, 09 Mar, 19:22
nbe...@kc.rr.com   [build-test alert] BUILD FAILED Windows 2000 msvc debug: classlib over ibmvm Fri, 09 Mar, 20:10
nbe...@kc.rr.com   [build-test alert] BUILD FAILED Windows 2000 msvc debug: classlib over ibmvm Fri, 09 Mar, 20:58
nbe...@kc.rr.com   [build-test alert] BUILD FAILED Windows 2000 msvc debug: classlib over ibmvm Fri, 09 Mar, 21:46
nbe...@kc.rr.com   [build-test alert] BUILD FAILED Windows 2000 msvc debug: classlib over ibmvm Fri, 09 Mar, 22:34
nbe...@kc.rr.com   [build-test alert] BUILD FAILED Windows 2000 msvc debug: classlib over ibmvm Fri, 09 Mar, 23:23
nbe...@kc.rr.com   [build-test alert] BUILD FAILED Windows 2000 msvc debug: classlib over ibmvm Sat, 10 Mar, 00:11
nbe...@kc.rr.com   [build-test alert] BUILD FAILED Windows 2000 msvc debug: classlib over ibmvm Sat, 10 Mar, 00:59
nbe...@kc.rr.com   [build-test alert] BUILD FAILED Windows 2000 msvc debug: classlib over ibmvm Sat, 10 Mar, 01:47
nbe...@kc.rr.com   [build-test alert] BUILD FAILED Windows 2000 msvc debug: classlib over ibmvm Sat, 10 Mar, 02:35
nbe...@kc.rr.com   [build-test alert] BUILD FAILED Windows 2000 msvc debug: classlib over ibmvm Sat, 10 Mar, 03:24
nbe...@kc.rr.com   [build-test alert] BUILD FAILED Windows 2000 msvc debug: classlib over ibmvm Sat, 10 Mar, 04:12
nbe...@kc.rr.com   [build-test alert] BUILD FAILED Windows 2000 msvc debug: classlib over ibmvm Sat, 10 Mar, 05:00
nbe...@kc.rr.com   [build-test alert] BUILD FAILED Windows 2000 msvc debug: classlib over ibmvm Sat, 10 Mar, 05:49
nbe...@kc.rr.com   [build-test alert] BUILD FAILED Windows 2000 msvc debug: classlib over ibmvm Sat, 10 Mar, 06:37
nbe...@kc.rr.com   [build-test alert] BUILD FAILED Windows 2000 msvc debug: classlib over ibmvm Sat, 10 Mar, 07:25
nbe...@kc.rr.com   [build-test alert] BUILD FAILED Windows 2000 msvc debug: classlib over ibmvm Sat, 10 Mar, 08:14
nbe...@kc.rr.com   [build-test alert] BUILD FAILED Windows 2000 msvc debug: classlib over ibmvm Sat, 10 Mar, 09:02
nbe...@kc.rr.com   [build-test alert] BUILD FAILED Windows 2000 msvc debug: classlib over ibmvm Sat, 10 Mar, 09:50
nbe...@kc.rr.com   [build-test alert] BUILD FAILED Windows 2000 msvc debug: classlib over ibmvm Sat, 10 Mar, 10:39
nbe...@kc.rr.com   [build-test alert] BUILD FAILED Windows 2000 msvc debug: classlib over ibmvm Sat, 10 Mar, 11:27
nbe...@kc.rr.com   [build-test alert] BUILD FAILED Windows 2000 msvc debug: classlib over ibmvm Sat, 10 Mar, 12:15
nbe...@kc.rr.com   [build-test alert] BUILD FAILED Windows 2000 msvc debug: classlib over ibmvm Sat, 10 Mar, 13:05
nbe...@kc.rr.com   [build-test alert] BUILD FAILED Windows 2000 msvc debug: classlib over ibmvm Sat, 10 Mar, 13:54
nbe...@kc.rr.com   [build-test alert] BUILD FAILED Windows 2000 msvc debug: classlib over ibmvm Sat, 10 Mar, 14:42
nbe...@kc.rr.com   [build-test alert] BUILD FAILED Windows 2000 msvc debug: classlib over ibmvm Sat, 10 Mar, 15:30
nbe...@kc.rr.com   [build-test alert] BUILD FAILED Windows 2000 msvc debug: classlib over ibmvm Sat, 10 Mar, 16:18
nbe...@kc.rr.com   [build-test alert] BUILD FAILED Windows 2000 msvc debug: classlib over ibmvm Sat, 10 Mar, 17:07
nbe...@kc.rr.com   [build-test alert] BUILD FAILED Windows 2000 msvc debug: classlib over ibmvm Sat, 10 Mar, 17:55
nbe...@kc.rr.com   [build-test alert] BUILD FAILED Windows 2000 msvc debug: classlib over ibmvm Sat, 10 Mar, 18:44
nbe...@kc.rr.com   [build-test alert] BUILD FAILED Windows 2000 msvc debug: classlib over ibmvm Sat, 10 Mar, 19:32
nbe...@kc.rr.com   [build-test alert] BUILD FAILED Windows 2000 msvc debug: classlib over ibmvm Sat, 10 Mar, 20:21
nbe...@kc.rr.com   [build-test alert] BUILD FAILED Windows 2000 msvc debug: classlib over ibmvm Sat, 10 Mar, 21:09
nbe...@kc.rr.com   [build-test alert] BUILD FAILED Windows 2000 msvc debug: classlib over ibmvm Sat, 10 Mar, 21:58
nbe...@kc.rr.com   [build-test alert] BUILD FAILED Windows 2000 msvc debug: classlib over ibmvm Sat, 10 Mar, 22:46
nbe...@kc.rr.com   [build-test alert] BUILD FAILED Windows 2000 msvc debug: classlib over ibmvm Sat, 10 Mar, 23:35
nbe...@kc.rr.com   [build-test alert] BUILD FAILED Windows 2000 msvc debug: classlib over ibmvm Sun, 11 Mar, 00:23
nbe...@kc.rr.com   [build-test alert] BUILD FAILED Windows 2000 msvc debug: classlib over ibmvm Sun, 11 Mar, 01:12
nbe...@kc.rr.com   [build-test alert] BUILD FAILED Windows 2000 msvc debug: classlib over ibmvm Sun, 11 Mar, 02:00
nbe...@kc.rr.com   [build-test alert] BUILD FAILED Windows 2000 msvc debug: classlib over ibmvm Sun, 11 Mar, 02:48
nbe...@kc.rr.com   [build-test alert] BUILD FAILED Windows 2000 msvc debug: classlib over ibmvm Sun, 11 Mar, 03:37
nbe...@kc.rr.com   [build-test alert] BUILD FAILED Windows 2000 msvc debug: classlib over ibmvm Sun, 11 Mar, 04:26
nbe...@kc.rr.com   [build-test alert] BUILD FAILED Windows 2000 msvc debug: classlib over ibmvm Sun, 11 Mar, 05:14
nbe...@kc.rr.com   [build-test alert] BUILD FAILED Windows 2000 msvc debug: classlib over ibmvm Sun, 11 Mar, 06:03
nbe...@kc.rr.com   [build-test alert] BUILD FAILED Windows 2000 msvc debug: classlib over ibmvm Sun, 11 Mar, 06:51
nbe...@kc.rr.com   [build-test alert] BUILD FAILED Windows 2000 msvc debug: classlib over ibmvm Sun, 11 Mar, 07:39
nbe...@kc.rr.com   [build-test alert] BUILD FAILED Windows 2000 msvc debug: classlib over ibmvm Sun, 11 Mar, 09:28
nbe...@kc.rr.com   [build-test alert] BUILD FAILED Windows 2000 msvc debug: classlib over ibmvm Sun, 11 Mar, 10:18
nbe...@kc.rr.com   [build-test alert] BUILD FAILED Windows 2000 msvc debug: classlib over ibmvm Sun, 11 Mar, 11:06
nbe...@kc.rr.com   [build-test alert] BUILD FAILED Windows 2000 msvc debug: classlib over ibmvm Sun, 11 Mar, 11:55
nbe...@kc.rr.com   [build-test alert] BUILD FAILED Windows 2000 msvc debug: classlib over ibmvm Sun, 11 Mar, 12:44
nbe...@kc.rr.com   [build-test alert] BUILD FAILED Windows 2000 msvc debug: classlib over ibmvm Sun, 11 Mar, 13:32
nbe...@kc.rr.com   [build-test alert] BUILD FAILED Windows 2000 msvc debug: classlib over ibmvm Sun, 11 Mar, 14:21
nbe...@kc.rr.com   [build-test alert] BUILD FAILED Windows 2000 msvc debug: classlib over ibmvm Sun, 11 Mar, 15:09
nbe...@kc.rr.com   [build-test alert] BUILD FAILED Windows 2000 msvc debug: classlib over ibmvm Sun, 11 Mar, 15:57
nbe...@kc.rr.com   [build-test alert] BUILD FAILED Windows 2000 msvc debug: classlib over ibmvm Sun, 11 Mar, 16:46
nbe...@kc.rr.com   [build-test alert] BUILD FAILED Windows 2000 msvc debug: classlib over ibmvm Sun, 11 Mar, 17:47
nbe...@kc.rr.com   [build-test alert] BUILD FAILED Windows 2000 msvc debug: classlib over ibmvm Sun, 11 Mar, 18:35
nbe...@kc.rr.com   [build-test alert] BUILD FAILED Windows 2000 msvc debug: classlib over ibmvm Sun, 11 Mar, 20:10
nbe...@kc.rr.com   [build-test alert] BUILD FAILED Windows 2000 msvc debug: classlib over ibmvm Sun, 11 Mar, 20:58
nbe...@kc.rr.com   [build-test alert] BUILD FAILED Windows 2000 msvc debug: classlib over ibmvm Sun, 11 Mar, 21:47
nbe...@kc.rr.com   [build-test alert] BUILD FAILED Windows 2000 msvc debug: classlib over ibmvm Sun, 11 Mar, 22:36
nbe...@kc.rr.com   [build-test alert] BUILD FAILED Windows 2000 msvc debug: classlib over ibmvm Sun, 11 Mar, 23:25
nbe...@kc.rr.com   [build-test alert] BUILD FAILED Windows 2000 msvc debug: classlib over ibmvm Mon, 12 Mar, 00:13
nbe...@kc.rr.com   [build-test alert] BUILD FAILED Windows 2000 msvc debug: classlib over ibmvm Mon, 12 Mar, 01:02
nbe...@kc.rr.com   [build-test alert] BUILD FAILED Windows 2000 msvc debug: classlib over ibmvm Mon, 12 Mar, 01:52
nbe...@kc.rr.com   [build-test alert] BUILD FAILED Windows 2000 msvc debug: classlib over ibmvm Mon, 12 Mar, 02:41
nbe...@kc.rr.com   [build-test alert] BUILD FAILED Windows 2000 msvc debug: classlib over ibmvm Mon, 12 Mar, 03:30
nbe...@kc.rr.com   [build-test alert] BUILD FAILED Windows 2000 msvc debug: classlib over ibmvm Mon, 12 Mar, 04:18
nbe...@kc.rr.com   [build-test alert] BUILD FAILED Windows 2000 msvc debug: classlib over ibmvm Mon, 12 Mar, 05:05
nbe...@kc.rr.com   [build-test alert] BUILD FAILED Windows 2000 msvc debug: classlib over ibmvm Mon, 12 Mar, 05:16
nbe...@kc.rr.com   [build-test alert] BUILD FAILED Windows 2000 msvc debug: classlib over ibmvm Mon, 12 Mar, 05:53
nbe...@kc.rr.com   [build-test alert] BUILD FAILED Windows 2000 msvc debug: classlib over ibmvm Mon, 12 Mar, 06:53
nbe...@kc.rr.com   [build-test alert] BUILD FAILED Windows 2000 msvc debug: classlib over ibmvm Mon, 12 Mar, 07:41
nbe...@kc.rr.com   [build-test alert] BUILD FAILED Windows 2000 msvc debug: classlib over ibmvm Mon, 12 Mar, 08:29
nbe...@kc.rr.com   [build-test alert] BUILD FAILED Windows 2000 msvc debug: classlib over ibmvm Mon, 12 Mar, 09:18
nbe...@kc.rr.com   [build-test alert] BUILD FAILED Windows 2000 msvc debug: classlib over ibmvm Mon, 12 Mar, 10:06
nbe...@kc.rr.com   [build-test alert] BUILD FAILED Windows 2000 msvc debug: classlib over ibmvm Mon, 12 Mar, 11:04
nbe...@kc.rr.com   [build-test alert] BUILD FAILED Windows 2000 msvc debug: classlib over ibmvm Mon, 12 Mar, 11:52
nbe...@kc.rr.com   [build-test alert] BUILD FAILED Windows 2000 msvc debug: classlib over ibmvm Mon, 12 Mar, 12:50
nbe...@kc.rr.com   [build-test alert] BUILD FAILED Windows 2000 msvc debug: classlib over ibmvm Mon, 12 Mar, 13:39
nbe...@kc.rr.com   [build-test alert] BUILD FAILED Windows 2000 msvc debug: classlib over ibmvm Mon, 12 Mar, 14:37
nbe...@kc.rr.com   [build-test alert] BUILD FAILED Windows 2000 msvc debug: classlib over ibmvm Mon, 12 Mar, 15:35
nbe...@kc.rr.com   [build-test alert] BUILD FAILED Windows 2000 msvc debug: classlib over ibmvm Mon, 12 Mar, 16:34
nbe...@kc.rr.com   [build-test alert] BUILD FAILED Windows 2000 msvc debug: classlib over ibmvm Mon, 12 Mar, 17:22
nbe...@kc.rr.com   [build-test alert] BUILD FAILED Windows 2000 msvc debug: classlib over ibmvm Mon, 12 Mar, 18:11
nbe...@kc.rr.com   [build-test alert] BUILD FAILED Windows 2000 msvc debug: classlib over ibmvm Mon, 12 Mar, 18:59
nbe...@kc.rr.com   [build-test alert] BUILD FAILED Windows 2000 msvc debug: classlib over ibmvm Mon, 12 Mar, 19:48
nbe...@kc.rr.com   [build-test alert] BUILD FAILED Windows 2000 msvc debug: classlib over ibmvm Mon, 12 Mar, 20:36
nbe...@kc.rr.com   [build-test alert] BUILD FAILED Windows 2000 msvc debug: classlib over ibmvm Mon, 12 Mar, 21:25
nbe...@kc.rr.com   [build-test alert] BUILD FAILED Windows 2000 msvc debug: classlib over ibmvm Mon, 12 Mar, 22:13
nbe...@kc.rr.com   [build-test alert] BUILD FAILED Windows 2000 msvc debug: classlib over ibmvm Mon, 12 Mar, 23:02
nbe...@kc.rr.com   [build-test alert] BUILD FAILED Windows 2000 msvc debug: classlib over ibmvm Mon, 12 Mar, 23:51
nbe...@kc.rr.com   [build-test alert] BUILD FAILED Windows 2000 msvc debug: classlib over ibmvm Tue, 13 Mar, 00:39
nbe...@kc.rr.com   [build-test alert] BUILD FAILED Windows 2000 msvc debug: classlib over ibmvm Tue, 13 Mar, 01:28
nbe...@kc.rr.com   [build-test alert] BUILD FAILED Windows 2000 msvc debug: classlib over ibmvm Tue, 13 Mar, 02:17
nbe...@kc.rr.com   [build-test alert] BUILD FAILED Windows 2000 msvc debug: classlib over ibmvm Tue, 13 Mar, 03:06
nbe...@kc.rr.com   [build-test alert] BUILD FAILED Windows 2000 msvc debug: classlib over ibmvm Tue, 13 Mar, 04:07
nbe...@kc.rr.com   [build-test alert] BUILD FAILED Windows 2000 msvc debug: classlib over ibmvm Tue, 13 Mar, 05:06
nbe...@kc.rr.com   [build-test alert] BUILD FAILED Windows 2000 msvc debug: classlib over ibmvm Tue, 13 Mar, 05:56
nbe...@kc.rr.com   [build-test alert] BUILD FAILED Windows 2000 msvc debug: classlib over ibmvm Tue, 13 Mar, 06:55
nbe...@kc.rr.com   [build-test alert] BUILD FAILED Windows 2000 msvc debug: classlib over ibmvm Tue, 13 Mar, 07:55
nbe...@kc.rr.com   [build-test alert] BUILD FAILED Windows 2000 msvc debug: classlib over ibmvm Tue, 13 Mar, 08:44
nbe...@kc.rr.com   [build-test alert] BUILD FAILED Windows 2000 msvc debug: classlib over ibmvm Tue, 13 Mar, 09:33
nbe...@kc.rr.com   [build-test alert] BUILD FAILED Windows 2000 msvc debug: classlib over ibmvm Tue, 13 Mar, 10:22
nbe...@kc.rr.com   [build-test alert] BUILD FAILED Windows 2000 msvc debug: classlib over ibmvm Tue, 13 Mar, 11:22
nbe...@kc.rr.com   [build-test alert] BUILD FAILED Windows 2000 msvc debug: classlib over ibmvm Tue, 13 Mar, 12:21
nbe...@kc.rr.com   [build-test alert] BUILD FAILED Windows 2000 msvc debug: classlib over ibmvm Tue, 13 Mar, 13:10
nbe...@kc.rr.com   [build-test alert] BUILD FAILED Windows 2000 msvc debug: classlib over ibmvm Tue, 13 Mar, 14:09
nbe...@kc.rr.com   [build-test alert] BUILD FAILED Windows 2000 msvc debug: classlib over ibmvm Tue, 13 Mar, 15:08
nbe...@kc.rr.com   [build-test alert] BUILD FAILED Windows 2000 msvc debug: classlib over ibmvm Tue, 13 Mar, 16:08
nbe...@kc.rr.com   [build-test alert] BUILD FAILED Windows 2000 msvc debug: classlib over ibmvm Tue, 13 Mar, 17:07
nbe...@kc.rr.com   [build-test alert] BUILD FAILED Windows 2000 msvc debug: classlib over ibmvm Tue, 13 Mar, 18:07
nbe...@kc.rr.com   [build-test alert] BUILD FAILED Windows 2000 msvc debug: classlib over ibmvm Tue, 13 Mar, 18:57
nbe...@kc.rr.com   [build-test alert] BUILD FAILED Windows 2000 msvc debug: classlib over ibmvm Tue, 13 Mar, 19:46
nbe...@kc.rr.com   [build-test alert] BUILD FAILED Windows 2000 msvc debug: classlib over ibmvm Tue, 13 Mar, 20:36
nbe...@kc.rr.com   [build-test alert] BUILD FAILED Windows 2000 msvc debug: classlib over ibmvm Tue, 13 Mar, 21:25
nbe...@kc.rr.com   [build-test alert] BUILD FAILED Windows 2000 msvc debug: classlib over ibmvm Tue, 13 Mar, 22:15
nbe...@kc.rr.com   [build-test alert] BUILD FAILED Windows 2000 msvc debug: classlib over ibmvm Tue, 13 Mar, 23:05
nbe...@kc.rr.com   [build-test alert] BUILD FAILED Windows 2000 msvc debug: classlib over ibmvm Tue, 13 Mar, 23:54
nbe...@kc.rr.com   [build-test alert] BUILD FAILED Windows 2000 msvc debug: classlib over ibmvm Wed, 14 Mar, 00:46
nbe...@kc.rr.com   [build-test alert] BUILD FAILED Windows 2000 msvc debug: classlib over ibmvm Wed, 14 Mar, 01:36
nbe...@kc.rr.com   [build-test alert] BUILD FAILED Windows 2000 msvc debug: classlib over ibmvm Wed, 14 Mar, 02:26
nbe...@kc.rr.com   [build-test alert] BUILD FAILED Windows 2000 msvc debug: classlib over ibmvm Wed, 14 Mar, 03:15
nbe...@kc.rr.com   [build-test alert] BUILD FAILED Windows 2000 msvc debug: classlib over ibmvm Wed, 14 Mar, 04:05
nbe...@kc.rr.com   [build-test alert] BUILD FAILED Windows 2000 msvc debug: classlib over ibmvm Wed, 14 Mar, 04:54
nbe...@kc.rr.com   [build-test alert] BUILD FAILED Windows 2000 msvc debug: classlib over ibmvm Wed, 14 Mar, 05:54
nbe...@kc.rr.com   [build-test alert] BUILD FAILED Windows 2000 msvc debug: classlib over ibmvm Wed, 14 Mar, 06:55
nbe...@kc.rr.com   [build-test alert] BUILD FAILED Windows 2000 msvc debug: classlib over ibmvm Wed, 14 Mar, 07:45
nbe...@kc.rr.com   [build-test alert] BUILD FAILED Windows 2000 msvc debug: classlib over ibmvm Wed, 14 Mar, 08:45
nbe...@kc.rr.com   [build-test alert] BUILD FAILED Windows 2000 msvc debug: classlib over ibmvm Wed, 14 Mar, 09:46
nbe...@kc.rr.com   [build-test alert] BUILD FAILED Windows 2000 msvc debug: classlib over ibmvm Wed, 14 Mar, 10:47
nbe...@kc.rr.com   [build-test alert] BUILD FAILED Windows 2000 msvc debug: classlib over ibmvm Wed, 14 Mar, 11:37
nbe...@kc.rr.com   [build-test alert] BUILD FAILED Windows 2000 msvc debug: classlib over ibmvm Wed, 14 Mar, 12:27
nbe...@kc.rr.com   [build-test alert] BUILD FAILED Windows 2000 msvc debug: classlib over ibmvm Wed, 14 Mar, 13:19
nbe...@kc.rr.com   [build-test alert] BUILD FAILED Windows 2000 msvc debug: classlib over ibmvm Wed, 14 Mar, 14:19
nbe...@kc.rr.com   [build-test alert] BUILD FAILED Windows 2000 msvc debug: classlib over ibmvm Wed, 14 Mar, 15:09
nbe...@kc.rr.com   [build-test alert] BUILD FAILED Windows 2000 msvc debug: classlib over ibmvm Wed, 14 Mar, 16:00
nbe...@kc.rr.com   [build-test alert] BUILD FAILED Windows 2000 msvc debug: classlib over ibmvm Wed, 14 Mar, 16:50
nbe...@kc.rr.com   [build-test alert] BUILD FAILED Windows 2000 msvc debug: classlib over ibmvm Wed, 14 Mar, 17:41
nbe...@kc.rr.com   [build-test alert] BUILD FAILED Windows 2000 msvc debug: classlib over ibmvm Wed, 14 Mar, 18:31
nbe...@kc.rr.com   [build-test alert] BUILD FAILED Windows 2000 msvc debug: classlib over ibmvm Wed, 14 Mar, 19:21
nbe...@kc.rr.com   [build-test alert] BUILD FAILED Windows 2000 msvc debug: classlib over ibmvm Wed, 14 Mar, 20:12
nbe...@kc.rr.com   [build-test alert] BUILD FAILED Windows 2000 msvc debug: classlib over ibmvm Wed, 14 Mar, 21:02
nbe...@kc.rr.com   [build-test alert] BUILD FAILED Windows 2000 msvc debug: classlib over ibmvm Wed, 14 Mar, 21:52
nbe...@kc.rr.com   [build-test alert] BUILD FAILED Windows 2000 msvc debug: classlib over ibmvm Wed, 14 Mar, 22:43
nbe...@kc.rr.com   [build-test alert] BUILD FAILED Windows 2000 msvc debug: classlib over ibmvm Wed, 14 Mar, 23:33
nbe...@kc.rr.com   [build-test alert] BUILD FAILED Windows 2000 msvc debug: classlib over ibmvm Thu, 15 Mar, 00:23
nbe...@kc.rr.com   [build-test alert] BUILD FAILED Windows 2000 msvc debug: classlib over ibmvm Thu, 15 Mar, 01:14
nbe...@kc.rr.com   [build-test alert] BUILD FAILED Windows 2000 msvc debug: classlib over ibmvm Thu, 15 Mar, 04:19
nbe...@kc.rr.com   [build-test alert] BUILD FAILED Windows 2000 msvc debug: classlib over ibmvm Thu, 15 Mar, 06:11
nbe...@kc.rr.com   [build-test alert] BUILD FAILED Windows 2000 msvc debug: classlib over ibmvm Thu, 15 Mar, 07:01
nbe...@kc.rr.com   [build-test alert] BUILD FAILED Windows 2000 msvc debug: classlib over ibmvm Thu, 15 Mar, 07:51
nbe...@kc.rr.com   [build-test alert] BUILD FAILED Windows 2000 msvc debug: classlib over ibmvm Thu, 15 Mar, 08:41
nbe...@kc.rr.com   [build-test alert] BUILD FAILED Windows 2000 msvc debug: classlib over ibmvm Thu, 15 Mar, 09:31
nbe...@kc.rr.com   [build-test alert] BUILD FAILED Windows 2000 msvc debug: classlib over ibmvm Thu, 15 Mar, 10:22
nbe...@kc.rr.com   [build-test alert] BUILD FAILED Windows 2000 msvc debug: classlib over ibmvm Thu, 15 Mar, 11:23
nbe...@kc.rr.com   [build-test alert] BUILD FAILED Windows 2000 msvc debug: classlib over ibmvm Thu, 15 Mar, 12:24
nbe...@kc.rr.com   [build-test alert] BUILD FAILED Windows 2000 msvc debug: classlib over ibmvm Thu, 15 Mar, 13:24
nbe...@kc.rr.com   [build-test alert] BUILD FAILED Windows 2000 msvc debug: classlib over ibmvm Thu, 15 Mar, 14:15
nbe...@kc.rr.com   [build-test alert] BUILD FAILED Windows 2000 msvc debug: classlib over ibmvm Thu, 15 Mar, 15:07
nbe...@kc.rr.com   [build-test alert] BUILD FAILED Windows 2000 msvc debug: classlib over ibmvm Thu, 15 Mar, 15:57
nbe...@kc.rr.com   [build-test alert] BUILD FAILED Windows 2000 msvc debug: classlib over ibmvm Thu, 15 Mar, 16:47
nbe...@kc.rr.com   [build-test alert] BUILD FAILED Windows 2000 msvc debug: classlib over ibmvm Thu, 15 Mar, 17:38
nbe...@kc.rr.com   [build-test alert] BUILD FAILED Windows 2000 msvc debug: classlib over ibmvm Thu, 15 Mar, 18:28
nbe...@kc.rr.com   [build-test alert] BUILD FAILED Windows 2000 msvc debug: classlib over ibmvm Thu, 15 Mar, 19:19
nbe...@kc.rr.com   [build-test alert] BUILD FAILED Windows 2000 msvc debug: classlib over ibmvm Thu, 15 Mar, 20:09
nbe...@kc.rr.com   [build-test alert] BUILD FAILED Windows 2000 msvc debug: classlib over ibmvm Thu, 15 Mar, 21:10
nbe...@kc.rr.com   [build-test alert] BUILD FAILED Windows 2000 msvc debug: classlib over ibmvm Thu, 15 Mar, 22:01
nbe...@kc.rr.com   [build-test alert] BUILD FAILED Windows 2000 msvc debug: classlib over ibmvm Thu, 15 Mar, 22:51
nbe...@kc.rr.com   [build-test alert] BUILD FAILED Windows 2000 msvc debug: classlib over ibmvm Thu, 15 Mar, 23:42
nbe...@kc.rr.com   [build-test alert] BUILD FAILED Windows 2000 msvc debug: classlib over ibmvm Fri, 16 Mar, 00:33
nbe...@kc.rr.com   [build-test alert] BUILD FAILED Windows 2000 msvc debug: classlib over ibmvm Fri, 16 Mar, 01:24
nbe...@kc.rr.com   [build-test alert] BUILD FAILED Windows 2000 msvc debug: classlib over ibmvm Fri, 16 Mar, 02:14
nbe...@kc.rr.com   [build-test alert] BUILD FAILED Windows 2000 msvc debug: classlib over ibmvm Fri, 16 Mar, 03:05
nbe...@kc.rr.com   [build-test alert] BUILD FAILED Windows 2000 msvc debug: classlib over ibmvm Fri, 16 Mar, 03:56
nbe...@kc.rr.com   [build-test alert] BUILD FAILED Windows 2000 msvc debug: classlib over ibmvm Fri, 16 Mar, 04:47
nbe...@kc.rr.com   [build-test alert] BUILD FAILED Windows 2000 msvc debug: classlib over ibmvm Fri, 16 Mar, 06:35
nbe...@kc.rr.com   [build-test alert] BUILD FAILED Windows 2000 msvc debug: classlib over ibmvm Fri, 16 Mar, 07:26
nbe...@kc.rr.com   [build-test alert] BUILD FAILED Windows 2000 msvc debug: classlib over ibmvm Fri, 16 Mar, 08:27
nbe...@kc.rr.com   [build-test alert] BUILD FAILED Windows 2000 msvc debug: classlib over ibmvm Fri, 16 Mar, 09:18
nbe...@kc.rr.com   [build-test alert] BUILD FAILED Windows 2000 msvc debug: classlib over ibmvm Fri, 16 Mar, 10:09
nbe...@kc.rr.com   [build-test alert] BUILD FAILED Windows 2000 msvc debug: classlib over ibmvm Fri, 16 Mar, 11:10
nbe...@kc.rr.com   [build-test alert] BUILD FAILED Windows 2000 msvc debug: classlib over ibmvm Fri, 16 Mar, 12:13
nbe...@kc.rr.com   [build-test alert] BUILD FAILED Windows 2000 msvc debug: classlib over ibmvm Fri, 16 Mar, 13:14
nbe...@kc.rr.com   [build-test alert] BUILD FAILED Windows 2000 msvc debug: classlib over ibmvm Fri, 16 Mar, 14:15
nbe...@kc.rr.com   [build-test alert] BUILD FAILED Windows 2000 msvc debug: classlib over ibmvm Fri, 16 Mar, 15:16
nbe...@kc.rr.com   [build-test alert] BUILD FAILED Windows 2000 msvc debug: classlib over ibmvm Fri, 16 Mar, 16:17
nbe...@kc.rr.com   [build-test alert] BUILD FAILED Windows 2000 msvc debug: classlib over ibmvm Fri, 16 Mar, 17:19
nbe...@kc.rr.com   [build-test alert] BUILD FAILED Windows 2000 msvc debug: classlib over ibmvm Fri, 16 Mar, 18:21
nbe...@kc.rr.com   [build-test alert] BUILD FAILED Windows 2000 msvc debug: classlib over ibmvm Fri, 16 Mar, 19:12
nbe...@kc.rr.com   [build-test alert] BUILD FAILED Windows 2000 msvc debug: classlib over ibmvm Fri, 16 Mar, 20:14
nbe...@kc.rr.com   [build-test alert] BUILD FAILED Windows 2000 msvc debug: classlib over ibmvm Fri, 16 Mar, 21:06
nbe...@kc.rr.com   [build-test alert] BUILD FAILED Windows 2000 msvc debug: classlib over ibmvm Fri, 16 Mar, 22:08
nbe...@kc.rr.com   [build-test alert] BUILD FAILED Windows 2000 msvc debug: classlib over ibmvm Fri, 16 Mar, 22:59
nbe...@kc.rr.com   [build-test alert] BUILD FAILED Windows 2000 msvc debug: classlib over ibmvm Fri, 16 Mar, 23:50
nbe...@kc.rr.com   [build-test alert] BUILD FAILED Windows 2000 msvc debug: classlib over ibmvm Sat, 17 Mar, 00:42
nbe...@kc.rr.com   [build-test alert] BUILD FAILED Windows 2000 msvc debug: classlib over ibmvm Sat, 17 Mar, 01:33
nbe...@kc.rr.com   [build-test alert] BUILD FAILED Windows 2000 msvc debug: classlib over ibmvm Sat, 17 Mar, 02:25
nbe...@kc.rr.com   [build-test alert] BUILD FAILED Windows 2000 msvc debug: classlib over ibmvm Sat, 17 Mar, 03:17
nbe...@kc.rr.com   [build-test alert] BUILD FAILED Windows 2000 msvc debug: classlib over ibmvm Sat, 17 Mar, 04:08
nbe...@kc.rr.com   [build-test alert] BUILD FAILED Windows 2000 msvc debug: classlib over ibmvm Sat, 17 Mar, 05:00
nbe...@kc.rr.com   [build-test alert] BUILD FAILED Windows 2000 msvc debug: classlib over ibmvm Sat, 17 Mar, 05:52
nbe...@kc.rr.com   [build-test alert] BUILD FAILED Windows 2000 msvc debug: classlib over ibmvm Sat, 17 Mar, 06:43
nbe...@kc.rr.com   [build-test alert] BUILD FAILED Windows 2000 msvc debug: classlib over ibmvm Sat, 17 Mar, 07:35
nbe...@kc.rr.com   [build-test alert] BUILD FAILED Windows 2000 msvc debug: classlib over ibmvm Sat, 17 Mar, 08:27
nbe...@kc.rr.com   [build-test alert] BUILD FAILED Windows 2000 msvc debug: classlib over ibmvm Sat, 17 Mar, 09:19
nbe...@kc.rr.com   [build-test alert] BUILD FAILED Windows 2000 msvc debug: classlib over ibmvm Sat, 17 Mar, 10:11
nbe...@kc.rr.com   [build-test alert] BUILD FAILED Windows 2000 msvc debug: classlib over ibmvm Sat, 17 Mar, 11:12
nbe...@kc.rr.com   [build-test alert] BUILD FAILED Windows 2000 msvc debug: classlib over ibmvm Sat, 17 Mar, 12:14
nbe...@kc.rr.com   [build-test alert] BUILD FAILED Windows 2000 msvc debug: classlib over ibmvm Sat, 17 Mar, 13:06
nbe...@kc.rr.com   [build-test alert] BUILD FAILED Windows 2000 msvc debug: classlib over ibmvm Sat, 17 Mar, 13:58
nbe...@kc.rr.com   [build-test alert] BUILD FAILED Windows 2000 msvc debug: classlib over ibmvm Sat, 17 Mar, 14:50
nbe...@kc.rr.com   [build-test alert] BUILD FAILED Windows 2000 msvc debug: classlib over ibmvm Sat, 17 Mar, 15:54
nbe...@kc.rr.com   [build-test alert] BUILD FAILED Windows 2000 msvc debug: classlib over ibmvm Sat, 17 Mar, 16:46
nbe...@kc.rr.com   [build-test alert] BUILD FAILED Windows 2000 msvc debug: classlib over ibmvm Sat, 17 Mar, 17:48
nbe...@kc.rr.com   [build-test alert] BUILD FAILED Windows 2000 msvc debug: classlib over ibmvm Sat, 17 Mar, 18:40
nbe...@kc.rr.com   [build-test alert] BUILD FAILED Windows 2000 msvc debug: classlib over ibmvm Sat, 17 Mar, 19:32
nbe...@kc.rr.com   [build-test alert] BUILD FAILED Windows 2000 msvc debug: classlib over ibmvm Sat, 17 Mar, 20:24
nbe...@kc.rr.com   [build-test alert] BUILD FAILED Windows 2000 msvc debug: classlib over ibmvm Sat, 17 Mar, 21:16
nbe...@kc.rr.com   [build-test alert] BUILD FAILED Windows 2000 msvc debug: classlib over ibmvm Sat, 17 Mar, 22:08
nbe...@kc.rr.com   [build-test alert] BUILD FAILED Windows 2000 msvc debug: classlib over ibmvm Sat, 17 Mar, 23:00
nbe...@kc.rr.com   [build-test alert] BUILD FAILED Windows 2000 msvc debug: classlib over ibmvm Sat, 17 Mar, 23:52
nbe...@kc.rr.com   [build-test alert] BUILD FAILED Windows 2000 msvc debug: classlib over ibmvm Sun, 18 Mar, 00:45
nbe...@kc.rr.com   [build-test alert] BUILD FAILED Windows 2000 msvc debug: classlib over ibmvm Sun, 18 Mar, 01:36
nbe...@kc.rr.com   [build-test alert] BUILD FAILED Windows 2000 msvc debug: classlib over ibmvm Sun, 18 Mar, 02:28
nbe...@kc.rr.com   [build-test alert] BUILD FAILED Windows 2000 msvc debug: classlib over ibmvm Sun, 18 Mar, 03:21
nbe...@kc.rr.com   [build-test alert] BUILD FAILED Windows 2000 msvc debug: classlib over ibmvm Sun, 18 Mar, 04:12
nbe...@kc.rr.com   [build-test alert] BUILD FAILED Windows 2000 msvc debug: classlib over ibmvm Sun, 18 Mar, 05:05
nbe...@kc.rr.com   [build-test alert] BUILD FAILED Windows 2000 msvc debug: classlib over ibmvm Sun, 18 Mar, 05:57
nbe...@kc.rr.com   [build-test alert] BUILD FAILED Windows 2000 msvc debug: classlib over ibmvm Sun, 18 Mar, 06:49
nbe...@kc.rr.com   [build-test alert] BUILD FAILED Windows 2000 msvc debug: classlib over ibmvm Sun, 18 Mar, 07:41
nbe...@kc.rr.com   [build-test alert] BUILD FAILED Windows 2000 msvc debug: classlib over ibmvm Sun, 18 Mar, 08:33
nbe...@kc.rr.com   [build-test alert] BUILD FAILED Windows 2000 msvc debug: classlib over ibmvm Sun, 18 Mar, 09:25
nbe...@kc.rr.com   [build-test alert] BUILD FAILED Windows 2000 msvc debug: classlib over ibmvm Sun, 18 Mar, 10:18
nbe...@kc.rr.com   [build-test alert] BUILD FAILED Windows 2000 msvc debug: classlib over ibmvm Sun, 18 Mar, 11:10
nbe...@kc.rr.com   [build-test alert] BUILD FAILED Windows 2000 msvc debug: classlib over ibmvm Sun, 18 Mar, 12:02
nbe...@kc.rr.com   [build-test alert] BUILD FAILED Windows 2000 msvc debug: classlib over ibmvm Sun, 18 Mar, 12:54
nbe...@kc.rr.com   [build-test alert] BUILD FAILED Windows 2000 msvc debug: classlib over ibmvm Sun, 18 Mar, 13:46
nbe...@kc.rr.com   [build-test alert] BUILD FAILED Windows 2000 msvc debug: classlib over ibmvm Sun, 18 Mar, 14:38
nbe...@kc.rr.com   [build-test alert] BUILD FAILED Windows 2000 msvc debug: classlib over ibmvm Sun, 18 Mar, 15:31
nbe...@kc.rr.com   [build-test alert] BUILD FAILED Windows 2000 msvc debug: classlib over ibmvm Sun, 18 Mar, 16:23
nbe...@kc.rr.com   [build-test alert] BUILD FAILED Windows 2000 msvc debug: classlib over ibmvm Sun, 18 Mar, 17:15
nbe...@kc.rr.com   [build-test alert] BUILD FAILED Windows 2000 msvc debug: classlib over ibmvm Sun, 18 Mar, 18:07
nbe...@kc.rr.com   [build-test alert] BUILD FAILED Windows 2000 msvc debug: classlib over ibmvm Sun, 18 Mar, 19:00
nbe...@kc.rr.com   [build-test alert] BUILD FAILED Windows 2000 msvc debug: classlib over ibmvm Sun, 18 Mar, 19:51
nbe...@kc.rr.com   [build-test alert] BUILD FAILED Windows 2000 msvc debug: classlib over ibmvm Sun, 18 Mar, 20:43
nbe...@kc.rr.com   [build-test alert] BUILD FAILED Windows 2000 msvc debug: classlib over ibmvm Sun, 18 Mar, 21:35
nbe...@kc.rr.com   [build-test alert] BUILD FAILED Windows 2000 msvc debug: classlib over ibmvm Sun, 18 Mar, 22:30
nbe...@kc.rr.com   [build-test alert] BUILD FAILED Windows 2000 msvc debug: classlib over ibmvm Sun, 18 Mar, 23:22
nbe...@kc.rr.com   [build-test alert] BUILD FAILED Windows 2000 msvc debug: classlib over ibmvm Mon, 19 Mar, 00:14
nbe...@kc.rr.com   [build-test alert] BUILD FAILED Windows 2000 msvc debug: classlib over ibmvm Mon, 19 Mar, 01:06
nbe...@kc.rr.com   [build-test alert] BUILD FAILED Windows 2000 msvc debug: classlib over ibmvm Mon, 19 Mar, 01:59
nbe...@kc.rr.com   [build-test alert] BUILD FAILED Windows 2000 msvc debug: classlib over ibmvm Mon, 19 Mar, 02:51
nbe...@kc.rr.com   [build-test alert] BUILD FAILED Windows 2000 msvc debug: classlib over ibmvm Mon, 19 Mar, 03:44
nbe...@kc.rr.com   [build-test alert] BUILD FAILED Windows 2000 msvc debug: classlib over ibmvm Mon, 19 Mar, 04:36
nbe...@kc.rr.com   [build-test alert] BUILD FAILED Windows 2000 msvc debug: classlib over ibmvm Mon, 19 Mar, 05:28
nbe...@kc.rr.com   [build-test alert] BUILD FAILED Windows 2000 msvc debug: classlib over ibmvm Mon, 19 Mar, 06:20
nbe...@kc.rr.com   [build-test alert] BUILD FAILED Windows 2000 msvc debug: classlib over ibmvm Mon, 19 Mar, 07:12
nbe...@kc.rr.com   [build-test alert] BUILD FAILED Windows 2000 msvc debug: classlib over ibmvm Mon, 19 Mar, 08:04
nbe...@kc.rr.com   [build-test alert] BUILD FAILED Windows 2000 msvc debug: classlib over ibmvm Mon, 19 Mar, 08:56
nbe...@kc.rr.com   [build-test alert] BUILD FAILED Windows 2000 msvc debug: classlib over ibmvm Mon, 19 Mar, 09:48
nbe...@kc.rr.com   [build-test alert] BUILD FAILED Windows 2000 msvc debug: classlib over ibmvm Mon, 19 Mar, 10:40
nbe...@kc.rr.com   [build-test alert] BUILD FAILED Windows 2000 msvc debug: classlib over ibmvm Mon, 19 Mar, 11:42
nbe...@kc.rr.com   [build-test alert] BUILD FAILED Windows 2000 msvc debug: classlib over ibmvm Mon, 19 Mar, 12:35
nbe...@kc.rr.com   [build-test alert] BUILD FAILED Windows 2000 msvc debug: classlib over ibmvm Mon, 19 Mar, 13:27
nbe...@kc.rr.com   [build-test alert] BUILD FAILED Windows 2000 msvc debug: classlib over ibmvm Mon, 19 Mar, 14:19
nbe...@kc.rr.com   [build-test alert] BUILD FAILED Windows 2000 msvc debug: classlib over ibmvm Mon, 19 Mar, 15:21
nbe...@kc.rr.com   [build-test alert] BUILD FAILED Windows 2000 msvc debug: classlib over ibmvm Mon, 19 Mar, 16:24
nbe...@kc.rr.com   [build-test alert] BUILD FAILED Windows 2000 msvc debug: classlib over ibmvm Mon, 19 Mar, 17:16
nbe...@kc.rr.com   [build-test alert] BUILD FAILED Windows 2000 msvc debug: classlib over ibmvm Mon, 19 Mar, 18:09
nbe...@kc.rr.com   [build-test alert] BUILD FAILED Windows 2000 msvc debug: classlib over ibmvm Mon, 19 Mar, 19:01
nbe...@kc.rr.com   [build-test alert] BUILD FAILED Windows 2000 msvc debug: classlib over ibmvm Mon, 19 Mar, 19:54
nbe...@kc.rr.com   [build-test alert] BUILD FAILED Windows 2000 msvc debug: classlib over ibmvm Mon, 19 Mar, 20:48
nbe...@kc.rr.com   [build-test alert] BUILD FAILED Windows 2000 msvc debug: classlib over ibmvm Mon, 19 Mar, 21:40
nbe...@kc.rr.com   [build-test alert] BUILD FAILED Windows 2000 msvc debug: classlib over ibmvm Mon, 19 Mar, 22:33
nbe...@kc.rr.com   [build-test alert] BUILD FAILED Windows 2000 msvc debug: classlib over ibmvm Mon, 19 Mar, 23:26
nbe...@kc.rr.com   [build-test alert] BUILD FAILED Windows 2000 msvc debug: classlib over ibmvm Tue, 20 Mar, 00:19
nbe...@kc.rr.com   [build-test alert] BUILD FAILED Windows 2000 msvc debug: classlib over ibmvm Tue, 20 Mar, 01:11
nbe...@kc.rr.com   [build-test alert] BUILD FAILED Windows 2000 msvc debug: classlib over ibmvm Tue, 20 Mar, 02:04
nbe...@kc.rr.com   [build-test alert] BUILD FAILED Windows 2000 msvc debug: classlib over ibmvm Tue, 20 Mar, 02:56
nbe...@kc.rr.com   [build-test alert] BUILD FAILED Windows 2000 msvc debug: classlib over ibmvm Tue, 20 Mar, 03:49
nbe...@kc.rr.com   [build-test alert] BUILD FAILED Windows 2000 msvc debug: classlib over ibmvm Tue, 20 Mar, 04:42
nbe...@kc.rr.com   [build-test alert] BUILD FAILED Windows 2000 msvc debug: classlib over ibmvm Tue, 20 Mar, 05:34
nbe...@kc.rr.com   [build-test alert] BUILD FAILED Windows 2000 msvc debug: classlib over ibmvm Tue, 20 Mar, 06:37
nbe...@kc.rr.com   [build-test alert] BUILD FAILED Windows 2000 msvc debug: classlib over ibmvm Tue, 20 Mar, 07:30
nbe...@kc.rr.com   [build-test alert] BUILD FAILED Windows 2000 msvc debug: classlib over ibmvm Tue, 20 Mar, 08:23
nbe...@kc.rr.com   [build-test alert] BUILD FAILED Windows 2000 msvc debug: classlib over ibmvm Tue, 20 Mar, 09:16
nbe...@kc.rr.com   [build-test alert] BUILD FAILED Windows 2000 msvc debug: classlib over ibmvm Tue, 20 Mar, 10:09
nbe...@kc.rr.com   [build-test alert] BUILD FAILED Windows 2000 msvc debug: classlib over ibmvm Tue, 20 Mar, 11:02
nbe...@kc.rr.com   [build-test alert] BUILD FAILED Windows 2000 msvc debug: classlib over ibmvm Tue, 20 Mar, 11:55
nbe...@kc.rr.com   [build-test alert] BUILD FAILED Windows 2000 msvc debug: classlib over ibmvm Tue, 20 Mar, 12:57
nbe...@kc.rr.com   [build-test alert] BUILD FAILED Windows 2000 msvc debug: classlib over ibmvm Tue, 20 Mar, 13:50
nbe...@kc.rr.com   [build-test alert] BUILD FAILED Windows 2000 msvc debug: classlib over ibmvm Tue, 20 Mar, 14:53
nbe...@kc.rr.com   [build-test alert] BUILD FAILED Windows 2000 msvc debug: classlib over ibmvm Tue, 20 Mar, 15:58
nbe...@kc.rr.com   [build-test alert] BUILD FAILED Windows 2000 msvc debug: classlib over ibmvm Tue, 20 Mar, 16:51
nbe...@kc.rr.com   [build-test alert] BUILD FAILED Windows 2000 msvc debug: classlib over ibmvm Tue, 20 Mar, 17:44
nbe...@kc.rr.com   [build-test alert] BUILD FAILED Windows 2000 msvc debug: classlib over ibmvm Tue, 20 Mar, 18:36
nbe...@kc.rr.com   [build-test alert] BUILD FAILED Windows 2000 msvc debug: classlib over ibmvm Tue, 20 Mar, 19:29
nbe...@kc.rr.com   [build-test alert] BUILD FAILED Windows 2000 msvc debug: classlib over ibmvm Tue, 20 Mar, 20:22
nbe...@kc.rr.com   [build-test alert] BUILD FAILED Windows 2000 msvc debug: classlib over ibmvm Tue, 20 Mar, 21:15
nbe...@kc.rr.com   [build-test alert] BUILD FAILED Windows 2000 msvc debug: classlib over ibmvm Tue, 20 Mar, 22:09
nbe...@kc.rr.com   [build-test alert] BUILD FAILED Windows 2000 msvc debug: classlib over ibmvm Tue, 20 Mar, 23:02
nbe...@kc.rr.com   [build-test alert] BUILD FAILED Windows 2000 msvc debug: classlib over ibmvm Tue, 20 Mar, 23:55
nbe...@kc.rr.com   [build-test alert] BUILD FAILED Windows 2000 msvc debug: classlib over ibmvm Wed, 21 Mar, 00:48
nbe...@kc.rr.com   [build-test alert] BUILD FAILED Windows 2000 msvc debug: classlib over ibmvm Wed, 21 Mar, 01:41
nbe...@kc.rr.com   [build-test alert] BUILD FAILED Windows 2000 msvc debug: classlib over ibmvm Wed, 21 Mar, 02:34
nbe...@kc.rr.com   [build-test alert] BUILD FAILED Windows 2000 msvc debug: classlib over ibmvm Wed, 21 Mar, 03:27
nbe...@kc.rr.com   [build-test alert] BUILD FAILED Windows 2000 msvc debug: classlib over ibmvm Wed, 21 Mar, 04:31
nbe...@kc.rr.com   [build-test alert] BUILD FAILED Windows 2000 msvc debug: classlib over ibmvm Wed, 21 Mar, 05:24
nbe...@kc.rr.com   [build-test alert] BUILD FAILED Windows 2000 msvc debug: classlib over ibmvm Wed, 21 Mar, 06:17
nbe...@kc.rr.com   [build-test alert] BUILD FAILED Windows 2000 msvc debug: classlib over ibmvm Wed, 21 Mar, 07:09
nbe...@kc.rr.com   [build-test alert] BUILD FAILED Windows 2000 msvc debug: classlib over ibmvm Wed, 21 Mar, 08:02
nbe...@kc.rr.com   [build-test alert] BUILD FAILED Windows 2000 msvc debug: classlib over ibmvm Wed, 21 Mar, 09:06
nbe...@kc.rr.com   [build-test alert] BUILD FAILED Windows 2000 msvc debug: classlib over ibmvm Wed, 21 Mar, 10:10
nbe...@kc.rr.com   [build-test alert] BUILD FAILED Windows 2000 msvc debug: classlib over ibmvm Wed, 21 Mar, 11:13
nbe...@kc.rr.com   [build-test alert] BUILD FAILED Windows 2000 msvc debug: classlib over ibmvm Wed, 21 Mar, 12:18
nbe...@kc.rr.com   [build-test alert] BUILD FAILED Windows 2000 msvc debug: classlib over ibmvm Wed, 21 Mar, 13:21
nbe...@kc.rr.com   [build-test alert] BUILD FAILED Windows 2000 msvc debug: classlib over ibmvm Wed, 21 Mar, 14:15
nbe...@kc.rr.com   [build-test alert] BUILD FAILED Windows 2000 msvc debug: classlib over ibmvm Wed, 21 Mar, 15:08
nbe...@kc.rr.com   [build-test alert] BUILD FAILED Windows 2000 msvc debug: classlib over ibmvm Wed, 21 Mar, 16:01
nbe...@kc.rr.com   [build-test alert] BUILD FAILED Windows 2000 msvc debug: classlib over ibmvm Wed, 21 Mar, 17:02
nbe...@kc.rr.com   [build-test alert] BUILD FAILED Windows 2000 msvc debug: classlib over ibmvm Wed, 21 Mar, 18:06
nbe...@kc.rr.com   [build-test alert] BUILD FAILED Windows 2000 msvc debug: classlib over ibmvm Wed, 21 Mar, 19:00
nbe...@kc.rr.com   [build-test alert] BUILD FAILED Windows 2000 msvc debug: classlib over ibmvm Wed, 21 Mar, 19:54
nbe...@kc.rr.com   [build-test alert] BUILD FAILED Windows 2000 msvc debug: classlib over ibmvm Wed, 21 Mar, 20:57
nbe...@kc.rr.com   [build-test alert] BUILD FAILED Windows 2000 msvc debug: classlib over ibmvm Wed, 21 Mar, 21:51
nbe...@kc.rr.com   [build-test alert] BUILD FAILED Windows 2000 msvc debug: classlib over ibmvm Wed, 21 Mar, 22:45
nbe...@kc.rr.com   [build-test alert] BUILD FAILED Windows 2000 msvc debug: classlib over ibmvm Wed, 21 Mar, 23:39
nbe...@kc.rr.com   [build-test alert] BUILD FAILED Windows 2000 msvc debug: classlib over ibmvm Thu, 22 Mar, 00:32
nbe...@kc.rr.com   [build-test alert] BUILD FAILED Windows 2000 msvc debug: classlib over ibmvm Thu, 22 Mar, 01:26
nbe...@kc.rr.com   [build-test alert] BUILD FAILED Windows 2000 msvc debug: classlib over ibmvm Thu, 22 Mar, 02:20
nbe...@kc.rr.com   [build-test alert] BUILD FAILED Windows 2000 msvc debug: classlib over ibmvm Thu, 22 Mar, 03:13
nbe...@kc.rr.com   [build-test alert] BUILD FAILED Windows 2000 msvc debug: classlib over ibmvm Thu, 22 Mar, 04:17
nbe...@kc.rr.com   [build-test alert] BUILD FAILED Windows 2000 msvc debug: classlib over ibmvm Thu, 22 Mar, 05:26
nbe...@kc.rr.com   [build-test alert] BUILD FAILED Windows 2000 msvc debug: classlib over ibmvm Thu, 22 Mar, 06:23
nbe...@kc.rr.com   [build-test alert] BUILD FAILED Windows 2000 msvc debug: classlib over ibmvm Thu, 22 Mar, 07:20
nbe...@kc.rr.com   [build-test alert] BUILD FAILED Windows 2000 msvc debug: classlib over ibmvm Thu, 22 Mar, 08:35
nbe...@kc.rr.com   [build-test alert] BUILD FAILED Windows 2000 msvc debug: classlib over ibmvm Thu, 22 Mar, 09:34
nbe...@kc.rr.com   [build-test alert] BUILD FAILED Windows 2000 msvc debug: classlib over ibmvm Thu, 22 Mar, 10:39
nbe...@kc.rr.com   [build-test alert] BUILD FAILED Windows 2000 msvc debug: classlib over ibmvm Thu, 22 Mar, 11:45
nbe...@kc.rr.com   [build-test alert] BUILD FAILED Windows 2000 msvc debug: classlib over ibmvm Thu, 22 Mar, 12:39
nbe...@kc.rr.com   [build-test alert] BUILD FAILED Windows 2000 msvc debug: classlib over ibmvm Thu, 22 Mar, 13:43
nbe...@kc.rr.com   [build-test alert] BUILD FAILED Windows 2000 msvc debug: classlib over ibmvm Thu, 22 Mar, 14:37
nbe...@kc.rr.com   [build-test alert] BUILD FAILED Windows 2000 msvc debug: classlib over ibmvm Thu, 22 Mar, 15:32
nbe...@kc.rr.com   [build-test alert] BUILD FAILED Windows 2000 msvc debug: classlib over ibmvm Thu, 22 Mar, 16:27
nbe...@kc.rr.com   [build-test alert] BUILD FAILED Windows 2000 msvc debug: classlib over ibmvm Thu, 22 Mar, 17:31
nbe...@kc.rr.com   [build-test alert] BUILD FAILED Windows 2000 msvc debug: classlib over ibmvm Thu, 22 Mar, 18:25
nbe...@kc.rr.com   [build-test alert] BUILD FAILED Windows 2000 msvc debug: classlib over ibmvm Thu, 22 Mar, 19:20
nbe...@kc.rr.com   [build-test alert] BUILD FAILED Windows 2000 msvc debug: classlib over ibmvm Thu, 22 Mar, 20:14
nbe...@kc.rr.com   [build-test alert] BUILD FAILED Windows 2000 msvc debug: classlib over ibmvm Thu, 22 Mar, 21:09
nbe...@kc.rr.com   [build-test alert] BUILD FAILED Windows 2000 msvc debug: classlib over ibmvm Thu, 22 Mar, 22:03
nbe...@kc.rr.com   [build-test alert] BUILD FAILED Windows 2000 msvc debug: classlib over ibmvm Thu, 22 Mar, 22:58
nbe...@kc.rr.com   [build-test alert] BUILD FAILED Windows 2000 msvc debug: classlib over ibmvm Thu, 22 Mar, 23:52
nbe...@kc.rr.com   [build-test alert] BUILD FAILED Windows 2000 msvc debug: classlib over ibmvm Fri, 23 Mar, 00:46
nbe...@kc.rr.com   [build-test alert] BUILD FAILED Windows 2000 msvc debug: classlib over ibmvm Fri, 23 Mar, 01:41
nbe...@kc.rr.com   [build-test alert] BUILD FAILED Windows 2000 msvc debug: classlib over ibmvm Fri, 23 Mar, 02:36
nbe...@kc.rr.com   [build-test alert] BUILD FAILED Windows 2000 msvc debug: classlib over ibmvm Fri, 23 Mar, 03:30
nbe...@kc.rr.com   [build-test alert] BUILD FAILED Windows 2000 msvc debug: classlib over ibmvm Fri, 23 Mar, 04:27
nbe...@kc.rr.com   [build-test alert] BUILD FAILED Windows 2000 msvc debug: classlib over ibmvm Fri, 23 Mar, 05:21
nbe...@kc.rr.com   [build-test alert] BUILD FAILED Windows 2000 msvc debug: classlib over ibmvm Fri, 23 Mar, 06:16
nbe...@kc.rr.com   [build-test alert] BUILD FAILED Windows 2000 msvc debug: classlib over ibmvm Fri, 23 Mar, 07:21
nbe...@kc.rr.com   [build-test alert] BUILD FAILED Windows 2000 msvc debug: classlib over ibmvm Fri, 23 Mar, 08:16
nbe...@kc.rr.com   [build-test alert] BUILD FAILED Windows 2000 msvc debug: classlib over ibmvm Fri, 23 Mar, 09:11
nbe...@kc.rr.com   [build-test alert] BUILD FAILED Windows 2000 msvc debug: classlib over ibmvm Fri, 23 Mar, 10:06
nbe...@kc.rr.com   [build-test alert] BUILD FAILED Windows 2000 msvc debug: classlib over ibmvm Fri, 23 Mar, 11:11
nbe...@kc.rr.com   [build-test alert] BUILD FAILED Windows 2000 msvc debug: classlib over ibmvm Fri, 23 Mar, 12:17
nbe...@kc.rr.com   [build-test alert] BUILD FAILED Windows 2000 msvc debug: classlib over ibmvm Fri, 23 Mar, 13:11
nbe...@kc.rr.com   [build-test alert] BUILD FAILED Windows 2000 msvc debug: classlib over ibmvm Fri, 23 Mar, 14:17
nbe...@kc.rr.com   [build-test alert] BUILD FAILED Windows 2000 msvc debug: classlib over ibmvm Fri, 23 Mar, 15:22
nbe...@kc.rr.com   [build-test alert] BUILD FAILED Windows 2000 msvc debug: classlib over ibmvm Fri, 23 Mar, 16:27
nbe...@kc.rr.com   [build-test alert] BUILD FAILED Windows 2000 msvc debug: classlib over ibmvm Fri, 23 Mar, 17:32
nbe...@kc.rr.com   [build-test alert] BUILD FAILED Windows 2000 msvc debug: classlib over ibmvm Fri, 23 Mar, 18:40
nbe...@kc.rr.com   [build-test alert] BUILD FAILED Windows 2000 msvc debug: classlib over ibmvm Fri, 23 Mar, 19:36
nbe...@kc.rr.com   [build-test alert] BUILD FAILED Windows 2000 msvc debug: classlib over ibmvm Fri, 23 Mar, 20:31
nbe...@kc.rr.com   [build-test alert] BUILD FAILED Windows 2000 msvc debug: classlib over ibmvm Fri, 23 Mar, 21:26
nbe...@kc.rr.com   [build-test alert] BUILD FAILED Windows 2000 msvc debug: classlib over ibmvm Fri, 23 Mar, 22:22
nbe...@kc.rr.com   [build-test alert] BUILD FAILED Windows 2000 msvc debug: classlib over ibmvm Fri, 23 Mar, 23:18
nbe...@kc.rr.com   [build-test alert] BUILD FAILED Windows 2000 msvc debug: classlib over ibmvm Sat, 24 Mar, 00:12
nbe...@kc.rr.com   [build-test alert] BUILD FAILED Windows 2000 msvc debug: classlib over ibmvm Sat, 24 Mar, 01:07
nbe...@kc.rr.com   [build-test alert] BUILD FAILED Windows 2000 msvc debug: classlib over ibmvm Sat, 24 Mar, 02:03
nbe...@kc.rr.com   [build-test alert] BUILD FAILED Windows 2000 msvc debug: classlib over ibmvm Sat, 24 Mar, 02:58
nbe...@kc.rr.com   [build-test alert] BUILD FAILED Windows 2000 msvc debug: classlib over ibmvm Sat, 24 Mar, 03:53
nbe...@kc.rr.com   [build-test alert] BUILD FAILED Windows 2000 msvc debug: classlib over ibmvm Sat, 24 Mar, 04:48
nbe...@kc.rr.com   [build-test alert] BUILD FAILED Windows 2000 msvc debug: classlib over ibmvm Sat, 24 Mar, 05:43
nbe...@kc.rr.com   [build-test alert] BUILD FAILED Windows 2000 msvc debug: classlib over ibmvm Sat, 24 Mar, 06:38
nbe...@kc.rr.com   [build-test alert] BUILD FAILED Windows 2000 msvc debug: classlib over ibmvm Sat, 24 Mar, 07:34
nbe...@kc.rr.com   [build-test alert] BUILD FAILED Windows 2000 msvc debug: classlib over ibmvm Sat, 24 Mar, 08:29
nbe...@kc.rr.com   [build-test alert] BUILD FAILED Windows 2000 msvc debug: classlib over ibmvm Sat, 24 Mar, 09:24
nbe...@kc.rr.com   [build-test alert] BUILD FAILED Windows 2000 msvc debug: classlib over ibmvm Sat, 24 Mar, 10:19
nbe...@kc.rr.com   [build-test alert] BUILD FAILED Windows 2000 msvc debug: classlib over ibmvm Sat, 24 Mar, 11:14
nbe...@kc.rr.com   [build-test alert] BUILD FAILED Windows 2000 msvc debug: classlib over ibmvm Sat, 24 Mar, 12:10
nbe...@kc.rr.com   [build-test alert] BUILD FAILED Windows 2000 msvc debug: classlib over ibmvm Sat, 24 Mar, 13:05
nbe...@kc.rr.com   [build-test alert] BUILD FAILED Windows 2000 msvc debug: classlib over ibmvm Sat, 24 Mar, 14:00
nbe...@kc.rr.com   [build-test alert] BUILD FAILED Windows 2000 msvc debug: classlib over ibmvm Sat, 24 Mar, 14:55
nbe...@kc.rr.com   [build-test alert] BUILD FAILED Windows 2000 msvc debug: classlib over ibmvm Sat, 24 Mar, 15:50
nbe...@kc.rr.com   [build-test alert] BUILD FAILED Windows 2000 msvc debug: classlib over ibmvm Sat, 24 Mar, 16:46
nbe...@kc.rr.com   [build-test alert] BUILD FAILED Windows 2000 msvc debug: classlib over ibmvm Sat, 24 Mar, 17:41
nbe...@kc.rr.com   [build-test alert] BUILD FAILED Windows 2000 msvc debug: classlib over ibmvm Sat, 24 Mar, 18:37
nbe...@kc.rr.com   [build-test alert] BUILD FAILED Windows 2000 msvc debug: classlib over ibmvm Sat, 24 Mar, 19:34
nbe...@kc.rr.com   [build-test alert] BUILD FAILED Windows 2000 msvc debug: classlib over ibmvm Sat, 24 Mar, 20:28
nbe...@kc.rr.com   [build-test alert] BUILD FAILED Windows 2000 msvc debug: classlib over ibmvm Sat, 24 Mar, 21:23
nbe...@kc.rr.com   [build-test alert] BUILD FAILED Windows 2000 msvc debug: classlib over ibmvm Sat, 24 Mar, 22:18
nbe...@kc.rr.com   [build-test alert] BUILD FAILED Windows 2000 msvc debug: classlib over ibmvm Sat, 24 Mar, 23:14
nbe...@kc.rr.com   [build-test alert] BUILD FAILED Windows 2000 msvc debug: classlib over ibmvm Sun, 25 Mar, 00:09
nbe...@kc.rr.com   [build-test alert] BUILD FAILED Windows 2000 msvc debug: classlib over ibmvm Sun, 25 Mar, 01:04
nbe...@kc.rr.com   [build-test alert] BUILD FAILED Windows 2000 msvc debug: classlib over ibmvm Sun, 25 Mar, 01:59
nbe...@kc.rr.com   [build-test alert] BUILD FAILED Windows 2000 msvc debug: classlib over ibmvm Sun, 25 Mar, 02:54
nbe...@kc.rr.com   [build-test alert] BUILD FAILED Windows 2000 msvc debug: classlib over ibmvm Sun, 25 Mar, 03:49
nbe...@kc.rr.com   [build-test alert] BUILD FAILED Windows 2000 msvc debug: classlib over ibmvm Sun, 25 Mar, 05:03
nbe...@kc.rr.com   [build-test alert] BUILD FAILED Windows 2000 msvc debug: classlib over ibmvm Sun, 25 Mar, 06:01
nbe...@kc.rr.com   [build-test alert] BUILD FAILED Windows 2000 msvc debug: classlib over ibmvm Sun, 25 Mar, 06:58
nbe...@kc.rr.com   [build-test alert] BUILD FAILED Windows 2000 msvc debug: classlib over ibmvm Sun, 25 Mar, 07:56
nbe...@kc.rr.com   [build-test alert] BUILD FAILED Windows 2000 msvc debug: classlib over ibmvm Sun, 25 Mar, 08:53
nbe...@kc.rr.com   [build-test alert] BUILD FAILED Windows 2000 msvc debug: classlib over ibmvm Sun, 25 Mar, 09:50
nbe...@kc.rr.com   [build-test alert] BUILD FAILED Windows 2000 msvc debug: classlib over ibmvm Sun, 25 Mar, 10:48
nbe...@kc.rr.com   [build-test alert] BUILD FAILED Windows 2000 msvc debug: classlib over ibmvm Sun, 25 Mar, 11:46
nbe...@kc.rr.com   [build-test alert] BUILD FAILED Windows 2000 msvc debug: classlib over ibmvm Sun, 25 Mar, 12:42
nbe...@kc.rr.com   [build-test alert] BUILD FAILED Windows 2000 msvc debug: classlib over ibmvm Sun, 25 Mar, 13:38
nbe...@kc.rr.com   [build-test alert] BUILD FAILED Windows 2000 msvc debug: classlib over ibmvm Sun, 25 Mar, 14:33
nbe...@kc.rr.com   [build-test alert] BUILD FAILED Windows 2000 msvc debug: classlib over ibmvm Sun, 25 Mar, 15:29
nbe...@kc.rr.com   [build-test alert] BUILD FAILED Windows 2000 msvc debug: classlib over ibmvm Sun, 25 Mar, 16:24
nbe...@kc.rr.com   [build-test alert] BUILD FAILED Windows 2000 msvc debug: classlib over ibmvm Sun, 25 Mar, 17:21
nbe...@kc.rr.com   [build-test alert] BUILD FAILED Windows 2000 msvc debug: classlib over ibmvm Sun, 25 Mar, 18:16
nbe...@kc.rr.com   [build-test alert] BUILD FAILED Windows 2000 msvc debug: classlib over ibmvm Sun, 25 Mar, 19:12
nbe...@kc.rr.com   [build-test alert] BUILD FAILED Windows 2000 msvc debug: classlib over ibmvm Sun, 25 Mar, 20:08
nbe...@kc.rr.com   [build-test alert] BUILD FAILED Windows 2000 msvc debug: classlib over ibmvm Tue, 27 Mar, 04:42
nbe...@kc.rr.com   [build-test alert] BUILD FAILED Windows 2000 msvc debug: classlib over ibmvm Tue, 27 Mar, 05:40
nbe...@kc.rr.com   [build-test alert] BUILD FAILED Windows 2000 msvc debug: classlib over ibmvm Tue, 27 Mar, 06:39
nbe...@kc.rr.com   [build-test alert] BUILD FAILED Windows 2000 msvc debug: classlib over ibmvm Tue, 27 Mar, 07:37
nbe...@kc.rr.com   [build-test alert] BUILD FAILED Windows 2000 msvc debug: classlib over ibmvm Tue, 27 Mar, 08:34
nbe...@kc.rr.com   [build-test alert] BUILD FAILED Windows 2000 msvc debug: classlib over ibmvm Tue, 27 Mar, 09:31
nbe...@kc.rr.com   [build-test alert] BUILD FAILED Windows 2000 msvc debug: classlib over ibmvm Tue, 27 Mar, 10:29
nbe...@kc.rr.com   [build-test alert] BUILD FAILED Windows 2000 msvc debug: classlib over ibmvm Tue, 27 Mar, 11:25
nbe...@kc.rr.com   [build-test alert] BUILD FAILED Windows 2000 msvc debug: classlib over ibmvm Tue, 27 Mar, 12:31
nbe...@kc.rr.com   [build-test alert] BUILD FAILED Windows 2000 msvc debug: classlib over ibmvm Tue, 27 Mar, 13:27
nbe...@kc.rr.com   [build-test alert] BUILD FAILED Windows 2000 msvc debug: classlib over ibmvm Tue, 27 Mar, 14:33
nbe...@kc.rr.com   [build-test alert] BUILD FAILED Windows 2000 msvc debug: classlib over ibmvm Tue, 27 Mar, 15:29
nbe...@kc.rr.com   [build-test alert] BUILD FAILED Windows 2000 msvc debug: classlib over ibmvm Tue, 27 Mar, 16:25
nbe...@kc.rr.com   [build-test alert] BUILD FAILED Windows 2000 msvc debug: classlib over ibmvm Tue, 27 Mar, 17:20
nbe...@kc.rr.com   [build-test alert] BUILD FAILED Windows 2000 msvc debug: classlib over ibmvm Tue, 27 Mar, 18:16
nbe...@kc.rr.com   [build-test alert] BUILD FAILED Windows 2000 msvc debug: classlib over ibmvm Tue, 27 Mar, 19:12
nbe...@kc.rr.com   [build-test alert] BUILD FAILED Windows 2000 msvc debug: classlib over ibmvm Tue, 27 Mar, 20:07
nbe...@kc.rr.com   [build-test alert] BUILD FAILED Windows 2000 msvc debug: classlib over ibmvm Tue, 27 Mar, 21:03
nbe...@kc.rr.com   [build-test alert] BUILD FAILED Windows 2000 msvc debug: classlib over ibmvm Tue, 27 Mar, 22:00
nbe...@kc.rr.com   [build-test alert] BUILD FAILED Windows 2000 msvc debug: classlib over ibmvm Tue, 27 Mar, 22:56
nbe...@kc.rr.com   [build-test alert] BUILD FAILED Windows 2000 msvc debug: classlib over ibmvm Tue, 27 Mar, 23:52
nbe...@kc.rr.com   [build-test alert] BUILD FAILED Windows 2000 msvc debug: classlib over ibmvm Wed, 28 Mar, 00:48
nbe...@kc.rr.com   [build-test alert] BUILD FAILED Windows 2000 msvc debug: classlib over ibmvm Wed, 28 Mar, 01:44
nbe...@kc.rr.com   [build-test alert] BUILD FAILED Windows 2000 msvc debug: classlib over ibmvm Wed, 28 Mar, 02:40
nbe...@kc.rr.com   [build-test alert] BUILD FAILED Windows 2000 msvc debug: classlib over ibmvm Wed, 28 Mar, 03:36
nbe...@kc.rr.com   [build-test alert] BUILD FAILED Windows 2000 msvc debug: classlib over ibmvm Wed, 28 Mar, 04:31
nbe...@kc.rr.com   [build-test alert] BUILD FAILED Windows 2000 msvc debug: classlib over ibmvm Wed, 28 Mar, 05:27
nbe...@kc.rr.com   [build-test alert] BUILD FAILED Windows 2000 msvc debug: classlib over ibmvm Wed, 28 Mar, 06:23
nbe...@kc.rr.com   [build-test alert] BUILD FAILED Windows 2000 msvc debug: classlib over ibmvm Wed, 28 Mar, 07:19
nbe...@kc.rr.com   [build-test alert] BUILD FAILED Windows 2000 msvc debug: classlib over ibmvm Wed, 28 Mar, 08:15
nbe...@kc.rr.com   [build-test alert] BUILD FAILED Windows 2000 msvc debug: classlib over ibmvm Wed, 28 Mar, 09:22
nbe...@kc.rr.com   [build-test alert] BUILD FAILED Windows 2000 msvc debug: classlib over ibmvm Wed, 28 Mar, 10:28
nbe...@kc.rr.com   [build-test alert] BUILD FAILED Windows 2000 msvc debug: classlib over ibmvm Wed, 28 Mar, 11:34
nbe...@kc.rr.com   [build-test alert] BUILD FAILED Windows 2000 msvc debug: classlib over ibmvm Wed, 28 Mar, 12:29
nbe...@kc.rr.com   [build-test alert] BUILD FAILED Windows 2000 msvc debug: classlib over ibmvm Wed, 28 Mar, 13:25
nbe...@kc.rr.com   [build-test alert] BUILD FAILED Windows 2000 msvc debug: classlib over ibmvm Wed, 28 Mar, 14:21
nbe...@kc.rr.com   [build-test alert] BUILD FAILED Windows 2000 msvc debug: classlib over ibmvm Wed, 28 Mar, 15:27
nbe...@kc.rr.com   [build-test alert] BUILD FAILED Windows 2000 msvc debug: classlib over ibmvm Wed, 28 Mar, 16:23
nbe...@kc.rr.com   [build-test alert] BUILD FAILED Windows 2000 msvc debug: classlib over ibmvm Wed, 28 Mar, 17:20
nbe...@kc.rr.com   [build-test alert] BUILD FAILED Windows 2000 msvc debug: classlib over ibmvm Wed, 28 Mar, 18:17
nbe...@kc.rr.com   [build-test alert] BUILD FAILED Windows 2000 msvc debug: classlib over ibmvm Wed, 28 Mar, 19:13
nbe...@kc.rr.com   [build-test alert] BUILD FAILED Windows 2000 msvc debug: classlib over ibmvm Wed, 28 Mar, 20:09
nbe...@kc.rr.com   [build-test alert] BUILD FAILED Windows 2000 msvc debug: classlib over ibmvm Wed, 28 Mar, 21:05
nbe...@kc.rr.com   [build-test alert] BUILD FAILED Windows 2000 msvc debug: classlib over ibmvm Wed, 28 Mar, 22:01
nbe...@kc.rr.com   [build-test alert] BUILD FAILED Windows 2000 msvc debug: classlib over ibmvm Wed, 28 Mar, 22:59
nbe...@kc.rr.com   [build-test alert] BUILD FAILED Windows 2000 msvc debug: classlib over ibmvm Wed, 28 Mar, 23:54
nbe...@kc.rr.com   [build-test alert] BUILD FAILED Windows 2000 msvc debug: classlib over ibmvm Thu, 29 Mar, 00:51
nbe...@kc.rr.com   [build-test alert] BUILD FAILED Windows 2000 msvc debug: classlib over ibmvm Thu, 29 Mar, 01:47
nbe...@kc.rr.com   [build-test alert] BUILD FAILED Windows 2000 msvc debug: classlib over ibmvm Thu, 29 Mar, 02:43
nbe...@kc.rr.com   [build-test alert] BUILD FAILED Windows 2000 msvc debug: classlib over ibmvm Thu, 29 Mar, 03:39
nbe...@kc.rr.com   [build-test alert] BUILD FAILED Windows 2000 msvc debug: classlib over ibmvm Thu, 29 Mar, 04:35
nbe...@kc.rr.com   [build-test alert] BUILD FAILED Windows 2000 msvc debug: classlib over ibmvm Thu, 29 Mar, 05:31
nbe...@kc.rr.com   [build-test alert] BUILD FAILED Windows 2000 msvc debug: classlib over ibmvm Thu, 29 Mar, 06:37
nbe...@kc.rr.com   [build-test alert] BUILD FAILED Windows 2000 msvc debug: classlib over ibmvm Thu, 29 Mar, 07:33
nbe...@kc.rr.com   [build-test alert] BUILD FAILED Windows 2000 msvc debug: classlib over ibmvm Thu, 29 Mar, 08:39
nbe...@kc.rr.com   [build-test alert] BUILD FAILED Windows 2000 msvc debug: classlib over ibmvm Thu, 29 Mar, 09:46
nbe...@kc.rr.com   [build-test alert] BUILD FAILED Windows 2000 msvc debug: classlib over ibmvm Thu, 29 Mar, 10:42
nbe...@kc.rr.com   [build-test alert] BUILD FAILED Windows 2000 msvc debug: classlib over ibmvm Thu, 29 Mar, 11:39
nbe...@kc.rr.com   [build-test alert] BUILD FAILED Windows 2000 msvc debug: classlib over ibmvm Thu, 29 Mar, 12:35
nbe...@kc.rr.com   [build-test alert] BUILD FAILED Windows 2000 msvc debug: classlib over ibmvm Thu, 29 Mar, 13:31
nbe...@kc.rr.com   [build-test alert] BUILD FAILED Windows 2000 msvc debug: classlib over ibmvm Thu, 29 Mar, 14:38
nbe...@kc.rr.com   [build-test alert] BUILD FAILED Windows 2000 msvc debug: classlib over ibmvm Thu, 29 Mar, 15:35
nbe...@kc.rr.com   [build-test alert] BUILD FAILED Windows 2000 msvc debug: classlib over ibmvm Thu, 29 Mar, 16:31
nbe...@kc.rr.com   [build-test alert] BUILD FAILED Windows 2000 msvc debug: classlib over ibmvm Thu, 29 Mar, 17:28
nbe...@kc.rr.com   [build-test alert] BUILD FAILED Windows 2000 msvc debug: classlib over ibmvm Thu, 29 Mar, 18:24
nbe...@kc.rr.com   [build-test alert] BUILD FAILED Windows 2000 msvc debug: classlib over ibmvm Thu, 29 Mar, 19:21
nbe...@kc.rr.com   [build-test alert] BUILD FAILED Windows 2000 msvc debug: classlib over ibmvm Thu, 29 Mar, 20:17
nbe...@kc.rr.com   [build-test alert] BUILD FAILED Windows 2000 msvc debug: classlib over ibmvm Thu, 29 Mar, 21:13
nbe...@kc.rr.com   [build-test alert] BUILD FAILED Windows 2000 msvc debug: classlib over ibmvm Thu, 29 Mar, 22:10
nbe...@kc.rr.com   [build-test alert] BUILD FAILED Windows 2000 msvc debug: classlib over ibmvm Thu, 29 Mar, 23:07
nbe...@kc.rr.com   [build-test alert] BUILD FAILED Windows 2000 msvc debug: classlib over ibmvm Fri, 30 Mar, 00:03
nbe...@kc.rr.com   [build-test alert] BUILD FAILED Windows 2000 msvc debug: classlib over ibmvm Fri, 30 Mar, 01:00
nbe...@kc.rr.com   [build-test alert] BUILD FAILED Windows 2000 msvc debug: classlib over ibmvm Fri, 30 Mar, 01:56
nbe...@kc.rr.com   [build-test alert] BUILD FAILED Windows 2000 msvc debug: classlib over ibmvm Fri, 30 Mar, 02:53
nbe...@kc.rr.com   [build-test alert] BUILD FAILED Windows 2000 msvc debug: classlib over ibmvm Fri, 30 Mar, 03:49
nbe...@kc.rr.com   [build-test alert] BUILD FAILED Windows 2000 msvc debug: classlib over ibmvm Fri, 30 Mar, 04:45
nbe...@kc.rr.com   [build-test alert] BUILD FAILED Windows 2000 msvc debug: classlib over ibmvm Fri, 30 Mar, 05:42
nbe...@kc.rr.com   [build-test alert] BUILD FAILED Windows 2000 msvc debug: classlib over ibmvm Fri, 30 Mar, 06:39
nbe...@kc.rr.com   [build-test alert] BUILD FAILED Windows 2000 msvc debug: classlib over ibmvm Fri, 30 Mar, 07:35
nbe...@kc.rr.com   [build-test alert] BUILD FAILED Windows 2000 msvc debug: classlib over ibmvm Fri, 30 Mar, 08:32
nbe...@kc.rr.com   [build-test alert] BUILD FAILED Windows 2000 msvc debug: classlib over ibmvm Fri, 30 Mar, 09:28
nbe...@kc.rr.com   [build-test alert] BUILD FAILED Windows 2000 msvc debug: classlib over ibmvm Fri, 30 Mar, 10:25
nbe...@kc.rr.com   [build-test alert] BUILD FAILED Windows 2000 msvc debug: classlib over ibmvm Fri, 30 Mar, 11:21
nbe...@kc.rr.com   [build-test alert] BUILD FAILED Windows 2000 msvc debug: classlib over ibmvm Fri, 30 Mar, 12:28
nbe...@kc.rr.com   [build-test alert] BUILD FAILED Windows 2000 msvc debug: classlib over ibmvm Fri, 30 Mar, 13:27
nbe...@kc.rr.com   [build-test alert] BUILD FAILED Windows 2000 msvc debug: classlib over ibmvm Fri, 30 Mar, 14:24
nbe...@kc.rr.com   [build-test alert] BUILD FAILED Windows 2000 msvc debug: classlib over ibmvm Fri, 30 Mar, 15:30
nbe...@kc.rr.com   [build-test alert] BUILD FAILED Windows 2000 msvc debug: classlib over ibmvm Fri, 30 Mar, 16:27
nbe...@kc.rr.com   [build-test alert] BUILD FAILED Windows 2000 msvc debug: classlib over ibmvm Fri, 30 Mar, 17:25
nbe...@kc.rr.com   [build-test alert] BUILD FAILED Windows 2000 msvc debug: classlib over ibmvm Fri, 30 Mar, 18:21
nbe...@kc.rr.com   [build-test alert] BUILD FAILED Windows 2000 msvc debug: classlib over ibmvm Fri, 30 Mar, 19:18
nbe...@kc.rr.com   [build-test alert] BUILD FAILED Windows 2000 msvc debug: classlib over ibmvm Fri, 30 Mar, 20:16
nbe...@kc.rr.com   [build-test alert] BUILD FAILED Windows 2000 msvc debug: classlib over ibmvm Fri, 30 Mar, 21:12
nbe...@kc.rr.com   [build-test alert] BUILD FAILED Windows 2000 msvc debug: classlib over ibmvm Fri, 30 Mar, 23:08
nbe...@kc.rr.com   [build-test alert] BUILD FAILED Windows 2000 msvc debug: classlib over ibmvm Sat, 31 Mar, 00:05
nbe...@kc.rr.com   [build-test alert] BUILD FAILED Windows 2000 msvc debug: classlib over ibmvm Sat, 31 Mar, 01:01
nbe...@kc.rr.com   [build-test alert] BUILD FAILED Windows 2000 msvc debug: classlib over ibmvm Sat, 31 Mar, 01:58
nbe...@kc.rr.com   [build-test alert] BUILD FAILED Windows 2000 msvc debug: classlib over ibmvm Sat, 31 Mar, 02:55
nbe...@kc.rr.com   [build-test alert] BUILD FAILED Windows 2000 msvc debug: classlib over ibmvm Sat, 31 Mar, 03:52
nbe...@kc.rr.com   [build-test alert] BUILD FAILED Windows 2000 msvc debug: classlib over ibmvm Sat, 31 Mar, 04:49
nbe...@kc.rr.com   [build-test alert] BUILD FAILED Windows 2000 msvc debug: classlib over ibmvm Sat, 31 Mar, 05:58
nbe...@kc.rr.com   [build-test alert] BUILD FAILED Windows 2000 msvc debug: classlib over ibmvm Sat, 31 Mar, 06:55
nbe...@kc.rr.com   [build-test alert] BUILD FAILED Windows 2000 msvc debug: classlib over ibmvm Sat, 31 Mar, 07:53
nbe...@kc.rr.com   [build-test alert] BUILD FAILED Windows 2000 msvc debug: classlib over ibmvm Sat, 31 Mar, 08:50
nbe...@kc.rr.com   [build-test alert] BUILD FAILED Windows 2000 msvc debug: classlib over ibmvm Sat, 31 Mar, 09:46
nbe...@kc.rr.com   [build-test alert] BUILD FAILED Windows 2000 msvc debug: classlib over ibmvm Sat, 31 Mar, 10:43
nbe...@kc.rr.com   [build-test alert] BUILD FAILED Windows 2000 msvc debug: classlib over ibmvm Sat, 31 Mar, 11:40
nbe...@kc.rr.com   [build-test alert] BUILD FAILED Windows 2000 msvc debug: classlib over ibmvm Sat, 31 Mar, 12:37
nbe...@kc.rr.com   [build-test alert] BUILD FAILED Windows 2000 msvc debug: classlib over ibmvm Sat, 31 Mar, 13:34
nbe...@kc.rr.com   [build-test alert] BUILD FAILED Windows 2000 msvc debug: classlib over ibmvm Sat, 31 Mar, 14:31
nbe...@kc.rr.com   [build-test alert] BUILD FAILED Windows 2000 msvc debug: classlib over ibmvm Sat, 31 Mar, 15:27
nbe...@kc.rr.com   [build-test alert] BUILD FAILED Windows 2000 msvc debug: classlib over ibmvm Sat, 31 Mar, 16:24
nbe...@kc.rr.com   [build-test alert] BUILD FAILED Windows 2000 msvc debug: classlib over ibmvm Sat, 31 Mar, 17:20
nbe...@kc.rr.com   [build-test alert] BUILD FAILED Windows 2000 msvc debug: classlib over ibmvm Sat, 31 Mar, 18:17
nbe...@kc.rr.com   [build-test alert] BUILD FAILED Windows 2000 msvc debug: classlib over ibmvm Sat, 31 Mar, 19:13
nbe...@kc.rr.com   [build-test alert] BUILD FAILED Windows 2000 msvc debug: classlib over ibmvm Sat, 31 Mar, 20:12
nbe...@kc.rr.com   [build-test alert] BUILD FAILED Windows 2000 msvc debug: classlib over ibmvm Sat, 31 Mar, 21:08
nbe...@kc.rr.com   [build-test alert] BUILD FAILED Windows 2000 msvc debug: classlib over ibmvm Sat, 31 Mar, 22:05
nbe...@kc.rr.com   [build-test alert] BUILD FAILED Windows 2000 msvc debug: classlib over ibmvm Sat, 31 Mar, 23:02
nbe...@kc.rr.com   [build-test alert] BUILD FAILED Windows 2000 msvc debug: classlib over ibmvm Sat, 31 Mar, 23:59
nbe...@kc.rr.com   [build-test alert] BUILD FAILED Windows 2000 msvc debug: classlib over ibmvm Sun, 01 Apr, 00:56
nbe...@kc.rr.com   [build-test alert] BUILD FAILED Windows 2000 msvc debug: classlib over ibmvm Sun, 01 Apr, 01:53
nbe...@kc.rr.com   [build-test alert] BUILD FAILED Windows 2000 msvc debug: classlib over ibmvm Sun, 01 Apr, 02:49
nbe...@kc.rr.com   [build-test alert] BUILD FAILED Windows 2000 msvc debug: classlib over ibmvm Sun, 01 Apr, 03:46
nbe...@kc.rr.com   [build-test alert] BUILD FAILED Windows 2000 msvc debug: classlib over ibmvm Sun, 01 Apr, 04:45
nbe...@kc.rr.com   [build-test alert] BUILD FAILED Windows 2000 msvc debug: classlib over ibmvm Sun, 01 Apr, 05:41
nbe...@kc.rr.com   [build-test alert] BUILD FAILED Windows 2000 msvc debug: classlib over ibmvm Sun, 01 Apr, 06:39
[build-test alert] BUILD FAILED lnx gcc debug: Eclipse Unit Tests
nom...@intel.com   [build-test alert] BUILD FAILED lnx gcc debug: Eclipse Unit Tests Thu, 08 Mar, 09:18
nom...@intel.com   [build-test alert] BUILD FAILED lnx gcc debug: Eclipse Unit Tests Mon, 12 Mar, 12:33
nom...@intel.com   [build-test alert] BUILD FAILED lnx gcc debug: Eclipse Unit Tests Wed, 14 Mar, 14:09
nom...@intel.com   [build-test alert] BUILD FAILED lnx gcc debug: Eclipse Unit Tests Fri, 16 Mar, 15:37
nom...@intel.com   [build-test alert] BUILD FAILED lnx gcc debug: Eclipse Unit Tests Fri, 16 Mar, 21:14
nom...@intel.com   [build-test alert] BUILD FAILED lnx gcc debug: Eclipse Unit Tests Tue, 27 Mar, 17:44
nom...@intel.com   [build-test alert] BUILD FAILED lnx gcc debug: Eclipse Unit Tests Thu, 29 Mar, 08:11
[build-test alert] BUILD FAILED win msvc debug: Eclipse Unit Tests
nom...@intel.com   [build-test alert] BUILD FAILED win msvc debug: Eclipse Unit Tests Mon, 12 Mar, 04:48
nom...@intel.com   [build-test alert] BUILD FAILED win msvc debug: Eclipse Unit Tests Fri, 16 Mar, 09:37
nom...@intel.com   [build-test alert] BUILD FAILED win msvc debug: Eclipse Unit Tests Wed, 28 Mar, 12:32
[continuum] BUILD ERROR: Classlib/linux.ia32 Build/Test
nom...@hursley.ibm.com   [continuum] BUILD ERROR: Classlib/linux.ia32 Build/Test Tue, 13 Mar, 01:15
nom...@hursley.ibm.com   [continuum] BUILD ERROR: Classlib/linux.ia32 Build/Test Tue, 13 Mar, 02:00
nom...@hursley.ibm.com   [continuum] BUILD ERROR: Classlib/linux.ia32 Build/Test Tue, 13 Mar, 04:00
nom...@hursley.ibm.com   [continuum] BUILD ERROR: Classlib/linux.ia32 Build/Test Tue, 13 Mar, 05:00
nom...@hursley.ibm.com   [continuum] BUILD ERROR: Classlib/linux.ia32 Build/Test Tue, 13 Mar, 06:00
nom...@hursley.ibm.com   [continuum] BUILD ERROR: Classlib/linux.ia32 Build/Test Tue, 13 Mar, 07:00
nom...@hursley.ibm.com   [continuum] BUILD ERROR: Classlib/linux.ia32 Build/Test Tue, 13 Mar, 08:00
nom...@hursley.ibm.com   [continuum] BUILD ERROR: Classlib/linux.ia32 Build/Test Mon, 26 Mar, 12:06
[build-test alert] BUILD FAILED WIN XP msvc debug: classlib tests iterative
nom...@intel.com   [build-test alert] BUILD FAILED WIN XP msvc debug: classlib tests iterative Wed, 14 Mar, 17:57
nom...@intel.com   [build-test alert] BUILD FAILED WIN XP msvc debug: classlib tests iterative Thu, 22 Mar, 09:53
nom...@intel.com   [build-test alert] BUILD FAILED WIN XP msvc debug: classlib tests iterative Fri, 23 Mar, 17:21
nom...@intel.com   [build-test alert] BUILD FAILED WIN XP msvc debug: classlib tests iterative Sun, 25 Mar, 01:49
nom...@intel.com   [build-test alert] BUILD FAILED WIN XP msvc debug: classlib tests iterative Mon, 26 Mar, 07:11
nom...@intel.com   [build-test alert] BUILD FAILED WIN XP msvc debug: classlib tests iterative Tue, 27 Mar, 13:30
nom...@intel.com   [build-test alert] BUILD FAILED WIN XP msvc debug: classlib tests iterative Wed, 28 Mar, 21:10
nom...@intel.com   [build-test alert] BUILD FAILED WIN XP msvc debug: classlib tests iterative Fri, 30 Mar, 04:47
nom...@intel.com   [build-test alert] BUILD FAILED WIN XP msvc debug: classlib tests iterative Sat, 31 Mar, 12:25
[build-test alert] BUILD FIXED WIN XP msvc debug: classlib tests iterative
nom...@intel.com   [build-test alert] BUILD FIXED WIN XP msvc debug: classlib tests iterative Fri, 16 Mar, 00:11
nom...@intel.com   [build-test alert] BUILD FIXED WIN XP msvc debug: classlib tests iterative Sat, 17 Mar, 06:28
nom...@intel.com   [build-test alert] BUILD FIXED WIN XP msvc debug: classlib tests iterative Sun, 18 Mar, 13:01
nom...@intel.com   [build-test alert] BUILD FIXED WIN XP msvc debug: classlib tests iterative Mon, 19 Mar, 19:38
nom...@intel.com   [build-test alert] BUILD FIXED WIN XP msvc debug: classlib tests iterative Wed, 21 Mar, 02:40
[build-test alert] BUILD FAILED Linux SUSE9 64bit gcc debug: drlvm
nom...@intel.com   [build-test alert] BUILD FAILED Linux SUSE9 64bit gcc debug: drlvm Sat, 17 Mar, 07:16
nom...@intel.com   [build-test alert] BUILD FAILED Linux SUSE9 64bit gcc debug: drlvm Wed, 28 Mar, 08:35
nom...@intel.com   [build-test alert] BUILD FAILED Linux SUSE9 64bit gcc debug: drlvm Thu, 29 Mar, 07:30
[build-test alert] BUILD FAILED Windows XP ia32 msvc debug: drlvm
nom...@intel.com   [build-test alert] BUILD FAILED Windows XP ia32 msvc debug: drlvm Sat, 17 Mar, 07:16
nom...@intel.com   [build-test alert] BUILD FAILED Windows XP ia32 msvc debug: drlvm Thu, 29 Mar, 06:53
Message list1 · 2 · Next »Thread · Author · Date
Box list
Jul 20113
Dec 201029
Nov 20106
Oct 201046
Sep 201035
Aug 201017
Jul 201029
Jun 201041
May 201020
Apr 201040
Mar 2010102
Feb 201043
Jan 201014
Dec 200911
Nov 20099
Oct 200912
Sep 20093
Aug 200915
Jul 200959
Jun 200916
May 200930
Apr 200960
Mar 200919
Feb 200945
Jan 200957
Dec 200827
Nov 200815
Oct 200824
Sep 200854
Aug 200834
Jul 200841
Jun 200899
May 200862
Apr 2008113
Mar 2008133
Feb 2008164
Jan 2008291
Dec 2007335
Nov 2007454
Oct 2007405
Sep 2007259
Aug 2007368
Jul 2007618
Jun 2007607
May 2007672
Apr 2007455
Mar 20071104
Feb 2007389
Jan 2007418
Dec 200692