harmony-alerts mailing list archives: March 2007

Site index · List index
Message list1 · 2 · 3 · 4 · 5 · 6 · 7 · 8 · 9 · 10 · 11 · 12 · Next »Thread · Author · Date
nom...@intel.com [build-test alert] BUILD FAILED Windows XP SP2 msvc debug: classlib over drlvm Thu, 01 Mar, 08:26
nom...@intel.com [build-test alert] BUILD SUCCEEDED Linux SUSE 9 64bit gcc debug: classlib over drlvm Thu, 01 Mar, 09:03
ge...@apache.org [build-test alert] BUILD FAILED lnx gcc debug: drlvm Thu, 01 Mar, 09:16
ge...@apache.org [build-test alert] BUILD FAILED lnx gcc debug: classlib over drlvm Thu, 01 Mar, 09:16
nom...@intel.com [build-test alert] BUILD SUCCEEDED Windows XP SP2 msvc debug: classlib over drlvm Thu, 01 Mar, 09:22
ge...@apache.org [build-test alert] BUILD SUCCEEDED lnx gcc debug: classlib Thu, 01 Mar, 09:28
nom...@intel.com [build-test alert] BUILD SUCCEEDED Linux SUSE 9 gcc debug: classlib over drlvm Thu, 01 Mar, 09:32
ge...@apache.org [build-test alert] BUILD SUCCEEDED lnx gcc debug: drlvm Thu, 01 Mar, 09:38
ge...@apache.org [build-test alert] BUILD SUCCEEDED lnx gcc debug: classlib over drlvm Thu, 01 Mar, 10:13
nom...@hursley.ibm.com [continuum] BUILD SUCCESSFUL: Classlib/linux.ia32 Build/Test Thu, 01 Mar, 10:15
ge...@apache.org [build-test alert] BUILD SUCCEEDED lnx gcc debug: drlvm Thu, 01 Mar, 11:47
nom...@intel.com [build-test alert] BUILD FIXED SUSEL9 64bit gcc debug: classlib tests iterative Thu, 01 Mar, 11:57
ge...@apache.org [build-test alert] BUILD FAILED lnx gcc debug: drlvm Thu, 01 Mar, 14:40
ge...@apache.org [build-test alert] BUILD SUCCEEDED lnx gcc debug: drlvm Thu, 01 Mar, 17:14
nom...@hursley.ibm.com [continuum] BUILD FAILURE: Classlib/linux.ia32 Build/Test Thu, 01 Mar, 18:22
nom...@hursley.ibm.com [continuum] BUILD SUCCESSFUL: Classlib/linux.ia32 Build/Test Thu, 01 Mar, 21:17
ge...@apache.org [build-test alert] BUILD FAILED lnx gcc debug: drlvm Thu, 01 Mar, 22:37
nom...@intel.com [build-test alert] BUILD FAILED Linux SUSE 9 64bit gcc debug: classlib over drlvm Thu, 01 Mar, 23:22
nom...@frigga.cs.uiuc.edu [build-test alert] BUILD SUCCEEDED lnx gcc debug: classlib Thu, 01 Mar, 23:46
nom...@intel.com [build-test alert] BUILD SUCCEEDED Linux SUSE 9 64bit gcc debug: classlib over drlvm Thu, 01 Mar, 23:58
nom...@frigga.cs.uiuc.edu [build-test alert] BUILD FAILED lnx gcc debug: drlvm Fri, 02 Mar, 04:07
nom...@frigga.cs.uiuc.edu [build-test alert] BUILD SUCCEEDED lnx gcc debug: drlvm Fri, 02 Mar, 04:17
ge...@apache.org [build-test alert] BUILD FAILED lnx gcc debug: drlvm Fri, 02 Mar, 06:29
ge...@apache.org [build-test alert] BUILD SUCCEEDED lnx gcc debug: drlvm Fri, 02 Mar, 06:45
nom...@hursley.ibm.com [continuum] BUILD FAILURE: Classlib/linux.ia32 Build/Test Fri, 02 Mar, 07:22
nom...@intel.com [build-test alert] BUILD FAILED Linux SUSE 9 64bit gcc debug: drlvm reg.test Fri, 02 Mar, 08:29
ge...@apache.org [build-test alert] BUILD SUCCEEDED lnx gcc debug: drlvm Fri, 02 Mar, 08:53
nom...@hursley.ibm.com [continuum] BUILD SUCCESSFUL: Classlib/linux.ia32 Build/Test Fri, 02 Mar, 09:10
ge...@apache.org [build-test alert] BUILD FAILED lnx gcc debug: drlvm Fri, 02 Mar, 09:36
nom...@intel.com [build-test alert] BUILD FAILED SUSEL9 IA32 gcc debug: classlib tests iterative Fri, 02 Mar, 11:12
ge...@apache.org [build-test alert] BUILD SUCCEEDED lnx gcc debug: drlvm Fri, 02 Mar, 12:13
ge...@apache.org [build-test alert] BUILD FAILED lnx gcc debug: drlvm Fri, 02 Mar, 15:09
nom...@intel.com [build-test alert] BUILD FAILED SUSEL9 64bit gcc debug: classlib tests iterative Fri, 02 Mar, 18:00
nom...@frigga.cs.uiuc.edu [build-test alert] BUILD SUCCEEDED lnx gcc debug: classlib over drlvm Fri, 02 Mar, 18:54
ge...@apache.org [build-test alert] BUILD SUCCEEDED lnx gcc debug: drlvm Fri, 02 Mar, 22:26
ge...@apache.org [build-test alert] BUILD FAILED lnx gcc debug: drlvm Sat, 03 Mar, 01:17
ge...@apache.org [build-test alert] BUILD SUCCEEDED lnx gcc debug: drlvm Sat, 03 Mar, 03:50
nom...@frigga.cs.uiuc.edu [build-test alert] BUILD SUCCEEDED lnx gcc debug: drlvm Sat, 03 Mar, 04:45
nom...@intel.com [build-test alert] BUILD FAILED SUSEL9 IA32 gcc debug: classlib tests iterative Sat, 03 Mar, 18:58
nom...@intel.com [build-test alert] BUILD FAILED Windows XP SP2 msvc debug: drlvm reg.test Sat, 03 Mar, 20:43
nom...@intel.com [build-test alert] BUILD FAILED Linux SUSE 9 gcc debug: drlvm reg.test Sat, 03 Mar, 21:01
nom...@intel.com [build-test alert] BUILD FAILED Linux SUSE 9 64bit gcc debug: drlvm tests Sat, 03 Mar, 22:09
nom...@intel.com [build-test alert] BUILD FAILED SUSEL9 64bit gcc debug: classlib tests iterative Sat, 03 Mar, 23:25
ge...@apache.org [build-test alert] BUILD SUCCEEDED lnx gcc debug: classlib over drlvm Sat, 03 Mar, 23:48
nom...@intel.com [build-test alert] BUILD SUCCEEDED Linux SUSE 9 64bit gcc debug: drlvm tests Sat, 03 Mar, 23:59
ge...@apache.org [build-test alert] BUILD FAILED lnx gcc debug: drlvm Sun, 04 Mar, 01:39
ge...@apache.org [build-test alert] BUILD SUCCEEDED lnx gcc debug: drlvm Sun, 04 Mar, 05:48
nom...@intel.com [build-test alert] BUILD FIXED SUSEL9 IA32 gcc debug: classlib tests iterative Mon, 05 Mar, 02:38
nom...@intel.com [build-test alert] BUILD FAILED SUSEL9 64bit gcc debug: classlib tests iterative Mon, 05 Mar, 05:03
nom...@hursley.ibm.com [continuum] BUILD FAILURE: Classlib/linux.ia32 Build/Test Mon, 05 Mar, 05:45
ge...@apache.org [build-test alert] BUILD FAILED lnx gcc debug: classlib over drlvm Mon, 05 Mar, 06:33
ge...@apache.org [build-test alert] BUILD SUCCEEDED lnx gcc debug: classlib over drlvm Mon, 05 Mar, 09:06
nom...@intel.com [build-test alert] BUILD SUCCEEDED Linux SUSE 9 gcc debug: drlvm reg.test Mon, 05 Mar, 10:39
nom...@intel.com [build-test alert] BUILD FAILED Linux SUSE 9 64bit gcc debug: drlvm tests Mon, 05 Mar, 10:59
nom...@intel.com [build-test alert] BUILD SUCCEEDED Windows XP SP2 msvc debug: drlvm reg.test Mon, 05 Mar, 11:09
nom...@intel.com [build-test alert] BUILD FAILED Linux SUSE 9 gcc debug: classlib over drlvm Mon, 05 Mar, 11:13
nom...@intel.com [build-test alert] BUILD FAILED Linux SUSE 9 64bit gcc debug: classlib over drlvm Mon, 05 Mar, 11:30
nom...@hursley.ibm.com [continuum] BUILD SUCCESSFUL: Classlib/linux.ia32 Build/Test Mon, 05 Mar, 11:35
nom...@intel.com [build-test alert] BUILD SUCCEEDED Linux SUSE 9 64bit gcc debug: drlvm reg.test Mon, 05 Mar, 12:06
ge...@apache.org [build-test alert] BUILD FAILED lnx gcc debug: classlib over drlvm Mon, 05 Mar, 13:07
nom...@intel.com [build-test alert] BUILD SUCCEEDED Linux SUSE 9 64bit gcc debug: drlvm tests Mon, 05 Mar, 13:10
ge...@apache.org [build-test alert] BUILD FAILED lnx gcc debug: drlvm Mon, 05 Mar, 15:13
ge...@apache.org [build-test alert] BUILD SUCCEEDED lnx gcc debug: drlvm Mon, 05 Mar, 18:39
ge...@apache.org [build-test alert] BUILD FAILED lnx gcc debug: drlvm Tue, 06 Mar, 09:06
nom...@intel.com [build-test alert] BUILD FAILED SUSEL9 IA32 gcc debug: classlib tests iterative Tue, 06 Mar, 10:00
nom...@intel.com [build-test alert] BUILD FAILED Windows XP SP2 msvc debug: classlib over drlvm Tue, 06 Mar, 10:39
nom...@intel.com [build-test alert] BUILD FIXED SUSEL9 64bit gcc debug: classlib tests iterative Tue, 06 Mar, 10:51
nom...@intel.com [build-test alert] BUILD SUCCEEDED lnx gcc debug: Eclipse Unit Tests Tue, 06 Mar, 11:17
nom...@intel.com [build-test alert] BUILD SUCCEEDED win msvc debug: Eclipse Unit Tests Tue, 06 Mar, 11:54
nom...@intel.com [build-test alert] BUILD FAILED Windows XP SP2 msvc debug: drlvm tests Tue, 06 Mar, 12:02
ge...@apache.org [build-test alert] BUILD FAILED lnx gcc debug: drlvm Tue, 06 Mar, 12:02
nom...@intel.com [build-test alert] BUILD SUCCEEDED Windows XP SP2 msvc debug: classlib over drlvm Tue, 06 Mar, 12:52
nom...@intel.com [build-test alert] BUILD FAILED Linux SUSE 9 64bit gcc debug: drlvm tests Tue, 06 Mar, 13:05
nom...@intel.com [build-test alert] BUILD SUCCEEDED Linux SUSE 9 64bit gcc debug: drlvm tests Tue, 06 Mar, 14:53
ge...@apache.org [build-test alert] BUILD SUCCEEDED lnx gcc debug: drlvm Tue, 06 Mar, 16:07
nom...@intel.com [build-test alert] BUILD SUCCEEDED Windows XP SP2 msvc debug: drlvm tests Tue, 06 Mar, 16:24
nom...@intel.com [build-test alert] BUILD FAILED Linux SUSE 9 64bit gcc debug: drlvm tests Tue, 06 Mar, 18:38
nom...@intel.com [build-test alert] BUILD SUCCEEDED Linux SUSE 9 64bit gcc debug: drlvm tests Tue, 06 Mar, 20:04
ge...@apache.org [build-test alert] BUILD SUCCEEDED lnx gcc debug: drlvm Tue, 06 Mar, 21:16
ge...@apache.org [build-test alert] BUILD FAILED lnx gcc debug: drlvm Wed, 07 Mar, 04:08
ge...@apache.org [build-test alert] BUILD SUCCEEDED lnx gcc debug: drlvm Wed, 07 Mar, 07:24
ge...@apache.org [build-test alert] BUILD FAILED lnx gcc debug: drlvm Wed, 07 Mar, 13:45
nom...@intel.com [build-test alert] BUILD FAILED SUSEL9 64bit gcc debug: classlib tests iterative Wed, 07 Mar, 14:17
ge...@apache.org [build-test alert] BUILD FAILED lnx gcc debug: drlvm Wed, 07 Mar, 14:58
nom...@intel.com [build-test alert] BUILD FAILED SUSEL9 IA32 gcc debug: classlib tests iterative Wed, 07 Mar, 15:00
ge...@apache.org [build-test alert] BUILD SUCCEEDED lnx gcc debug: drlvm Wed, 07 Mar, 15:57
nom...@hursley.ibm.com [continuum] BUILD FAILURE: Classlib/linux.ia32 Build/Test Wed, 07 Mar, 19:16
nom...@intel.com [build-test alert] BUILD FAILED Linux SUSE 9 gcc debug: drlvm test Wed, 07 Mar, 19:55
nom...@intel.com [build-test alert] BUILD SUCCEEDED Linux SUSE 9 gcc debug: drlvm test Wed, 07 Mar, 22:06
ge...@apache.org [build-test alert] BUILD SUCCEEDED lnx gcc debug: drlvm Wed, 07 Mar, 22:31
ge...@apache.org [build-test alert] BUILD FAILED lnx gcc debug: drlvm Thu, 08 Mar, 02:13
nom...@hursley.ibm.com [continuum] BUILD FAILURE: Classlib/linux.ia32 Build/Test Thu, 08 Mar, 04:17
nbe...@kc.rr.com [build-test alert] BUILD SUCCEEDED Windows 2000 msvc debug: classlib Thu, 08 Mar, 04:22
nbe...@kc.rr.com [build-test alert] BUILD FAILED Windows 2000 msvc debug: classlib over ibmvm Thu, 08 Mar, 05:01
nbe...@kc.rr.com [build-test alert] BUILD FAILED Windows 2000 msvc debug: classlib over ibmvm Thu, 08 Mar, 05:48
ge...@apache.org [build-test alert] BUILD SUCCEEDED lnx gcc debug: drlvm Thu, 08 Mar, 05:54
ge...@apache.org [build-test alert] BUILD FAILED lnx gcc debug: drlvm Thu, 08 Mar, 06:13
nbe...@kc.rr.com [build-test alert] BUILD FAILED Windows 2000 msvc debug: classlib over ibmvm Thu, 08 Mar, 06:36
nom...@hursley.ibm.com [continuum] BUILD FAILURE: Classlib/linux.ia32 Build/Test Thu, 08 Mar, 06:53
nbe...@kc.rr.com [build-test alert] BUILD FAILED Windows 2000 msvc debug: classlib over ibmvm Thu, 08 Mar, 07:23
Message list1 · 2 · 3 · 4 · 5 · 6 · 7 · 8 · 9 · 10 · 11 · 12 · Next »Thread · Author · Date
Box list
Jul 20113
Dec 201029
Nov 20106
Oct 201046
Sep 201035
Aug 201017
Jul 201029
Jun 201041
May 201020
Apr 201040
Mar 2010102
Feb 201043
Jan 201014
Dec 200911
Nov 20099
Oct 200912
Sep 20093
Aug 200915
Jul 200959
Jun 200916
May 200930
Apr 200960
Mar 200919
Feb 200945
Jan 200957
Dec 200827
Nov 200815
Oct 200824
Sep 200854
Aug 200834
Jul 200841
Jun 200899
May 200862
Apr 2008113
Mar 2008133
Feb 2008164
Jan 2008291
Dec 2007335
Nov 2007454
Oct 2007405
Sep 2007259
Aug 2007368
Jul 2007618
Jun 2007607
May 2007672
Apr 2007455
Mar 20071104
Feb 2007389
Jan 2007418
Dec 200692