harmony-alerts mailing list archives

Site index · List index
Message view « Date » · « Thread »
Top « Date » · « Thread »
From nom...@hursley.ibm.com
Subject [continuum] BUILD FAILURE: Classlib/linux.ia32 Build/Test
Date Thu, 29 Mar 2007 10:31:20 GMT
Online report : http://people.apache.org/~hindessm/continuum/classlib/linux.ia32/2007/03/29/20070329-103120.failure.log.gz
Build statistics:
  State: Failed
  Previous State: Failed
  Started at: Thu, 29 Mar 2007 10:08:50 +0100
  Finished at: Thu, 29 Mar 2007 11:31:17 +0100
  Total time: 1h 22m 27s
  Build Trigger: Schedule
  Exit code: 1
  Building machine hostname: hy2
  Operating system : Linux(unknown)
  Java version : 1.5.0_06(Sun Microsystems Inc.)

Changes
                            classlib/modules/luni/src/test/java/tests/api/java/net/URLClassLoaderTest.java
        
****************************************************************************
Output:
****************************************************************************
Buildfile: build.xml

svn-prop:

build:
   [delete] Deleting directory /home/hybld/continuum-working-directory/6/classlib/deploy
     [echo] Classlib revision is 523637
     [echo] Post process: true
     [echo] JAPI: true
     [echo] Building with reference jdk/javac
     [exec] Buildfile: build.xml

     [exec] -init-hdk-for-clean:
     [exec]     [mkdir] Created dir: /home/hybld/continuum-working-directory/6/classlib/deploy/build/ant
     [exec]      [copy] Copying 1 file to /home/hybld/continuum-working-directory/6/classlib/deploy/build/ant

     [exec] clean-java:

     [exec] -modules-clean-bin:

     [exec] clean:
     [exec]    [delete] /home/hybld/continuum-working-directory/6/classlib/build/classes not
found.

     [exec] clean:
     [exec]    [delete] /home/hybld/continuum-working-directory/6/classlib/build/classes not
found.

     [exec] clean:
     [exec]    [delete] /home/hybld/continuum-working-directory/6/classlib/build/classes not
found.

     [exec] clean:
     [exec]    [delete] /home/hybld/continuum-working-directory/6/classlib/build/classes not
found.

     [exec] clean-native-includes:
     [exec]    [delete] /home/hybld/continuum-working-directory/6/classlib/deploy/include
not found.

     [exec] clean:
     [exec]    [delete] /home/hybld/continuum-working-directory/6/classlib/build/classes not
found.

     [exec] clean:
     [exec]    [delete] /home/hybld/continuum-working-directory/6/classlib/build/classes not
found.

     [exec] clean:
     [exec]    [delete] /home/hybld/continuum-working-directory/6/classlib/build/classes not
found.

     [exec] clean:
     [exec]    [delete] /home/hybld/continuum-working-directory/6/classlib/build/classes not
found.
     [exec]    [delete] /home/hybld/continuum-working-directory/6/classlib/modules/concurrent/bin/test
not found.

     [exec] clean:
     [exec]    [delete] /home/hybld/continuum-working-directory/6/classlib/build/classes not
found.

     [exec] clean:
     [exec]    [delete] /home/hybld/continuum-working-directory/6/classlib/build/classes not
found.

     [exec] clean:
     [exec]    [delete] /home/hybld/continuum-working-directory/6/classlib/build/classes not
found.

     [exec] clean:
     [exec]    [delete] /home/hybld/continuum-working-directory/6/classlib/build/classes not
found.

     [exec] clean:
     [exec]    [delete] /home/hybld/continuum-working-directory/6/classlib/build/classes not
found.

     [exec] clean:
     [exec]    [delete] /home/hybld/continuum-working-directory/6/classlib/build/classes not
found.

     [exec] clean:
     [exec]    [delete] /home/hybld/continuum-working-directory/6/classlib/build/classes not
found.

     [exec] clean-native-includes:
     [exec]    [delete] /home/hybld/continuum-working-directory/6/classlib/deploy/include
not found.
     [exec]    [delete] /home/hybld/continuum-working-directory/6/classlib/deploy/jdk/include
not found.

     [exec] clean:
     [exec]    [delete] /home/hybld/continuum-working-directory/6/classlib/build/classes not
found.

     [exec] clean:
     [exec]    [delete] /home/hybld/continuum-working-directory/6/classlib/build/classes not
found.

     [exec] clean:
     [exec]    [delete] /home/hybld/continuum-working-directory/6/classlib/build/classes not
found.

     [exec] clean:
     [exec]    [delete] /home/hybld/continuum-working-directory/6/classlib/build/classes not
found.
     [exec]    [delete] /home/hybld/continuum-working-directory/6/classlib/modules/nio/bin/test
not found.

     [exec] clean:
     [exec]    [delete] /home/hybld/continuum-working-directory/6/classlib/build/classes not
found.

     [exec] clean:
     [exec]    [delete] /home/hybld/continuum-working-directory/6/classlib/build/classes not
found.

     [exec] clean-native-includes:
     [exec]    [delete] /home/hybld/continuum-working-directory/6/classlib/deploy/include
not found.

     [exec] clean:

     [exec] clean:
     [exec]    [delete] /home/hybld/continuum-working-directory/6/classlib/build/classes not
found.

     [exec] clean:
     [exec]    [delete] /home/hybld/continuum-working-directory/6/classlib/build/classes not
found.

     [exec] clean:
     [exec]    [delete] /home/hybld/continuum-working-directory/6/classlib/build/classes not
found.

     [exec] clean:
     [exec]    [delete] /home/hybld/continuum-working-directory/6/classlib/build/classes not
found.

     [exec] clean:
     [exec]    [delete] /home/hybld/continuum-working-directory/6/classlib/build/classes not
found.

     [exec] clean:
     [exec]    [delete] /home/hybld/continuum-working-directory/6/classlib/build/classes not
found.

     [exec] clean:
     [exec]    [delete] /home/hybld/continuum-working-directory/6/classlib/build/classes not
found.

     [exec] clean:
     [exec]    [delete] /home/hybld/continuum-working-directory/6/classlib/build/classes not
found.

     [exec] clean:
     [exec]    [delete] /home/hybld/continuum-working-directory/6/classlib/build/classes not
found.

     [exec] clean:
     [exec]    [delete] /home/hybld/continuum-working-directory/6/classlib/build/classes not
found.
     [exec]    [delete] /home/hybld/continuum-working-directory/6/classlib/build/classes not
found.

     [exec] clean:
     [exec]    [delete] /home/hybld/continuum-working-directory/6/classlib/build/classes not
found.

     [exec] clean:
     [exec]    [delete] /home/hybld/continuum-working-directory/6/classlib/build/classes not
found.

     [exec] clean:
     [exec]    [delete] /home/hybld/continuum-working-directory/6/classlib/build/classes not
found.

     [exec] -clean-bin-catch-all-test:

     [exec] -clean-bin-catch-all:

     [exec] -clean-bin:

     [exec] -clean-layout:
     [exec]    [delete] /home/hybld/continuum-working-directory/6/classlib/deploy/jdk not
found.

     [exec] clean:

     [exec] clean-native:

     [exec] copy-makefile-includes:
     [exec]     [mkdir] Created dir: /home/hybld/continuum-working-directory/6/classlib/deploy/build/make
     [exec]      [copy] Copying 12 files to /home/hybld/continuum-working-directory/6/classlib/deploy/build/make

     [exec] -make-clean:

     [exec] -clean-native-tests:
     [exec]      [exec] rm -f ../shared/init.o  ../init  .exp \
     [exec]      [exec]        
     [exec]      [exec] rm -f ../shared/hyerror.o  ../hyerror  .exp \
     [exec]      [exec]        
     [exec]      [exec] rm -f ../shared/hytime.o  ../hytime  .exp \
     [exec]      [exec]        
     [exec]      [exec] rm -f ../shared/hyfile.o  ../hyfile  .exp \
     [exec]      [exec]        

     [exec] clean-native:
     [exec]      [exec] rm -f ../shared/hysig_copyright.o hysiglinux.o hysigunix.o ../libhysig.so
  libhysig.exp \
     [exec]      [exec]        
     [exec]      [exec] rm -f ../shared/thread_copyright.o x86/thrhelp.o x86/thrspinlock.o
../shared/hythread.o ../shared/hythreadinspect.o linuxonexit.o priority.o rasthrsup.o ../shared/rwmutex.o
thrcreate.o thrdsup.o ../shared/thrprof.o ../libhythr.so   libhythr.exp \
     [exec]      [exec]        
     [exec]      [exec] rm -f ../shared/hythread.o ../libhythr.so   libhythr.exp \
     [exec]      [exec]        
     [exec]      [exec] rm -f ../shared/port_copyright.o hycpu.o ../shared/hyerror.o hyerrorhelpers.o
../shared/hyexit.o hyfile.o hyfiletext.o ../shared/hygp.o hyipcmutex.o hymem.o linux/hymmap.o
../shared/hynls.o hynlshelpers.o hyosdump.o ../shared/hyport.o ../shared/hyportcontrol.o hyportptb.o
hysharedhelper.o hyshmem.o hyshsem.o hysl.o hysock.o ../shared/hystr.o ../shared/hystrftime.o
../shared/hystsl.o hysysinfo.o hytime.o ../shared/hytlshelpers.o hytty.o linux/hyvmem.o hysignal.o
linux.x86/hysignal_context.o ../libhyprt.so  /home/hybld/continuum-working-directory/6/classlib/deploy/lib/libhyprt.a
libhyprt.exp \
     [exec]      [exec]        
     [exec]      [exec] rm -f ../shared/libglob.o ../shared/iohelp.o ../shared/exceptions.o
../shared/strhelp.o ../shared/utf8encode.o ../shared/utf8decode.o   /home/hybld/continuum-working-directory/6/classlib/deploy/lib/libhycommon.a
.exp \
     [exec]      [exec]        
     [exec]      [exec] rm -f ../shared/pool.o ../shared/pool_cap.o   /home/hybld/continuum-working-directory/6/classlib/deploy/lib/libhypool.a
.exp \
     [exec]      [exec]        

     [exec] clean-native:
     [exec]      [exec] rm -f ../shared/auth_copyright.o authnix.o ../libhyauth.so   libhyauth.exp
\
     [exec]      [exec]        

     [exec] clean-native:
     [exec]      [exec] rm -f ../shared/zcpool.o ../shared/zipalloc.o ../shared/zipcache.o
../shared/zipsup.o   /home/hybld/continuum-working-directory/6/classlib/deploy/lib/libhyzip.a
.exp \
     [exec]      [exec]        
     [exec]      [exec] rm -f ../shared/zlib_copyright.o ../../zlib_dist/adler32.o ../../zlib_dist/compress.o
../../zlib_dist/crc32.o ../../zlib_dist/deflate.o ../../zlib_dist/infback.o ../../zlib_dist/inffast.o
../../zlib_dist/inflate.o ../../zlib_dist/inftrees.o ../../zlib_dist/trees.o ../../zlib_dist/uncompr.o
../../zlib_dist/zutil.o ../libhyzlib.so   libhyzlib.exp \
     [exec]      [exec]        
     [exec]      [exec] rm -f ../shared/archive_copyright.o ../shared/jclcrc32.o ../shared/zip.o
../shared/adler32.o ../shared/inflater.o ../shared/jarfile.o ../shared/deflater.o ../shared/archiveglob.o
../libhyarchive.so   libhyarchive.exp \
     [exec]      [exec]        

     [exec] clean-native:
     [exec]      [exec] rm -f ../shared/text_copyright.o ../shared/BidiWrapper.o ../libhytext.so
  libhytext.exp \
     [exec]      [exec]        

...

     [exec]     [javac] ----------
     [exec]     [javac] 1. WARNING in /home/hybld/continuum-working-directory/6/classlib/modules/annotation/src/test/java/org/apache/harmony/annotation/tests/java/lang/annotation/IncompleteAnnotationExceptionTest.java
     [exec]     [javac]  (at line 53)
     [exec]     [javac] 	clazz, elementName);
     [exec]     [javac] 	^^^^^
     [exec]     [javac] Type safety: The expression of type Class needs unchecked conversion
to conform to Class<? extends Annotation>
     [exec]     [javac] ----------
     [exec]     [javac] 1 problem (1 warning)

     [exec] prepare-exclude:

...

     [exec]     [junit] Tests run: 43, Failures: 0, Errors: 0, Time elapsed: 0.117 sec
     [exec]     [junit] 2007-03-29 10:24:44.145::INFO:  jetty-6.0.x
     [exec]     [junit] 2007-03-29 10:24:44.147::INFO:  Started SocketConnector @ 0.0.0.0:33311
     [exec]     [junit] Tests run: 44, Failures: 0, Errors: 2, Time elapsed: 379.069 sec
     [exec]     [junit] TEST tests.api.java.net.URLConnectionTest FAILED
     [exec]     [junit] Tests run: 3, Failures: 0, Errors: 0, Time elapsed: 0.005 sec
     [exec]     [junit] Tests run: 1, Failures: 0, Errors: 0, Time elapsed: 0.004 sec
     [exec]     [junit] Tests run: 2, Failures: 0, Errors: 0, Time elapsed: 0.211 sec
     [exec]     [junit] Tests run: 2, Failures: 0, Errors: 0, Time elapsed: 0.004 sec
     [exec]     [junit] Tests run: 6, Failures: 0, Errors: 0, Time elapsed: 0.013 sec

...

     [exec]     [junit] Tests run: 23, Failures: 0, Errors: 0, Time elapsed: 0.119 sec
     [exec]     [junit] Tests run: 19, Failures: 0, Errors: 0, Time elapsed: 0.072 sec
     [exec]     [junit] Tests run: 48, Failures: 0, Errors: 0, Time elapsed: 0.261 sec
     [exec]     [junit] Tests run: 16, Failures: 0, Errors: 0, Time elapsed: 0.335 sec
     [exec]     [junit] Tests FAILED

     [exec] touch-failures-file:

     [exec] touch-errors-file:


...

     [exec]     [junit] org.apache.harmony.rmi.test.MyException: MyRemoteObject.test_Exception
     [exec]     [junit] Done.

     [exec]     [junit] Testing test_Error...
     [exec]     [junit] java.rmi.ServerError: Error occurred while remote method invocation;
nested exception is:
     [exec]     [junit] 	java.lang.Error: MyRemoteObject.test_Error
     [exec]     [junit] Done.

     [exec]     [junit] Testing test_RuntimeException...
     [exec]     [junit] java.lang.RuntimeException: MyRemoteObject.text_RuntimeException
     [exec]     [junit] Done.

...

     [exec]     [junit] org.apache.harmony.rmi.test.MyException: MyRemoteObject.test_Exception
     [exec]     [junit] Done.

     [exec]     [junit] Testing test_Error...
     [exec]     [junit] java.rmi.ServerError: Error occurred while remote method invocation;
nested exception is:
     [exec]     [junit] 	java.lang.Error: MyRemoteObject.test_Error
     [exec]     [junit] Done.

     [exec]     [junit] Testing test_RuntimeException...
     [exec]     [junit] java.lang.RuntimeException: MyRemoteObject.text_RuntimeException
     [exec]     [junit] Done.

...

     [exec]     [junit] Tests run: 12, Failures: 0, Errors: 0, Time elapsed: 0.017 sec
     [exec]     [junit] Tests run: 7, Failures: 0, Errors: 0, Time elapsed: 0.01 sec
     [exec]     [junit] Tests run: 25, Failures: 0, Errors: 0, Time elapsed: 0.039 sec
     [exec]     [junit] Tests run: 2, Failures: 1, Errors: 0, Time elapsed: 10.018 sec
     [exec]     [junit] TEST javax.swing.colorchooser.AbstractColorChooserPanelTest FAILED
     [exec]     [junit] Tests run: 4, Failures: 0, Errors: 0, Time elapsed: 0.007 sec
     [exec]     [junit] Tests run: 1, Failures: 0, Errors: 0, Time elapsed: 0.005 sec
     [exec]     [junit] Tests run: 1, Failures: 0, Errors: 0, Time elapsed: 0.003 sec
     [exec]     [junit] Tests run: 1, Failures: 1, Errors: 0, Time elapsed: 10.007 sec
     [exec]     [junit] TEST javax.swing.event.DocumentEventTest FAILED
     [exec]     [junit] Tests run: 9, Failures: 9, Errors: 0, Time elapsed: 90.024 sec
     [exec]     [junit] TEST javax.swing.event.EventListenerListTest FAILED
     [exec]     [junit] Tests run: 2, Failures: 2, Errors: 0, Time elapsed: 20.009 sec
     [exec]     [junit] TEST javax.swing.event.InternalFrameEventTest FAILED
     [exec]     [junit] Tests run: 4, Failures: 4, Errors: 0, Time elapsed: 40.013 sec
     [exec]     [junit] TEST javax.swing.event.ListDataEventTest FAILED
     [exec]     [junit] Tests run: 5, Failures: 5, Errors: 0, Time elapsed: 50.015 sec
     [exec]     [junit] TEST javax.swing.event.ListSelectionEventTest FAILED
     [exec]     [junit] Tests run: 1, Failures: 0, Errors: 1, Time elapsed: 0 sec
     [exec]     [junit] Tests FAILED (timeout)

     [exec] touch-failures-file:

     [exec] touch-errors-file:


...

     [exec] gen-report:

     [exec] check-test-result:

     [exec] BUILD FAILED
     [exec] /home/hybld/continuum-working-directory/6/classlib/build.xml:167: The following
error occurred while executing this line:
     [exec] /home/hybld/continuum-working-directory/6/classlib/make/build-test.xml:142: There
were test crashes: /home/hybld/continuum-working-directory/6/classlib/build/test_report/TEST-javax.swing.event.MenuKeyEventTest.xml

     [exec] Total time: 66 minutes 53 seconds
     [exec] Result: 1
     [echo] Tests.failed is set to true

japi:

     [exec] Processing class java.lang,Object:+
     [exec] Processing package java.lang,:=============================================================================+-+++++++++++-+++++++++++++-+++++++++++++++++-+++++-+++++++++++++++++++++++-++++--^+^+++++++++--++++++++++

...

     [exec] Processing package java.lang.management,:=============================================================================++++-+++++++++++
     [exec] Processing package java.lang.ref,:=============================================================================+++++
     [exec] Processing package java.lang.reflect,:=============================================================================+++++++++++++++++++++
     [exec] Processing class ,java:
     [exec] Failed to Japize java: java.lang.RuntimeException: NoClassDefFoundError: java
     [exec] java.lang.RuntimeException: NoClassDefFoundError: java
     [exec] 	at net.wuffies.japi.ClassFile.forName(ClassFile.java:163)
     [exec] 	at net.wuffies.japi.Japize.getClassWrapper(Japize.java:1425)
     [exec] 	at net.wuffies.japi.Japize.japizeClass(Japize.java:748)
     [exec] 	at net.wuffies.japi.Japize.processClass(Japize.java:516)

...

     [exec] 	at net.wuffies.japi.Japize.doJapize(Japize.java:443)
     [exec] 	at net.wuffies.japi.Japize.main(Japize.java:316)

     [exec] Processing class ,javax:
     [exec] Failed to Japize javax: java.lang.RuntimeException: NoClassDefFoundError: javax
     [exec] java.lang.RuntimeException: NoClassDefFoundError: javax
     [exec] 	at net.wuffies.japi.ClassFile.forName(ClassFile.java:163)
     [exec] 	at net.wuffies.japi.Japize.getClassWrapper(Japize.java:1425)
     [exec] 	at net.wuffies.japi.Japize.japizeClass(Japize.java:748)
     [exec] 	at net.wuffies.japi.Japize.processClass(Japize.java:516)

...

     [exec] 	at net.wuffies.japi.Japize.doJapize(Japize.java:443)
     [exec] 	at net.wuffies.japi.Japize.main(Japize.java:316)

     [exec] Processing class ,org:
     [exec] Failed to Japize org: java.lang.RuntimeException: NoClassDefFoundError: org
     [exec] java.lang.RuntimeException: NoClassDefFoundError: org
     [exec] 	at net.wuffies.japi.ClassFile.forName(ClassFile.java:163)
     [exec] 	at net.wuffies.japi.Japize.getClassWrapper(Japize.java:1425)
     [exec] 	at net.wuffies.japi.Japize.japizeClass(Japize.java:748)
     [exec] 	at net.wuffies.japi.Japize.processClass(Japize.java:516)

...

update-index:

test-result:

BUILD FAILED
/home/hybld/continuum-working-directory/6/build.xml:204: There were test errors.

Total time: 82 minutes 26 seconds

****************************************************************************

...

Mime
View raw message