harmony-alerts mailing list archives

Site index · List index
Message view « Date » · « Thread »
Top « Date » · « Thread »
From nom...@intel.com
Subject [build-test alert] BUILD FAILED Linux SUSE 9 64bit gcc debug: drlvm tests
Date Tue, 27 Mar 2007 22:16:23 GMT
BUILD FAILED:
	Ant Error Message:
/export/cruise/trunk/cc/projects/drlvm/trunk/build/make/build.xml:373: The following error occurred while executing this line: /export/cruise/trunk/cc/projects/drlvm/trunk/build/make/build_component.xml:72: The following error occurred while executing this line: /export/cruise/trunk/cc/projects/drlvm/trunk/build/lnx_em64t_gcc_debug/semis/build/targets/test.xml:6: Some tests failed

Date of build:	03/28/2007 05:14:49
Time to build:	1 minute 25 seconds
Last changed:	03/28/2007 05:01:28
Last log entry:	drlvm

***********************************************************
Execution log (errors/warnings messages):	
Test SingleStep1.SingleStep1 FAILED
Test VMInit1.VMInit1 FAILED
/export/cruise/trunk/cc/projects/drlvm/trunk/vm/tests/unit/thread/test_native_suspend.c: In function `test_hythread_thread_suspend':
/export/cruise/trunk/cc/projects/drlvm/trunk/vm/tests/unit/thread/test_native_suspend.c:45: warning: passing arg 5 of `hythread_create' from incompatible pointer type
/export/cruise/trunk/cc/projects/drlvm/trunk/vm/tests/unit/thread/test_native_suspend.c:67: warning: cast from pointer to integer of different size
/export/cruise/trunk/cc/projects/drlvm/trunk/vm/tests/unit/thread/test_native_suspend.c: In function `test_hythread_thread_suspend_all':
/export/cruise/trunk/cc/projects/drlvm/trunk/vm/tests/unit/thread/test_native_suspend.c:91: warning: passing arg 5 of `hythread_create' from incompatible pointer type
/export/cruise/trunk/cc/projects/drlvm/trunk/vm/tests/unit/thread/test_native_basic.c: In function `test_hythread_create':
/export/cruise/trunk/cc/projects/drlvm/trunk/vm/tests/unit/thread/test_native_basic.c:56: warning: passing arg 6 of `hythread_create_with_group' from incompatible pointer type
/export/cruise/trunk/cc/projects/drlvm/trunk/vm/tests/unit/thread/test_native_basic.c: In function `test_hythread_iterator':
/export/cruise/trunk/cc/projects/drlvm/trunk/vm/tests/unit/thread/test_native_basic.c:80: warning: passing arg 6 of `hythread_create_with_group' from incompatible pointer type
/export/cruise/trunk/cc/projects/drlvm/trunk/vm/tests/unit/thread/test_native_basic.c:89: warning: int format, different type arg (arg 2)
/export/cruise/trunk/cc/projects/drlvm/trunk/vm/tests/unit/thread/test_native_basic.c: In function `test_hythread_iterator_default':
/export/cruise/trunk/cc/projects/drlvm/trunk/vm/tests/unit/thread/test_native_basic.c:116: warning: passing arg 5 of `hythread_create' from incompatible pointer type
/export/cruise/trunk/cc/projects/drlvm/trunk/vm/tests/unit/thread/test_native_basic.c:125: warning: int format, different type arg (arg 2)
/export/cruise/trunk/cc/projects/drlvm/trunk/vm/tests/unit/thread/test_native_basic.c: In function `test_hythread_create_many':
/export/cruise/trunk/cc/projects/drlvm/trunk/vm/tests/unit/thread/test_native_basic.c:169: warning: passing arg 6 of `hythread_create_with_group' from incompatible pointer type
/export/cruise/trunk/cc/projects/drlvm/trunk/vm/tests/unit/thread/test_native_fat_monitor.c: In function `test_wait_signal':
/export/cruise/trunk/cc/projects/drlvm/trunk/vm/tests/unit/thread/test_native_fat_monitor.c:64: warning: passing arg 5 of `hythread_create' from incompatible pointer type
/export/cruise/trunk/cc/projects/drlvm/trunk/vm/tests/unit/thread/test_java_basic.c: In function `test_jthread_attach':
/export/cruise/trunk/cc/projects/drlvm/trunk/vm/tests/unit/thread/test_java_basic.c:70: warning: passing arg 1 of `tested_os_threads_run' from incompatible pointer type
/export/cruise/trunk/cc/projects/drlvm/trunk/vm/tests/unit/thread/test_java_basic.c: In function `run_for_test_jthread_timed_join':
/export/cruise/trunk/cc/projects/drlvm/trunk/vm/tests/unit/thread/test_java_basic.c:225: warning: unsigned int format, different type arg (arg 2)
/export/cruise/trunk/cc/projects/drlvm/trunk/vm/tests/unit/thread/test_java_basic.c:225: warning: int format, different type arg (arg 3)
/export/cruise/trunk/cc/projects/drlvm/trunk/vm/tests/unit/thread/test_native_thin_monitor.c: In function `test_hythread_thin_monitor_fat_unlock':
/export/cruise/trunk/cc/projects/drlvm/trunk/vm/tests/unit/thread/test_native_thin_monitor.c:111: warning: int format, different type arg (arg 2)
/export/cruise/trunk/cc/projects/drlvm/trunk/vm/tests/unit/thread/test_native_thin_monitor.c:142: warning: passing arg 5 of `hythread_create' from incompatible pointer type
/export/cruise/trunk/cc/projects/drlvm/trunk/vm/tests/unit/thread/test_native_thin_monitor.c:160: warning: passing arg 5 of `hythread_create' from incompatible pointer type
/export/cruise/trunk/cc/projects/drlvm/trunk/vm/tests/unit/thread/test_native_thin_monitor.c:172: warning: cast from pointer to integer of different size
/usr/lib64/gcc-lib/x86_64-suse-linux/3.3.3/../../../../x86_64-suse-linux/bin/ld: warning: libhysig.so, needed by /export/cruise/trunk/cc/projects/classlib/trunk/deploy/jdk/jre/bin/libhyzlib.so, not found (try using -rpath or -rpath-link)
/usr/lib64/gcc-lib/x86_64-suse-linux/3.3.3/../../../../x86_64-suse-linux/bin/ld: warning: libhysig.so, needed by /export/cruise/trunk/cc/projects/classlib/trunk/deploy/jdk/jre/bin/libhyzlib.so, not found (try using -rpath or -rpath-link)
/usr/lib64/gcc-lib/x86_64-suse-linux/3.3.3/../../../../x86_64-suse-linux/bin/ld: warning: libhysig.so, needed by /export/cruise/trunk/cc/projects/classlib/trunk/deploy/jdk/jre/bin/libhyzlib.so, not found (try using -rpath or -rpath-link)
/usr/lib64/gcc-lib/x86_64-suse-linux/3.3.3/../../../../x86_64-suse-linux/bin/ld: warning: libhysig.so, needed by /export/cruise/trunk/cc/projects/classlib/trunk/deploy/jdk/jre/bin/libhyzlib.so, not found (try using -rpath or -rpath-link)
/usr/lib64/gcc-lib/x86_64-suse-linux/3.3.3/../../../../x86_64-suse-linux/bin/ld: warning: libhysig.so, needed by /export/cruise/trunk/cc/projects/classlib/trunk/deploy/jdk/jre/bin/libhyzlib.so, not found (try using -rpath or -rpath-link)
/usr/lib64/gcc-lib/x86_64-suse-linux/3.3.3/../../../../x86_64-suse-linux/bin/ld: warning: libhysig.so, needed by /export/cruise/trunk/cc/projects/classlib/trunk/deploy/jdk/jre/bin/libhyzlib.so, not found (try using -rpath or -rpath-link)
/usr/lib64/gcc-lib/x86_64-suse-linux/3.3.3/../../../../x86_64-suse-linux/bin/ld: warning: libhysig.so, needed by /export/cruise/trunk/cc/projects/classlib/trunk/deploy/jdk/jre/bin/libhyzlib.so, not found (try using -rpath or -rpath-link)
/usr/lib64/gcc-lib/x86_64-suse-linux/3.3.3/../../../../x86_64-suse-linux/bin/ld: warning: libhysig.so, needed by /export/cruise/trunk/cc/projects/classlib/trunk/deploy/jdk/jre/bin/libhyzlib.so, not found (try using -rpath or -rpath-link)
/usr/lib64/gcc-lib/x86_64-suse-linux/3.3.3/../../../../x86_64-suse-linux/bin/ld: warning: libhysig.so, needed by /export/cruise/trunk/cc/projects/classlib/trunk/deploy/jdk/jre/bin/libhyzlib.so, not found (try using -rpath or -rpath-link)
/usr/lib64/gcc-lib/x86_64-suse-linux/3.3.3/../../../../x86_64-suse-linux/bin/ld: warning: libhysig.so, needed by /export/cruise/trunk/cc/projects/classlib/trunk/deploy/jdk/jre/bin/libhyzlib.so, not found (try using -rpath or -rpath-link)
/usr/lib64/gcc-lib/x86_64-suse-linux/3.3.3/../../../../x86_64-suse-linux/bin/ld: warning: libhysig.so, needed by /export/cruise/trunk/cc/projects/classlib/trunk/deploy/jdk/jre/bin/libhyzlib.so, not found (try using -rpath or -rpath-link)
/usr/lib64/gcc-lib/x86_64-suse-linux/3.3.3/../../../../x86_64-suse-linux/bin/ld: warning: libhysig.so, needed by /export/cruise/trunk/cc/projects/classlib/trunk/deploy/jdk/jre/bin/libhyzlib.so, not found (try using -rpath or -rpath-link)
/usr/lib64/gcc-lib/x86_64-suse-linux/3.3.3/../../../../x86_64-suse-linux/bin/ld: warning: libhysig.so, needed by /export/cruise/trunk/cc/projects/classlib/trunk/deploy/jdk/jre/bin/libhyzlib.so, not found (try using -rpath or -rpath-link)
/usr/lib64/gcc-lib/x86_64-suse-linux/3.3.3/../../../../x86_64-suse-linux/bin/ld: warning: libhysig.so, needed by /export/cruise/trunk/cc/projects/classlib/trunk/deploy/jdk/jre/bin/libhyzlib.so, not found (try using -rpath or -rpath-link)
/usr/lib64/gcc-lib/x86_64-suse-linux/3.3.3/../../../../x86_64-suse-linux/bin/ld: warning: libhysig.so, needed by /export/cruise/trunk/cc/projects/classlib/trunk/deploy/jdk/jre/bin/libhyzlib.so, not found (try using -rpath or -rpath-link)
/usr/lib64/gcc-lib/x86_64-suse-linux/3.3.3/../../../../x86_64-suse-linux/bin/ld: warning: libhysig.so, needed by /export/cruise/trunk/cc/projects/classlib/trunk/deploy/jdk/jre/bin/libhyzlib.so, not found (try using -rpath or -rpath-link)
/usr/lib64/gcc-lib/x86_64-suse-linux/3.3.3/../../../../x86_64-suse-linux/bin/ld: warning: libhysig.so, needed by /export/cruise/trunk/cc/projects/classlib/trunk/deploy/jdk/jre/bin/libhyzlib.so, not found (try using -rpath or -rpath-link)
/usr/lib64/gcc-lib/x86_64-suse-linux/3.3.3/../../../../x86_64-suse-linux/bin/ld: warning: libhysig.so, needed by /export/cruise/trunk/cc/projects/classlib/trunk/deploy/jdk/jre/bin/libhyzlib.so, not found (try using -rpath or -rpath-link)
/usr/lib64/gcc-lib/x86_64-suse-linux/3.3.3/../../../../x86_64-suse-linux/bin/ld: warning: libhysig.so, needed by /export/cruise/trunk/cc/projects/classlib/trunk/deploy/jdk/jre/bin/libhyzlib.so, not found (try using -rpath or -rpath-link)
Result: 1
Result: 1
Result: 1
Result: 1
Result: 1
Result: 1
Result: 1
Result: 1
Result: 1
Result: 1
Result: 1
Result: 1
Result: 1
Result: 1
Result: 1
Result: 1
/export/cruise/trunk/cc/projects/drlvm/trunk/vm/tests/smoke/shutdown/TestFatalError.c:7:2: warning: no newline at end of file
/export/cruise/trunk/cc/projects/drlvm/trunk/vm/tests/smoke/shutdown/TestInterrupt.c:24:7: warning: no newline at end of file
Java Result: 1
Java Result: 1
Java Result: 1
Java Result: 1
Java Result: 1
Java Result: 1
Java Result: 1
Java Result: 1
Java Result: 1
Java Result: 1
Java Result: 1
Java Result: 1
Java Result: 1
Java Result: 1
Java Result: 1
Java Result: 1
Java Result: 1
Java Result: 1
Java Result: 1
Java Result: 1
Java Result: 1
Java Result: 1
Java Result: 1
Java Result: 1
Java Result: 1
Java Result: 1
Java Result: 1
Java Result: 1
Java Result: 1
Java Result: 1
Java Result: 1
Java Result: 1
Java Result: 1
Java Result: 1
Java Result: 1
Java Result: 1
Java Result: 1
Java Result: 1
Java Result: 1
Java Result: 1
Java Result: 1
Java Result: 1
Java Result: 1
Java Result: 1
Java Result: 1
Java Result: 1
Java Result: 1
Java Result: 1
Java Result: 1
Java Result: 1
Java Result: 1
Java Result: 1
Java Result: 1
Java Result: 1
Java Result: 1
Java Result: 1
Java Result: 1
Java Result: 1
Java Result: 1
Java Result: 1
Java Result: 1
Java Result: 1
Java Result: 1
Java Result: 1
Java Result: 1
Java Result: 1
Java Result: 1
Java Result: 1
Java Result: 1
Java Result: 1
Java Result: 1
Java Result: 1
Java Result: 1
Java Result: 1
Java Result: 1
Java Result: 1
Java Result: 1
Java Result: 1
Java Result: 1
Java Result: 1
Java Result: 1
Java Result: 1
Java Result: 1
Java Result: 1
Java Result: 1
Java Result: 1
Java Result: 1
Java Result: 1
Java Result: 1
Java Result: 1
Java Result: 1
Java Result: 1
Java Result: 1
Java Result: 1
Java Result: 1
Java Result: 1
Java Result: 1
Java Result: 1
Java Result: 1
Java Result: 1
Java Result: 1
Java Result: 1
Java Result: 1
Java Result: 1
Java Result: 1
Java Result: 1
Java Result: 1
Java Result: 1
Java Result: 1
Java Result: 1
Java Result: 1
Java Result: 1
Java Result: 1
Java Result: 1
Java Result: 1
Java Result: 1
Java Result: 1
Java Result: 1
Java Result: 1
Java Result: 1
Java Result: 1
Java Result: 1
Java Result: 1
Java Result: 1
Java Result: 1
Java Result: 1
Java Result: 1
Java Result: 1
Java Result: 1
Java Result: 1
Java Result: 1
Java Result: 1
Java Result: 1
Java Result: 1
Java Result: 1
Java Result: 1
Java Result: 1
Java Result: 1
Java Result: 1
Java Result: 1
Java Result: 1
Java Result: 1
Java Result: 1
Java Result: 1
Java Result: 1
Java Result: 1
Java Result: 1
Java Result: 1
Java Result: 1
Java Result: 1
Java Result: 1
Java Result: 1
Java Result: 1
Java Result: 1
Java Result: 1
Java Result: 1
Java Result: 1
Java Result: 1
Java Result: 1
Java Result: 1
Java Result: 1
Java Result: 1
Java Result: 1
Java Result: 1
Java Result: 1
Java Result: 1
Java Result: 1
Java Result: 1
Java Result: 1
Java Result: 1
Java Result: 1
Java Result: 1
Java Result: 1
Java Result: 1
Java Result: 1
Java Result: 1
Java Result: 1
Java Result: 1
Java Result: 1
Java Result: 1
Java Result: 1
Java Result: 1
Java Result: 1
Java Result: 1
Java Result: 1
Java Result: 1
Java Result: 1
Java Result: 1
Java Result: 1
Java Result: 1
Java Result: 1
Java Result: 1
Java Result: 1
Java Result: 1
Java Result: 1
Java Result: 1
Java Result: 1
Java Result: 1
Tests FAILED
Tests FAILED
Tests FAILED
 Using CLASSLIB = /export/cruise/trunk/cc/projects/classlib/trunk
jars: true
using proxy settings: proxy.ims.intel.com port:911
Configuration:
    classlib root = /export/cruise/trunk/cc/projects/classlib/trunk
               os = Linux
             arch = em64t
              cxx = gcc
              cfg = debug
       components = deploy
## Compiling JVMTI natives in: /export/cruise/trunk/cc/projects/drlvm/trunk/vm/tests/jvmti/Breakpoint1
## Compiling JVMTI natives in: /export/cruise/trunk/cc/projects/drlvm/trunk/vm/tests/jvmti/SingleStep1
## Compiling JVMTI natives in: /export/cruise/trunk/cc/projects/drlvm/trunk/vm/tests/jvmti/VMInit1

		==================================
		Run JVMTI tests using interpreter
		==================================
		
Running Breakpoint1
java/lang/UnsatisfiedLinkError : Failed loading library "libhytext.so": DSO load failed
Running SingleStep1
java/lang/UnsatisfiedLinkError : Failed loading library "libhytext.so": DSO load failed
Running VMInit1
java/lang/UnsatisfiedLinkError : Failed loading library "libhytext.so": DSO load failed
## Compiling framework...
## Compiling C unit tests
## Linking C unit test: test_java_attrs
## Linking C unit test: test_java_basic
## Linking C unit test: test_java_identify
## Linking C unit test: test_java_interrupt
## Linking C unit test: test_java_monitors
## Linking C unit test: test_java_park
## Linking C unit test: test_java_ptr_conv
## Linking C unit test: test_java_suspend
## Linking C unit test: test_native_basic
## Linking C unit test: test_native_fat_monitor
## Linking C unit test: test_native_suspend
## Linking C unit test: test_native_thin_monitor
## Linking C unit test: test_ti_instrum
## Linking C unit test: test_ti_local_storage
## Linking C unit test: test_ti_monitor_info
## Linking C unit test: test_ti_peak_count
## Linking C unit test: test_ti_raw_monitors
## Linking C unit test: test_ti_state
## Linking C unit test: test_ti_timing
## Executing C unit test: test_java_attrs
INFO: TEST test_jthread_get_priority start
java/lang/UnsatisfiedLinkError : Failed loading library "libhytext.so": DSO load failed
## TEST FAILED
## Executing C unit test: test_java_basic
INFO: TEST test_jthread_attach start
java/lang/UnsatisfiedLinkError : Failed loading library "libhytext.so": DSO load failed
## TEST FAILED
## Executing C unit test: test_java_identify
INFO: TEST test_jthread_self start
java/lang/UnsatisfiedLinkError : Failed loading library "libhytext.so": DSO load failed
## TEST FAILED
## Executing C unit test: test_java_interrupt
INFO: TEST test_jthread_interrupt start
java/lang/UnsatisfiedLinkError : Failed loading library "libhytext.so": DSO load failed
## TEST FAILED
## Executing C unit test: test_java_monitors
INFO: TEST test_jthread_monitor_init start
java/lang/UnsatisfiedLinkError : Failed loading library "libhytext.so": DSO load failed
## TEST FAILED
## Executing C unit test: test_java_park
INFO: TEST test_jthread_park_unpark start
java/lang/UnsatisfiedLinkError : Failed loading library "libhytext.so": DSO load failed
## TEST FAILED
## Executing C unit test: test_java_ptr_conv
INFO: TEST test_jthread_get_java_thread start
java/lang/UnsatisfiedLinkError : Failed loading library "libhytext.so": DSO load failed
## TEST FAILED
## Executing C unit test: test_java_suspend
INFO: TEST test_jthread_suspend_resume start
java/lang/UnsatisfiedLinkError : Failed loading library "libhytext.so": DSO load failed
## TEST FAILED
## Executing C unit test: test_native_basic
INFO: TEST test_hythread_self_base start
java/lang/UnsatisfiedLinkError : Failed loading library "libhytext.so": DSO load failed
## TEST FAILED
## Executing C unit test: test_native_fat_monitor
INFO: TEST test_wait_signal start
java/lang/UnsatisfiedLinkError : Failed loading library "libhytext.so": DSO load failed
## TEST FAILED
## Executing C unit test: test_native_suspend
INFO: TEST test_hythread_thread_suspend start
java/lang/UnsatisfiedLinkError : Failed loading library "libhytext.so": DSO load failed
## TEST FAILED
## Executing C unit test: test_native_thin_monitor
INFO: TEST test_hythread_thin_monitor_enter start
java/lang/UnsatisfiedLinkError : Failed loading library "libhytext.so": DSO load failed
## TEST FAILED
## Executing C unit test: test_ti_instrum
INFO: TEST test_jthread_get_all_threads start
java/lang/UnsatisfiedLinkError : Failed loading library "libhytext.so": DSO load failed
## TEST FAILED
## Executing C unit test: test_ti_local_storage
## TEST PASSED
## Executing C unit test: test_ti_monitor_info
INFO: TEST test_jthread_get_contended_monitor start
java/lang/UnsatisfiedLinkError : Failed loading library "libhytext.so": DSO load failed
## TEST FAILED
## Executing C unit test: test_ti_peak_count
## TEST PASSED
## Executing C unit test: test_ti_raw_monitors
INFO: TEST test_jthread_raw_monitor_create start
java/lang/UnsatisfiedLinkError : Failed loading library "libhytext.so": DSO load failed
## TEST FAILED
## Executing C unit test: test_ti_state
INFO: TEST test_jthread_get_state_6 start
java/lang/UnsatisfiedLinkError : Failed loading library "libhytext.so": DSO load failed
## TEST FAILED
## Executing C unit test: test_ti_timing
## TEST PASSED
## Please find tests and results at /export/cruise/trunk/cc/projects/drlvm/trunk/build/lnx_em64t_gcc_debug/semis/vm/_cunit.tests/
Note: /export/cruise/trunk/cc/projects/drlvm/trunk/vm/tests/smoke/gc/RunFinalizersOnExitTest.java uses or overrides a deprecated API.
Note: Recompile with -Xlint:deprecation for details.
Note: Some input files use unchecked or unsafe operations.
Note: Recompile with -Xlint:unchecked for details.
Compiling /export/cruise/trunk/cc/projects/drlvm/trunk/build/lnx_em64t_gcc_debug/semis/vm/_smoke.tests/natives/shutdown/TestDaemonOnWait
Compiling /export/cruise/trunk/cc/projects/drlvm/trunk/build/lnx_em64t_gcc_debug/semis/vm/_smoke.tests/natives/shutdown/TestFatalError
Compiling /export/cruise/trunk/cc/projects/drlvm/trunk/build/lnx_em64t_gcc_debug/semis/vm/_smoke.tests/natives/shutdown/TestInterrupt

        ==================================
        Smoke tests on Client mode JIT (default)
        ==================================
        

Using exclude file = /export/cruise/trunk/cc/projects/drlvm/trunk/build/make/excludes/exclude.drlvm_smoke.linux.x86_64.jit   
        
Check.java
PerfCheck.java

# HARMONY-3338
gc/LOS.java
gc/MultiThreads.java
perf/MultiThreadsSimple.java

# HARMONY-2972
StackTest.java
exception/FinalizeStackTest.java
stress/Stack.java

# fails on Ubuntu6 x86_64
gc/Mark.java

# HARMONY-2772 fails intermittently 
stress/Mix.java

# HARMONY-3495 hangs intermittently
gc/NPE.java

                  
Running test : Hi
*** FAILED **** : Hi
Running test : classloader.ClassTestGetDeclaringClass
*** FAILED **** : classloader.ClassTestGetDeclaringClass
Running test : classloader.ExceptionInInitializerTest
*** FAILED **** : classloader.ExceptionInInitializerTest
Running test : classloader.LogLoader
*** FAILED **** : classloader.LogLoader
Running test : classloader.NotFound
*** FAILED **** : classloader.NotFound
Running test : classloader.StressLoader
*** FAILED **** : classloader.StressLoader
Running test : exception.ExceptionStackTest
*** FAILED **** : exception.ExceptionStackTest
Running test : exception.NPE
*** FAILED **** : exception.NPE
Running test : gc.FinAlloc
*** FAILED **** : gc.FinAlloc
Running test : gc.Finalizer
*** FAILED **** : gc.Finalizer
Running test : gc.Force
*** FAILED **** : gc.Force
Running test : gc.Fragment
*** FAILED **** : gc.Fragment
Running test : gc.Free
*** FAILED **** : gc.Free
Running test : gc.List
*** FAILED **** : gc.List
Running test : gc.PhantomReferenceQueueTest
*** FAILED **** : gc.PhantomReferenceQueueTest
Running test : gc.PhantomReferenceTest
*** FAILED **** : gc.PhantomReferenceTest
Running test : gc.RefRemove
*** FAILED **** : gc.RefRemove
Running test : gc.RunFinalizersOnExitTest
*** FAILED **** : gc.RunFinalizersOnExitTest
Running test : gc.StressRef
*** FAILED **** : gc.StressRef
Running test : gc.SynchronizedFinilazersTest
*** FAILED **** : gc.SynchronizedFinilazersTest
Running test : gc.ThreadSuspension
*** FAILED **** : gc.ThreadSuspension
Running test : gc.WeakReferenceTest
*** FAILED **** : gc.WeakReferenceTest
Running test : init.ErrorInInitializer
*** FAILED **** : init.ErrorInInitializer
Running test : init.Other
*** FAILED **** : init.Other
Running test : io.ArrayList
*** FAILED **** : io.ArrayList
Running test : io.Integers
*** FAILED **** : io.Integers
Running test : jni.LoadLibrary
*** FAILED **** : jni.LoadLibrary
Running test : outofmemory.Double
*** FAILED **** : outofmemory.Double
Running test : outofmemory.Int
*** FAILED **** : outofmemory.Int
Running test : outofmemory.Plain
*** FAILED **** : outofmemory.Plain
Running test : outofmemory.Ref
*** FAILED **** : outofmemory.Ref
Running test : outofmemory.Throw
*** FAILED **** : outofmemory.Throw
Running test : outofmemory.Vector
*** FAILED **** : outofmemory.Vector
Running test : outofmemory.VectorDouble
*** FAILED **** : outofmemory.VectorDouble
Running test : outofmemory.VectorInt
*** FAILED **** : outofmemory.VectorInt
Running test : outofmemory.VectorRef
*** FAILED **** : outofmemory.VectorRef
Running test : perf.CreateManyExceptions
*** FAILED **** : perf.CreateManyExceptions
Running test : perf.CreateManyExceptions_depth
*** FAILED **** : perf.CreateManyExceptions_depth
Running test : perf.SeveralThreads
*** FAILED **** : perf.SeveralThreads
Running test : perf.StressCornerSize
*** FAILED **** : perf.StressCornerSize
Running test : perf.StressCornerSize_a
*** FAILED **** : perf.StressCornerSize_a
Running test : perf.ThrowMany
*** FAILED **** : perf.ThrowMany
Running test : perf.ThrowManyExceptions
*** FAILED **** : perf.ThrowManyExceptions
Running test : perf.ThrowManyExceptions_depth
*** FAILED **** : perf.ThrowManyExceptions_depth
Running test : perf.ThrowMany_depth
*** FAILED **** : perf.ThrowMany_depth
Running test : reflect.GetMethod
*** FAILED **** : reflect.GetMethod
Running test : shutdown.TestDaemonOnWait
*** FAILED **** : shutdown.TestDaemonOnWait
Running test : shutdown.TestFatalError
*** FAILED **** : shutdown.TestFatalError
Running test : shutdown.TestInterrupt
*** FAILED **** : shutdown.TestInterrupt
Running test : shutdown.TestLock
*** FAILED **** : shutdown.TestLock
Running test : stress.BigStringBuffer
*** FAILED **** : stress.BigStringBuffer
Running test : stress.Finalizer
*** FAILED **** : stress.Finalizer
Running test : stress.Sync
*** FAILED **** : stress.Sync
Running test : stress.Threads
*** FAILED **** : stress.Threads
Running test : stress.Vector
*** FAILED **** : stress.Vector
Running test : stress.WeakHashmapTest
*** FAILED **** : stress.WeakHashmapTest
Running test : thread.ExitShutdownHook
*** FAILED **** : thread.ExitShutdownHook
Running test : thread.InfiniteFinalizer
*** FAILED **** : thread.InfiniteFinalizer
Running test : thread.Sleep
*** FAILED **** : thread.Sleep
Running test : thread.ThreadInterrupt
*** FAILED **** : thread.ThreadInterrupt
Running test : thread.ThreadOOM
*** FAILED **** : thread.ThreadOOM
Running test : util.Date
*** FAILED **** : util.Date
Running test : util.DoPriveleged
*** FAILED **** : util.DoPriveleged
Running test : util.Prop
*** FAILED **** : util.Prop
Running test : util.StringIntern
*** FAILED **** : util.StringIntern
Please find test classes and results at /export/cruise/trunk/cc/projects/drlvm/trunk/build/lnx_em64t_gcc_debug/semis/vm/_smoke.tests/

        ==================================
        Smoke tests on jitrino.OPT
        ==================================
        

Using exclude file = /export/cruise/trunk/cc/projects/drlvm/trunk/build/make/excludes/exclude.drlvm_smoke.linux.x86_64.opt   
        
Check.java
PerfCheck.java

# HARMONY-3338
gc/LOS.java
gc/MultiThreads.java
perf/MultiThreadsSimple.java

# HARMONY-3349
gc/Finalizer.java
gc/RunFinalizersOnExitTest.java

# HARMONY-2972
StackTest.java
exception/FinalizeStackTest.java
stress/Stack.java

# fails on Ubuntu6 x86_64
gc/Mark.java

# HARMONY-2772 
stress/Mix.java

# HARMONY-3299 intermittent
stress/Sync.java

# HARMONY-3495 hangs intermittently
gc/NPE.java

                  
Running test : Hi
*** FAILED **** : Hi
Running test : classloader.ClassTestGetDeclaringClass
*** FAILED **** : classloader.ClassTestGetDeclaringClass
Running test : classloader.ExceptionInInitializerTest
*** FAILED **** : classloader.ExceptionInInitializerTest
Running test : classloader.LogLoader
*** FAILED **** : classloader.LogLoader
Running test : classloader.NotFound
*** FAILED **** : classloader.NotFound
Running test : classloader.StressLoader
*** FAILED **** : classloader.StressLoader
Running test : exception.ExceptionStackTest
*** FAILED **** : exception.ExceptionStackTest
Running test : exception.NPE
*** FAILED **** : exception.NPE
Running test : gc.FinAlloc
*** FAILED **** : gc.FinAlloc
Running test : gc.Force
*** FAILED **** : gc.Force
Running test : gc.Fragment
*** FAILED **** : gc.Fragment
Running test : gc.Free
*** FAILED **** : gc.Free
Running test : gc.List
*** FAILED **** : gc.List
Running test : gc.PhantomReferenceQueueTest
*** FAILED **** : gc.PhantomReferenceQueueTest
Running test : gc.PhantomReferenceTest
*** FAILED **** : gc.PhantomReferenceTest
Running test : gc.RefRemove
*** FAILED **** : gc.RefRemove
Running test : gc.StressRef
*** FAILED **** : gc.StressRef
Running test : gc.SynchronizedFinilazersTest
*** FAILED **** : gc.SynchronizedFinilazersTest
Running test : gc.ThreadSuspension
*** FAILED **** : gc.ThreadSuspension
Running test : gc.WeakReferenceTest
*** FAILED **** : gc.WeakReferenceTest
Running test : init.ErrorInInitializer
*** FAILED **** : init.ErrorInInitializer
Running test : init.Other
*** FAILED **** : init.Other
Running test : io.ArrayList
*** FAILED **** : io.ArrayList
Running test : io.Integers
*** FAILED **** : io.Integers
Running test : jni.LoadLibrary
*** FAILED **** : jni.LoadLibrary
Running test : outofmemory.Double
*** FAILED **** : outofmemory.Double
Running test : outofmemory.Int
*** FAILED **** : outofmemory.Int
Running test : outofmemory.Plain
*** FAILED **** : outofmemory.Plain
Running test : outofmemory.Ref
*** FAILED **** : outofmemory.Ref
Running test : outofmemory.Throw
*** FAILED **** : outofmemory.Throw
Running test : outofmemory.Vector
*** FAILED **** : outofmemory.Vector
Running test : outofmemory.VectorDouble
*** FAILED **** : outofmemory.VectorDouble
Running test : outofmemory.VectorInt
*** FAILED **** : outofmemory.VectorInt
Running test : outofmemory.VectorRef
*** FAILED **** : outofmemory.VectorRef
Running test : perf.CreateManyExceptions
*** FAILED **** : perf.CreateManyExceptions
Running test : perf.CreateManyExceptions_depth
*** FAILED **** : perf.CreateManyExceptions_depth
Running test : perf.SeveralThreads
*** FAILED **** : perf.SeveralThreads
Running test : perf.StressCornerSize
*** FAILED **** : perf.StressCornerSize
Running test : perf.StressCornerSize_a
*** FAILED **** : perf.StressCornerSize_a
Running test : perf.ThrowMany
*** FAILED **** : perf.ThrowMany
Running test : perf.ThrowManyExceptions
*** FAILED **** : perf.ThrowManyExceptions
Running test : perf.ThrowManyExceptions_depth
*** FAILED **** : perf.ThrowManyExceptions_depth
Running test : perf.ThrowMany_depth
*** FAILED **** : perf.ThrowMany_depth
Running test : reflect.GetMethod
*** FAILED **** : reflect.GetMethod
Running test : shutdown.TestDaemonOnWait
*** FAILED **** : shutdown.TestDaemonOnWait
Running test : shutdown.TestFatalError
*** FAILED **** : shutdown.TestFatalError
Running test : shutdown.TestInterrupt
*** FAILED **** : shutdown.TestInterrupt
Running test : shutdown.TestLock
*** FAILED **** : shutdown.TestLock
Running test : stress.BigStringBuffer
*** FAILED **** : stress.BigStringBuffer
Running test : stress.Finalizer
*** FAILED **** : stress.Finalizer
Running test : stress.Threads
*** FAILED **** : stress.Threads
Running test : stress.Vector
*** FAILED **** : stress.Vector
Running test : stress.WeakHashmapTest
*** FAILED **** : stress.WeakHashmapTest
Running test : thread.ExitShutdownHook
*** FAILED **** : thread.ExitShutdownHook
Running test : thread.InfiniteFinalizer
*** FAILED **** : thread.InfiniteFinalizer
Running test : thread.Sleep
*** FAILED **** : thread.Sleep
Running test : thread.ThreadInterrupt
*** FAILED **** : thread.ThreadInterrupt
Running test : thread.ThreadOOM
*** FAILED **** : thread.ThreadOOM
Running test : util.Date
*** FAILED **** : util.Date
Running test : util.DoPriveleged
*** FAILED **** : util.DoPriveleged
Running test : util.Prop
*** FAILED **** : util.Prop
Running test : util.StringIntern
*** FAILED **** : util.StringIntern
Please find test classes and results at /export/cruise/trunk/cc/projects/drlvm/trunk/build/lnx_em64t_gcc_debug/semis/vm/_smoke.tests/

        ==================================
        Smoke tests on interpreter
        ==================================
        

Using exclude file = /export/cruise/trunk/cc/projects/drlvm/trunk/build/make/excludes/exclude.drlvm_smoke.linux.x86_64.int   
        
Check.java
PerfCheck.java

# slow
gc/Mark.java

# HARMONY-2977
io/Integers.java

# HARMONY-2772 fails intermittently 
stress/Mix.java

                  
Running test : Hi
*** FAILED **** : Hi
Running test : StackTest
*** FAILED **** : StackTest
Running test : classloader.ClassTestGetDeclaringClass
*** FAILED **** : classloader.ClassTestGetDeclaringClass
Running test : classloader.ExceptionInInitializerTest
*** FAILED **** : classloader.ExceptionInInitializerTest
Running test : classloader.LogLoader
*** FAILED **** : classloader.LogLoader
Running test : classloader.NotFound
*** FAILED **** : classloader.NotFound
Running test : classloader.StressLoader
*** FAILED **** : classloader.StressLoader
Running test : exception.ExceptionStackTest
*** FAILED **** : exception.ExceptionStackTest
Running test : exception.FinalizeStackTest
*** FAILED **** : exception.FinalizeStackTest
Running test : exception.NPE
*** FAILED **** : exception.NPE
Running test : gc.FinAlloc
*** FAILED **** : gc.FinAlloc
Running test : gc.Finalizer
*** FAILED **** : gc.Finalizer
Running test : gc.Force
*** FAILED **** : gc.Force
Running test : gc.Fragment
*** FAILED **** : gc.Fragment
Running test : gc.Free
*** FAILED **** : gc.Free
Running test : gc.LOS
*** FAILED **** : gc.LOS
Running test : gc.List
*** FAILED **** : gc.List
Running test : gc.MultiThreads
*** FAILED **** : gc.MultiThreads
Running test : gc.NPE
*** FAILED **** : gc.NPE
Running test : gc.PhantomReferenceQueueTest
*** FAILED **** : gc.PhantomReferenceQueueTest
Running test : gc.PhantomReferenceTest
*** FAILED **** : gc.PhantomReferenceTest
Running test : gc.RefRemove
*** FAILED **** : gc.RefRemove
Running test : gc.RunFinalizersOnExitTest
*** FAILED **** : gc.RunFinalizersOnExitTest
Running test : gc.StressRef
*** FAILED **** : gc.StressRef
Running test : gc.SynchronizedFinilazersTest
*** FAILED **** : gc.SynchronizedFinilazersTest
Running test : gc.ThreadSuspension
*** FAILED **** : gc.ThreadSuspension
Running test : gc.WeakReferenceTest
*** FAILED **** : gc.WeakReferenceTest
Running test : init.ErrorInInitializer
*** FAILED **** : init.ErrorInInitializer
Running test : init.Other
*** FAILED **** : init.Other
Running test : io.ArrayList
*** FAILED **** : io.ArrayList
Running test : jni.LoadLibrary
*** FAILED **** : jni.LoadLibrary
Running test : outofmemory.Double
*** FAILED **** : outofmemory.Double
Running test : outofmemory.Int
*** FAILED **** : outofmemory.Int
Running test : outofmemory.Plain
*** FAILED **** : outofmemory.Plain
Running test : outofmemory.Ref
*** FAILED **** : outofmemory.Ref
Running test : outofmemory.Throw
*** FAILED **** : outofmemory.Throw
Running test : outofmemory.Vector
*** FAILED **** : outofmemory.Vector
Running test : outofmemory.VectorDouble
*** FAILED **** : outofmemory.VectorDouble
Running test : outofmemory.VectorInt
*** FAILED **** : outofmemory.VectorInt
Running test : outofmemory.VectorRef
*** FAILED **** : outofmemory.VectorRef
Running test : perf.CreateManyExceptions
*** FAILED **** : perf.CreateManyExceptions
Running test : perf.CreateManyExceptions_depth
*** FAILED **** : perf.CreateManyExceptions_depth
Running test : perf.MultiThreadsSimple
*** FAILED **** : perf.MultiThreadsSimple
Running test : perf.SeveralThreads
*** FAILED **** : perf.SeveralThreads
Running test : perf.StressCornerSize
*** FAILED **** : perf.StressCornerSize
Running test : perf.StressCornerSize_a
*** FAILED **** : perf.StressCornerSize_a
Running test : perf.ThrowMany
*** FAILED **** : perf.ThrowMany
Running test : perf.ThrowManyExceptions
*** FAILED **** : perf.ThrowManyExceptions
Running test : perf.ThrowManyExceptions_depth
*** FAILED **** : perf.ThrowManyExceptions_depth
Running test : perf.ThrowMany_depth
*** FAILED **** : perf.ThrowMany_depth
Running test : reflect.GetMethod
*** FAILED **** : reflect.GetMethod
Running test : shutdown.TestDaemonOnWait
*** FAILED **** : shutdown.TestDaemonOnWait
Running test : shutdown.TestFatalError
*** FAILED **** : shutdown.TestFatalError
Running test : shutdown.TestInterrupt
*** FAILED **** : shutdown.TestInterrupt
Running test : shutdown.TestLock
*** FAILED **** : shutdown.TestLock
Running test : stress.BigStringBuffer
*** FAILED **** : stress.BigStringBuffer
Running test : stress.Finalizer
*** FAILED **** : stress.Finalizer
Running test : stress.Stack
*** FAILED **** : stress.Stack
Running test : stress.Sync
*** FAILED **** : stress.Sync
Running test : stress.Threads
*** FAILED **** : stress.Threads
Running test : stress.Vector
*** FAILED **** : stress.Vector
Running test : stress.WeakHashmapTest
*** FAILED **** : stress.WeakHashmapTest
Running test : thread.ExitShutdownHook
*** FAILED **** : thread.ExitShutdownHook
Running test : thread.InfiniteFinalizer
*** FAILED **** : thread.InfiniteFinalizer
Running test : thread.Sleep
*** FAILED **** : thread.Sleep
Running test : thread.ThreadInterrupt
*** FAILED **** : thread.ThreadInterrupt
Running test : thread.ThreadOOM
*** FAILED **** : thread.ThreadOOM
Running test : util.Date
*** FAILED **** : util.Date
Running test : util.DoPriveleged
*** FAILED **** : util.DoPriveleged
Running test : util.Prop
*** FAILED **** : util.Prop
Running test : util.StringIntern
*** FAILED **** : util.StringIntern
Please find test classes and results at /export/cruise/trunk/cc/projects/drlvm/trunk/build/lnx_em64t_gcc_debug/semis/vm/_smoke.tests/
The test report is in /export/cruise/trunk/cc/projects/drlvm/trunk/build/lnx_em64t_gcc_debug/semis/vm/_smoke.tests/reports/html/index.html
Note: Some input files use or override a deprecated API.
Note: Recompile with -Xlint:deprecation for details.
Note: /export/cruise/trunk/cc/projects/drlvm/trunk/vm/tests/kernel/java/lang/ClassAnnotationsTest.java uses unchecked or unsafe operations.
Note: Recompile with -Xlint:unchecked for details.

        ==================================
        Run kernel tests using Client mode JIT (default)
        ==================================
        

Using exclude file = /export/cruise/trunk/cc/projects/drlvm/trunk/build/make/excludes/exclude.drlvm_kernel.linux.x86_64.jit   
        
## These tests are too slow
java/lang/RuntimeAdditionalTest*.java

## Tese tests are unstable and hang often
java/lang/RuntimeAdditionalTest11.java
java/lang/RuntimeAdditionalTest34.java
java/lang/RuntimeAdditionalTest39.java
java/lang/RuntimeAdditionalTest40.java
java/lang/RuntimeAdditionalTest41.java
java/lang/RuntimeAdditionalTest42.java

                  
java/lang/UnsatisfiedLinkError : Failed loading library "libhytext.so": DSO load failed

        ==================================
        Run kernel tests using jitrino.OPT
        ==================================
        

Using exclude file = /export/cruise/trunk/cc/projects/drlvm/trunk/build/make/excludes/exclude.drlvm_kernel.linux.x86_64.opt   
        
## These tests are too slow
java/lang/RuntimeAdditionalTest*.java

## Tese tests are unstable and hang often
java/lang/RuntimeAdditionalTest11.java
java/lang/RuntimeAdditionalTest34.java
java/lang/RuntimeAdditionalTest39.java
java/lang/RuntimeAdditionalTest40.java
java/lang/RuntimeAdditionalTest41.java
java/lang/RuntimeAdditionalTest42.java

                  
java/lang/UnsatisfiedLinkError : Failed loading library "libhytext.so": DSO load failed

        ==================================
        Run kernel tests using interpreter
        ==================================
        

Using exclude file = /export/cruise/trunk/cc/projects/drlvm/trunk/build/make/excludes/exclude.drlvm_kernel.linux.x86_64.int   
        
## These tests are too slow
java/lang/RuntimeAdditionalTest*.java

## Tese tests are unstable and hang often
java/lang/RuntimeAdditionalTest11.java
java/lang/RuntimeAdditionalTest34.java
java/lang/RuntimeAdditionalTest39.java
java/lang/RuntimeAdditionalTest40.java
java/lang/RuntimeAdditionalTest41.java
java/lang/RuntimeAdditionalTest42.java

java/lang/ClassGenericsTest.java
java/lang/ClassGenericsTest4.java

                  
java/lang/UnsatisfiedLinkError : Failed loading library "libhytext.so": DSO load failed
  ***************************
  *** Kernel tests status ***
  ***************************
      Client mode JIT (default) FAILED
      jitrino.OPT FAILED
      interpreter FAILED
Please find detailed results under /export/cruise/trunk/cc/projects/drlvm/trunk/build/lnx_em64t_gcc_debug/semis/kernel.tests/reports directory.

***********************************************************
Unit Tests: (217)
        
error: test test_java_attrs
error: test test_java_basic
error: test test_java_identify
error: test test_java_interrupt
error: test test_java_monitors
error: test test_java_park
error: test test_java_ptr_conv
error: test test_java_suspend
error: test test_native_basic
error: test test_native_fat_monitor
error: test test_native_suspend
error: test test_native_thin_monitor
error: test test_ti_instrum
error: test test_ti_monitor_info
error: test test_ti_raw_monitors
error: test test_ti_state
error: test Hi_int
error: test Hi_jit
error: test Hi_opt
error: test StackTest_int
error: test classloader.ClassTestGetDeclaringClass_int
error: test classloader.ClassTestGetDeclaringClass_jit
error: test classloader.ClassTestGetDeclaringClass_opt
error: test classloader.ExceptionInInitializerTest_int
error: test classloader.ExceptionInInitializerTest_jit
error: test classloader.ExceptionInInitializerTest_opt
error: test classloader.LogLoader_int
error: test classloader.LogLoader_jit
error: test classloader.LogLoader_opt
error: test classloader.NotFound_int
error: test classloader.NotFound_jit
error: test classloader.NotFound_opt
error: test classloader.StressLoader_int
error: test classloader.StressLoader_jit
error: test classloader.StressLoader_opt
error: test exception.ExceptionStackTest_int
error: test exception.ExceptionStackTest_jit
error: test exception.ExceptionStackTest_opt
error: test exception.FinalizeStackTest_int
error: test exception.NPE_int
error: test exception.NPE_jit
error: test exception.NPE_opt
error: test gc.FinAlloc_int
error: test gc.FinAlloc_jit
error: test gc.FinAlloc_opt
error: test gc.Finalizer_int
error: test gc.Finalizer_jit
error: test gc.Force_int
error: test gc.Force_jit
error: test gc.Force_opt
error: test gc.Fragment_int
error: test gc.Fragment_jit
error: test gc.Fragment_opt
error: test gc.Free_int
error: test gc.Free_jit
error: test gc.Free_opt
error: test gc.LOS_int
error: test gc.List_int
error: test gc.List_jit
error: test gc.List_opt
error: test gc.MultiThreads_int
error: test gc.NPE_int
error: test gc.PhantomReferenceQueueTest_int
error: test gc.PhantomReferenceQueueTest_jit
error: test gc.PhantomReferenceQueueTest_opt
error: test gc.PhantomReferenceTest_int
error: test gc.PhantomReferenceTest_jit
error: test gc.PhantomReferenceTest_opt
error: test gc.RefRemove_int
error: test gc.RefRemove_jit
error: test gc.RefRemove_opt
error: test gc.RunFinalizersOnExitTest_int
error: test gc.RunFinalizersOnExitTest_jit
error: test gc.StressRef_int
error: test gc.StressRef_jit
error: test gc.StressRef_opt
error: test gc.SynchronizedFinilazersTest_int
error: test gc.SynchronizedFinilazersTest_jit
error: test gc.SynchronizedFinilazersTest_opt
error: test gc.ThreadSuspension_int
error: test gc.ThreadSuspension_jit
error: test gc.ThreadSuspension_opt
error: test gc.WeakReferenceTest_int
error: test gc.WeakReferenceTest_jit
error: test gc.WeakReferenceTest_opt
error: test init.ErrorInInitializer_int
error: test init.ErrorInInitializer_jit
error: test init.ErrorInInitializer_opt
error: test init.Other_int
error: test init.Other_jit
error: test init.Other_opt
error: test io.ArrayList_int
error: test io.ArrayList_jit
error: test io.ArrayList_opt
error: test io.Integers_jit
error: test io.Integers_opt
error: test jni.LoadLibrary_int
error: test jni.LoadLibrary_jit
error: test jni.LoadLibrary_opt
error: test outofmemory.Double_int
error: test outofmemory.Double_jit
error: test outofmemory.Double_opt
error: test outofmemory.Int_int
error: test outofmemory.Int_jit
error: test outofmemory.Int_opt
error: test outofmemory.Plain_int
error: test outofmemory.Plain_jit
error: test outofmemory.Plain_opt
error: test outofmemory.Ref_int
error: test outofmemory.Ref_jit
error: test outofmemory.Ref_opt
error: test outofmemory.Throw_int
error: test outofmemory.Throw_jit
error: test outofmemory.Throw_opt
error: test outofmemory.VectorDouble_int
error: test outofmemory.VectorDouble_jit
error: test outofmemory.VectorDouble_opt
error: test outofmemory.VectorInt_int
error: test outofmemory.VectorInt_jit
error: test outofmemory.VectorInt_opt
error: test outofmemory.VectorRef_int
error: test outofmemory.VectorRef_jit
error: test outofmemory.VectorRef_opt
error: test outofmemory.Vector_int
error: test outofmemory.Vector_jit
error: test outofmemory.Vector_opt
error: test perf.CreateManyExceptions_depth_int
error: test perf.CreateManyExceptions_depth_jit
error: test perf.CreateManyExceptions_depth_opt
error: test perf.CreateManyExceptions_int
error: test perf.CreateManyExceptions_jit
error: test perf.CreateManyExceptions_opt
error: test perf.MultiThreadsSimple_int
error: test perf.SeveralThreads_int
error: test perf.SeveralThreads_jit
error: test perf.SeveralThreads_opt
error: test perf.StressCornerSize_a_int
error: test perf.StressCornerSize_a_jit
error: test perf.StressCornerSize_a_opt
error: test perf.StressCornerSize_int
error: test perf.StressCornerSize_jit
error: test perf.StressCornerSize_opt
error: test perf.ThrowManyExceptions_depth_int
error: test perf.ThrowManyExceptions_depth_jit
error: test perf.ThrowManyExceptions_depth_opt
error: test perf.ThrowManyExceptions_int
error: test perf.ThrowManyExceptions_jit
error: test perf.ThrowManyExceptions_opt
error: test perf.ThrowMany_depth_int
error: test perf.ThrowMany_depth_jit
error: test perf.ThrowMany_depth_opt
error: test perf.ThrowMany_int
error: test perf.ThrowMany_jit
error: test perf.ThrowMany_opt
error: test reflect.GetMethod_int
error: test reflect.GetMethod_jit
error: test reflect.GetMethod_opt
error: test shutdown.TestDaemonOnWait_int
error: test shutdown.TestDaemonOnWait_jit
error: test shutdown.TestDaemonOnWait_opt
error: test shutdown.TestFatalError_int
error: test shutdown.TestFatalError_jit
error: test shutdown.TestFatalError_opt
error: test shutdown.TestInterrupt_int
error: test shutdown.TestInterrupt_jit
error: test shutdown.TestInterrupt_opt
error: test shutdown.TestLock_int
error: test shutdown.TestLock_jit
error: test shutdown.TestLock_opt
error: test stress.BigStringBuffer_int
error: test stress.BigStringBuffer_jit
error: test stress.BigStringBuffer_opt
error: test stress.Finalizer_int
error: test stress.Finalizer_jit
error: test stress.Finalizer_opt
error: test stress.Stack_int
error: test stress.Sync_int
error: test stress.Sync_jit
error: test stress.Threads_int
error: test stress.Threads_jit
error: test stress.Threads_opt
error: test stress.Vector_int
error: test stress.Vector_jit
error: test stress.Vector_opt
error: test stress.WeakHashmapTest_int
error: test stress.WeakHashmapTest_jit
error: test stress.WeakHashmapTest_opt
error: test thread.ExitShutdownHook_int
error: test thread.ExitShutdownHook_jit
error: test thread.ExitShutdownHook_opt
error: test thread.InfiniteFinalizer_int
error: test thread.InfiniteFinalizer_jit
error: test thread.InfiniteFinalizer_opt
error: test thread.Sleep_int
error: test thread.Sleep_jit
error: test thread.Sleep_opt
error: test thread.ThreadInterrupt_int
error: test thread.ThreadInterrupt_jit
error: test thread.ThreadInterrupt_opt
error: test thread.ThreadOOM_int
error: test thread.ThreadOOM_jit
error: test thread.ThreadOOM_opt
error: test util.Date_int
error: test util.Date_jit
error: test util.Date_opt
error: test util.DoPriveleged_int
error: test util.DoPriveleged_jit
error: test util.DoPriveleged_opt
error: test util.Prop_int
error: test util.Prop_jit
error: test util.Prop_opt
error: test util.StringIntern_int
error: test util.StringIntern_jit
error: test util.StringIntern_opt
Unit Test Error Details:	(214)
                
Test: testClass: test_java_attrs
Test: testClass: test_java_basic
Test: testClass: test_java_identify
Test: testClass: test_java_interrupt
Test: testClass: test_java_monitors
Test: testClass: test_java_park
Test: testClass: test_java_ptr_conv
Test: testClass: test_java_suspend
Test: testClass: test_native_basic
Test: testClass: test_native_fat_monitor
Test: testClass: test_native_suspend
Test: testClass: test_native_thin_monitor
Test: testClass: test_ti_instrum
Test: testClass: test_ti_monitor_info
Test: testClass: test_ti_raw_monitors
Test: testClass: test_ti_state
Test: testClass: Hi_int
Test: testClass: Hi_jit
Test: testClass: Hi_opt
Test: testClass: StackTest_int
Test: testClass: classloader.ClassTestGetDeclaringClass_int
Test: testClass: classloader.ClassTestGetDeclaringClass_jit
Test: testClass: classloader.ClassTestGetDeclaringClass_opt
Test: testClass: classloader.ExceptionInInitializerTest_int
Test: testClass: classloader.ExceptionInInitializerTest_jit
Test: testClass: classloader.ExceptionInInitializerTest_opt
Test: testClass: classloader.LogLoader_int
Test: testClass: classloader.LogLoader_jit
Test: testClass: classloader.LogLoader_opt
Test: testClass: classloader.NotFound_int
Test: testClass: classloader.NotFound_jit
Test: testClass: classloader.NotFound_opt
Test: testClass: classloader.StressLoader_int
Test: testClass: classloader.StressLoader_jit
Test: testClass: classloader.StressLoader_opt
Test: testClass: exception.ExceptionStackTest_int
Test: testClass: exception.ExceptionStackTest_jit
Test: testClass: exception.ExceptionStackTest_opt
Test: testClass: exception.FinalizeStackTest_int
Test: testClass: exception.NPE_int
Test: testClass: exception.NPE_jit
Test: testClass: exception.NPE_opt
Test: testClass: gc.FinAlloc_int
Test: testClass: gc.FinAlloc_jit
Test: testClass: gc.FinAlloc_opt
Test: testClass: gc.Finalizer_int
Test: testClass: gc.Finalizer_jit
Test: testClass: gc.Force_int
Test: testClass: gc.Force_jit
Test: testClass: gc.Force_opt
Test: testClass: gc.Fragment_int
Test: testClass: gc.Fragment_jit
Test: testClass: gc.Fragment_opt
Test: testClass: gc.Free_int
Test: testClass: gc.Free_jit
Test: testClass: gc.Free_opt
Test: testClass: gc.LOS_int
Test: testClass: gc.List_int
Test: testClass: gc.List_jit
Test: testClass: gc.List_opt
Test: testClass: gc.MultiThreads_int
Test: testClass: gc.NPE_int
Test: testClass: gc.PhantomReferenceQueueTest_int
Test: testClass: gc.PhantomReferenceQueueTest_jit
Test: testClass: gc.PhantomReferenceQueueTest_opt
Test: testClass: gc.PhantomReferenceTest_int
Test: testClass: gc.PhantomReferenceTest_jit
Test: testClass: gc.PhantomReferenceTest_opt
Test: testClass: gc.RefRemove_int
Test: testClass: gc.RefRemove_jit
Test: testClass: gc.RefRemove_opt
Test: testClass: gc.RunFinalizersOnExitTest_int
Test: testClass: gc.RunFinalizersOnExitTest_jit
Test: testClass: gc.StressRef_int
Test: testClass: gc.StressRef_jit
Test: testClass: gc.StressRef_opt
Test: testClass: gc.SynchronizedFinilazersTest_int
Test: testClass: gc.SynchronizedFinilazersTest_jit
Test: testClass: gc.SynchronizedFinilazersTest_opt
Test: testClass: gc.ThreadSuspension_int
Test: testClass: gc.ThreadSuspension_jit
Test: testClass: gc.ThreadSuspension_opt
Test: testClass: gc.WeakReferenceTest_int
Test: testClass: gc.WeakReferenceTest_jit
Test: testClass: gc.WeakReferenceTest_opt
Test: testClass: init.ErrorInInitializer_int
Test: testClass: init.ErrorInInitializer_jit
Test: testClass: init.ErrorInInitializer_opt
Test: testClass: init.Other_int
Test: testClass: init.Other_jit
Test: testClass: init.Other_opt
Test: testClass: io.ArrayList_int
Test: testClass: io.ArrayList_jit
Test: testClass: io.ArrayList_opt
Test: testClass: io.Integers_jit
Test: testClass: io.Integers_opt
Test: testClass: jni.LoadLibrary_int
Test: testClass: jni.LoadLibrary_jit
Test: testClass: jni.LoadLibrary_opt
Test: testClass: outofmemory.Double_int
Test: testClass: outofmemory.Double_jit
Test: testClass: outofmemory.Double_opt
Test: testClass: outofmemory.Int_int
Test: testClass: outofmemory.Int_jit
Test: testClass: outofmemory.Int_opt
Test: testClass: outofmemory.Plain_int
Test: testClass: outofmemory.Plain_jit
Test: testClass: outofmemory.Plain_opt
Test: testClass: outofmemory.Ref_int
Test: testClass: outofmemory.Ref_jit
Test: testClass: outofmemory.Ref_opt
Test: testClass: outofmemory.Throw_int
Test: testClass: outofmemory.Throw_jit
Test: testClass: outofmemory.Throw_opt
Test: testClass: outofmemory.VectorDouble_int
Test: testClass: outofmemory.VectorDouble_jit
Test: testClass: outofmemory.VectorDouble_opt
Test: testClass: outofmemory.VectorInt_int
Test: testClass: outofmemory.VectorInt_jit
Test: testClass: outofmemory.VectorInt_opt
Test: testClass: outofmemory.VectorRef_int
Test: testClass: outofmemory.VectorRef_jit
Test: testClass: outofmemory.VectorRef_opt
Test: testClass: outofmemory.Vector_int
Test: testClass: outofmemory.Vector_jit
Test: testClass: outofmemory.Vector_opt
Test: testClass: perf.CreateManyExceptions_depth_int
Test: testClass: perf.CreateManyExceptions_depth_jit
Test: testClass: perf.CreateManyExceptions_depth_opt
Test: testClass: perf.CreateManyExceptions_int
Test: testClass: perf.CreateManyExceptions_jit
Test: testClass: perf.CreateManyExceptions_opt
Test: testClass: perf.MultiThreadsSimple_int
Test: testClass: perf.SeveralThreads_int
Test: testClass: perf.SeveralThreads_jit
Test: testClass: perf.SeveralThreads_opt
Test: testClass: perf.StressCornerSize_a_int
Test: testClass: perf.StressCornerSize_a_jit
Test: testClass: perf.StressCornerSize_a_opt
Test: testClass: perf.StressCornerSize_int
Test: testClass: perf.StressCornerSize_jit
Test: testClass: perf.StressCornerSize_opt
Test: testClass: perf.ThrowManyExceptions_depth_int
Test: testClass: perf.ThrowManyExceptions_depth_jit
Test: testClass: perf.ThrowManyExceptions_depth_opt
Test: testClass: perf.ThrowManyExceptions_int
Test: testClass: perf.ThrowManyExceptions_jit
Test: testClass: perf.ThrowManyExceptions_opt
Test: testClass: perf.ThrowMany_depth_int
Test: testClass: perf.ThrowMany_depth_jit
Test: testClass: perf.ThrowMany_depth_opt
Test: testClass: perf.ThrowMany_int
Test: testClass: perf.ThrowMany_jit
Test: testClass: perf.ThrowMany_opt
Test: testClass: reflect.GetMethod_int
Test: testClass: reflect.GetMethod_jit
Test: testClass: reflect.GetMethod_opt
Test: testClass: shutdown.TestDaemonOnWait_int
Test: testClass: shutdown.TestDaemonOnWait_jit
Test: testClass: shutdown.TestDaemonOnWait_opt
Test: testClass: shutdown.TestFatalError_int
Test: testClass: shutdown.TestFatalError_jit
Test: testClass: shutdown.TestFatalError_opt
Test: testClass: shutdown.TestInterrupt_int
Test: testClass: shutdown.TestInterrupt_jit
Test: testClass: shutdown.TestInterrupt_opt
Test: testClass: shutdown.TestLock_int
Test: testClass: shutdown.TestLock_jit
Test: testClass: shutdown.TestLock_opt
Test: testClass: stress.BigStringBuffer_int
Test: testClass: stress.BigStringBuffer_jit
Test: testClass: stress.BigStringBuffer_opt
Test: testClass: stress.Finalizer_int
Test: testClass: stress.Finalizer_jit
Test: testClass: stress.Finalizer_opt
Test: testClass: stress.Stack_int
Test: testClass: stress.Sync_int
Test: testClass: stress.Sync_jit
Test: testClass: stress.Threads_int
Test: testClass: stress.Threads_jit
Test: testClass: stress.Threads_opt
Test: testClass: stress.Vector_int
Test: testClass: stress.Vector_jit
Test: testClass: stress.Vector_opt
Test: testClass: stress.WeakHashmapTest_int
Test: testClass: stress.WeakHashmapTest_jit
Test: testClass: stress.WeakHashmapTest_opt
Test: testClass: thread.ExitShutdownHook_int
Test: testClass: thread.ExitShutdownHook_jit
Test: testClass: thread.ExitShutdownHook_opt
Test: testClass: thread.InfiniteFinalizer_int
Test: testClass: thread.InfiniteFinalizer_jit
Test: testClass: thread.InfiniteFinalizer_opt
Test: testClass: thread.Sleep_int
Test: testClass: thread.Sleep_jit
Test: testClass: thread.Sleep_opt
Test: testClass: thread.ThreadInterrupt_int
Test: testClass: thread.ThreadInterrupt_jit
Test: testClass: thread.ThreadInterrupt_opt
Test: testClass: thread.ThreadOOM_int
Test: testClass: thread.ThreadOOM_jit
Test: testClass: thread.ThreadOOM_opt
Test: testClass: util.Date_int
Test: testClass: util.Date_jit
Test: testClass: util.Date_opt
Test: testClass: util.DoPriveleged_int
Test: testClass: util.DoPriveleged_jit
Test: testClass: util.DoPriveleged_opt
Test: testClass: util.Prop_int
Test: testClass: util.Prop_jit
Test: testClass: util.Prop_opt
Test: testClass: util.StringIntern_int
Test: testClass: util.StringIntern_jit
Test: testClass: util.StringIntern_opt

***********************************************************
Modifications since last successful build:	(16)
            
add cc-drlvm log20070328050128Lbuild.505 03/28/2007 05:01:28drlvm
modified wjwashburn  /harmony/enhanced/drlvm/trunk/vm/thread/src/thread_native_thin_monitor.c 03/28/2007 04:24:55 Harmony-3065, TLS inlining to improve performancebuild, build test pass on win32, RHEL4.0 32-bit w/ gcc4.0.2
modified wjwashburn  /harmony/enhanced/drlvm/trunk/vm/thread/src/thread_private.h 03/28/2007 04:24:55 Harmony-3065, TLS inlining to improve performancebuild, build test pass on win32, RHEL4.0 32-bit w/ gcc4.0.2
modified wjwashburn  /harmony/enhanced/drlvm/trunk/vm/thread/src/hythr.exp 03/28/2007 04:24:55 Harmony-3065, TLS inlining to improve performancebuild, build test pass on win32, RHEL4.0 32-bit w/ gcc4.0.2
modified wjwashburn  /harmony/enhanced/drlvm/trunk/vm/thread/src/hythr.def 03/28/2007 04:24:55 Harmony-3065, TLS inlining to improve performancebuild, build test pass on win32, RHEL4.0 32-bit w/ gcc4.0.2
modified wjwashburn  /harmony/enhanced/drlvm/trunk/vm/thread/src/thread_init.c 03/28/2007 04:24:55 Harmony-3065, TLS inlining to improve performancebuild, build test pass on win32, RHEL4.0 32-bit w/ gcc4.0.2
modified wjwashburn  /harmony/enhanced/drlvm/trunk/vm/vmcore/src/thread/thread_manager.cpp 03/28/2007 04:24:55 Harmony-3065, TLS inlining to improve performancebuild, build test pass on win32, RHEL4.0 32-bit w/ gcc4.0.2
modified wjwashburn  /harmony/enhanced/drlvm/trunk/vm/thread/src/thread_native_basic.c 03/28/2007 04:24:55 Harmony-3065, TLS inlining to improve performancebuild, build test pass on win32, RHEL4.0 32-bit w/ gcc4.0.2
modified wjwashburn  /harmony/enhanced/drlvm/trunk/vm/thread/src/thread_native_suspend.c 03/28/2007 04:24:55 Harmony-3065, TLS inlining to improve performancebuild, build test pass on win32, RHEL4.0 32-bit w/ gcc4.0.2
modified wjwashburn  /harmony/enhanced/drlvm/trunk/vm/vmcore/src/thread/thread_generic.cpp 03/28/2007 04:24:55 Harmony-3065, TLS inlining to improve performancebuild, build test pass on win32, RHEL4.0 32-bit w/ gcc4.0.2
modified wjwashburn  /harmony/enhanced/drlvm/trunk/vm/thread/src/thread_native_tls.c 03/28/2007 04:24:55 Harmony-3065, TLS inlining to improve performancebuild, build test pass on win32, RHEL4.0 32-bit w/ gcc4.0.2
modified wjwashburn  /harmony/enhanced/drlvm/trunk/vm/vmi/src/vmi.cpp 03/28/2007 04:24:55 Harmony-3065, TLS inlining to improve performancebuild, build test pass on win32, RHEL4.0 32-bit w/ gcc4.0.2
modified wjwashburn  /harmony/enhanced/drlvm/trunk/vm/vmcore/include/vm_threads.h 03/28/2007 04:24:55 Harmony-3065, TLS inlining to improve performancebuild, build test pass on win32, RHEL4.0 32-bit w/ gcc4.0.2
modified wjwashburn  /harmony/enhanced/drlvm/trunk/vm/thread/src/thread_java_monitors.c 03/28/2007 04:24:55 Harmony-3065, TLS inlining to improve performancebuild, build test pass on win32, RHEL4.0 32-bit w/ gcc4.0.2
modified wjwashburn  /harmony/enhanced/drlvm/trunk/vm/include/open/hythread.h 03/28/2007 04:24:55 Harmony-3065, TLS inlining to improve performancebuild, build test pass on win32, RHEL4.0 32-bit w/ gcc4.0.2
modified wjwashburn  /harmony/enhanced/drlvm/trunk/vm/include/open/hythread_ext.h 03/28/2007 04:24:55 Harmony-3065, TLS inlining to improve performancebuild, build test pass on win32, RHEL4.0 32-bit w/ gcc4.0.2

Mime
View raw message