harmony-alerts mailing list archives

Site index · List index
Message view « Date » · « Thread »
Top « Date » · « Thread »
From nom...@intel.com
Subject [build-test alert] BUILD FAILED Linux SUSE 9 64bit gcc debug: classlib over drlvm
Date Tue, 27 Mar 2007 22:14:48 GMT
BUILD FAILED:
	Ant Error Message:
/export/cruise/trunk/cc/projects/classlib/trunk/build.xml:167: The following error occurred
while executing this line: /export/cruise/trunk/cc/projects/classlib/trunk/make/build-test.xml:144:
There were test failures.

Date of build:	03/28/2007 05:12:48
Time to build:	1 minute 46 seconds
Last changed:	03/28/2007 05:01:28
Last log entry:	drlvm

***********************************************************
Execution log (errors/warnings messages):	
Tests FAILED
Tests FAILED
Tests FAILED
Tests FAILED
Test org.apache.harmony.awt.HeadlessTest FAILED
Tests FAILED
Tests FAILED
Tests FAILED
Tests FAILED
Tests FAILED
Test org.apache.harmony.crypto.internal.NullCipherSpiTest FAILED
Tests FAILED
Tests FAILED
Test org.apache.harmony.jndi.tests.javax.naming.spi.NamingManagerTest FAILED
Test org.apache.harmony.jndi.tests.javax.naming.spi.NamingManagerBuilderTest FAILED
Test org.apache.harmony.jndi.tests.javax.naming.spi.DirectoryManagerTest FAILED
Tests FAILED
Test org.apache.harmony.lang.management.OperatingSystemMXBeanImplTest FAILED
Tests FAILED
Tests FAILED
Tests FAILED
Test org.apache.harmony.misc.tests.accessors.StringAccessorTest FAILED
Tests FAILED
Tests FAILED
Tests FAILED
Tests FAILED
Tests FAILED
Tests FAILED
Tests FAILED
Tests FAILED
Tests FAILED
Tests FAILED
Tests FAILED
Tests FAILED
Tests FAILED
Tests FAILED
Tests FAILED
Tests FAILED
Tests FAILED
Tests FAILED

========================================
Testing class libraries...
========================================
Checking for depends/jars/yoko_M2-20070130/yoko.jar
Checking for depends/jars/yoko_M2-20070130/yoko-core.jar
Checking for depends/jars/yoko_M2-20070130/yoko-rmi-impl.jar
Checking for depends/jars/yoko_M2-20070130/yoko-rmi-spec.jar
Checking for depends/jars/bcel-5.2/bcel-5.2.jar
Checking for depends/jars/xalan-j_2.7.0/xalan.jar
Checking for depends/jars/xerces_2.8.0/resolver.jar
Checking for depends/jars/xerces_2.8.0/xercesImpl.jar
Checking for depends/jars/xerces_2.8.0/xml-apis.jar
Checking for depends/jars/junit_3.8.2/junit.jar
Checking for depends/jars/bcprov-jdk15-134/bcprov.jar
Checking for depends/jars/icu4j_3.4.4/icu4j_3_4_4.jar
Checking for depends/jars/mx4j_3.0.2/mx4j.zip
Checking for depends/jars/ecj_3.2/ecj_3.2.jar
Checking for depends/jars/jetty/jetty-6.0.0.jar
Checking for depends/jars/jetty/jetty-util-6.0.0.jar
Checking for depends/jars/jetty/servlet-api-2.5-6.0.0.jar
Checking for depends/libs/build/lcms/icc34.h
Checking for depends/libs/build/lcms/lcms.h
Checking for depends/libs/build/png/pngconf.h
Checking for depends/libs/build/png/png.h
Checking for depends/libs/build/jpeg/jconfig.lnx
Checking for depends/libs/build/jpeg/jpeglib.h
Checking for depends/libs/build/jpeg/jmorecfg.h
Checking for depends/libs/build/jpeg/jerror.h
Checking for depends/libs/build/lcms/liblcms.linux.x86_64
Checking for depends/libs/build/png/libpng.linux.x86_64
Checking for depends/libs/build/jpeg/libjpeg.linux.x86_64
Since fork is false, ignoring memoryMaximumSize setting
hy.test.vm.name = drl
Compiling ACCESSIBILITY classes
Compiling ACCESSIBILITY tests
java/lang/UnsatisfiedLinkError : Failed loading library "libhytext.so": DSO load failed
Compiling ANNOTATION classes
Compiling ANNOTATION tests
java/lang/UnsatisfiedLinkError : Failed loading library "libhytext.so": DSO load failed
Compiling APPLET classes
Compiling APPLET tests
Compiling ARCHIVE classes
Compiling ARCHIVE tests
java/lang/UnsatisfiedLinkError : Failed loading library "libhytext.so": DSO load failed
Compiling AUTH classes
Compiling AUTH tests
java/lang/UnsatisfiedLinkError : Failed loading library "libhytext.so": DSO load failed
Compiling AWT classes
Compiling AWT tests
java/lang/UnsatisfiedLinkError : Failed loading library "libhytext.so": DSO load failed
java/lang/UnsatisfiedLinkError : Failed loading library "libhytext.so": DSO load failed
Compiling BEANS classes
Compiling support classes for BEANS tests
Compiling internal BEANS tests
Compiling BEANS tests
Running internal BEANS tests
java/lang/UnsatisfiedLinkError : Failed loading library "libhytext.so": DSO load failed
Running BEANS tests
java/lang/UnsatisfiedLinkError : Failed loading library "libhytext.so": DSO load failed
Compiling CRYPTO classes
Compiling CRYPTO test support files
Since fork is false, ignoring memoryMaximumSize setting
Compiling CRYPTO api tests
Compiling CRYPTO api injected tests
Compiling CRYPTO impl injected tests
Compiling CRYPTO impl tests
Running CRYPTO api tests
java/lang/UnsatisfiedLinkError : Failed loading library "libhytext.so": DSO load failed
Running CRYPTO api.injected tests
java/lang/UnsatisfiedLinkError : Failed loading library "libhytext.so": DSO load failed
Running CRYPTO impl tests
java/lang/UnsatisfiedLinkError : Failed loading library "libhytext.so": DSO load failed
Running CRYPTO impl injected tests
java/lang/UnsatisfiedLinkError : Failed loading library "libhytext.so": DSO load failed
Compiling ImageIO classes
Compiling ImageIO tests
Compiling INSTRUMENT classes
Compiling INSTRUMENT tests
java/lang/UnsatisfiedLinkError : Failed loading library "libhytext.so": DSO load failed
Compiling JNDI classes
Compiling JNDI tests
java/lang/UnsatisfiedLinkError : Failed loading library "libhytext.so": DSO load failed
java/lang/UnsatisfiedLinkError : Failed loading library "libhytext.so": DSO load failed
java/lang/UnsatisfiedLinkError : Failed loading library "libhytext.so": DSO load failed
java/lang/UnsatisfiedLinkError : Failed loading library "libhytext.so": DSO load failed
Compiling LANG-MANAGEMENT classes
Compiling LANG-MANAGEMENT API tests
Compiling LANG-MANAGEMENT Implementation tests
java/lang/UnsatisfiedLinkError : Failed loading library "libhytext.so": DSO load failed
java/lang/UnsatisfiedLinkError : Failed loading library "libhytext.so": DSO load failed
Compiling LOGGING classes
Compiling LOGGING tests
java/lang/UnsatisfiedLinkError : Failed loading library "libhytext.so": DSO load failed
Compiling LUNI classes
Compiling LUNI JUnit Tests
Running LUNI JUnit Tests
java/lang/UnsatisfiedLinkError : Failed loading library "libhytext.so": DSO load failed
Compiling MATH classes
Compiling MATH tests
java/lang/UnsatisfiedLinkError : Failed loading library "libhytext.so": DSO load failed
Compiling MISC classes
Compiling MISC tests
java/lang/UnsatisfiedLinkError : Failed loading library "libhytext.so": DSO load failed
Compiling NIO classes
Compiling NIO tests
java/lang/UnsatisfiedLinkError : Failed loading library "libhytext.so": DSO load failed
Compiling NIO_CHAR classes
Compiling NIO_CHAR tests
java/lang/UnsatisfiedLinkError : Failed loading library "libhytext.so": DSO load failed
Compiling PACK200 classes
Compiling PACK200 tests
Running PACK200 tests
java/lang/UnsatisfiedLinkError : Failed loading library "libhytext.so": DSO load failed
Compiling PREFS classes
Compiling PREFS tests
java/lang/UnsatisfiedLinkError : Failed loading library "libhytext.so": DSO load failed
Compiling PRINT classes
Compiling Print tests
java/lang/UnsatisfiedLinkError : Failed loading library "libhytext.so": DSO load failed
Compiling REGEX classes
Compiling REGEX tests
java/lang/UnsatisfiedLinkError : Failed loading library "libhytext.so": DSO load failed
Compiling RMI classes
Compiling RMI api tests
Running RMI api tests
java/lang/UnsatisfiedLinkError : Failed loading library "libhytext.so": DSO load failed
Compiling SECURITY classes
Compiling SECURITY test support files
Compiling SECURITY api tests
Compiling SECURITY api injected tests
Compiling SECURITY impl injected tests
Compiling SECURITY impl tests
Running SECURITY api tests
java/lang/UnsatisfiedLinkError : Failed loading library "libhytext.so": DSO load failed
Running SECURITY api.injected tests
java/lang/UnsatisfiedLinkError : Failed loading library "libhytext.so": DSO load failed
Running SECURITY impl tests
java/lang/UnsatisfiedLinkError : Failed loading library "libhytext.so": DSO load failed
Running SECURITY impl injected tests
java/lang/UnsatisfiedLinkError : Failed loading library "libhytext.so": DSO load failed
Compiling SOUND classes
Compiling SOUND tests
java/lang/UnsatisfiedLinkError : Failed loading library "libhytext.so": DSO load failed
Compiling SQL classes
Compiling SQL tests
java/lang/UnsatisfiedLinkError : Failed loading library "libhytext.so": DSO load failed
Compiling Sun Compat classes
Compiling SUNCOMPAT tests
Compiling TEXT classes
Compiling TEXT tests
java/lang/UnsatisfiedLinkError : Failed loading library "libhytext.so": DSO load failed
Compiling TOOLS classes
Compiling Tools tests
java/lang/UnsatisfiedLinkError : Failed loading library "libhytext.so": DSO load failed
Compiling X-NET classes
Compiling X-NET test support files
Since fork is false, ignoring memoryMaximumSize setting
Compiling X-NET api tests
Compiling X-NET impl injected tests
Compiling X-NET impl tests
Running X-NET api tests
java/lang/UnsatisfiedLinkError : Failed loading library "libhytext.so": DSO load failed
Running X-NET impl tests
java/lang/UnsatisfiedLinkError : Failed loading library "libhytext.so": DSO load failed
Running X-NET impl injected tests
java/lang/UnsatisfiedLinkError : Failed loading library "libhytext.so": DSO load failed
The test report is in /export/cruise/trunk/cc/projects/classlib/trunk/build/test_report/html/index.html

***********************************************************
Unit Tests: (0)
        
No Tests Run: This project doesn't have any tests or tests were not run

***********************************************************
Modifications since last successful build:	(16)
            
add cc-drlvm log20070328050128Lbuild.505 03/28/2007 05:01:28drlvm
modified wjwashburn  /harmony/enhanced/drlvm/trunk/vm/thread/src/thread_native_thin_monitor.c
03/28/2007 04:24:55 Harmony-3065, TLS inlining to improve performancebuild, build test pass
on win32, RHEL4.0 32-bit w/ gcc4.0.2
modified wjwashburn  /harmony/enhanced/drlvm/trunk/vm/thread/src/thread_private.h 03/28/2007
04:24:55 Harmony-3065, TLS inlining to improve performancebuild, build test pass on win32,
RHEL4.0 32-bit w/ gcc4.0.2
modified wjwashburn  /harmony/enhanced/drlvm/trunk/vm/thread/src/hythr.exp 03/28/2007 04:24:55
Harmony-3065, TLS inlining to improve performancebuild, build test pass on win32, RHEL4.0
32-bit w/ gcc4.0.2
modified wjwashburn  /harmony/enhanced/drlvm/trunk/vm/thread/src/hythr.def 03/28/2007 04:24:55
Harmony-3065, TLS inlining to improve performancebuild, build test pass on win32, RHEL4.0
32-bit w/ gcc4.0.2
modified wjwashburn  /harmony/enhanced/drlvm/trunk/vm/thread/src/thread_init.c 03/28/2007
04:24:55 Harmony-3065, TLS inlining to improve performancebuild, build test pass on win32,
RHEL4.0 32-bit w/ gcc4.0.2
modified wjwashburn  /harmony/enhanced/drlvm/trunk/vm/vmcore/src/thread/thread_manager.cpp
03/28/2007 04:24:55 Harmony-3065, TLS inlining to improve performancebuild, build test pass
on win32, RHEL4.0 32-bit w/ gcc4.0.2
modified wjwashburn  /harmony/enhanced/drlvm/trunk/vm/thread/src/thread_native_basic.c 03/28/2007
04:24:55 Harmony-3065, TLS inlining to improve performancebuild, build test pass on win32,
RHEL4.0 32-bit w/ gcc4.0.2
modified wjwashburn  /harmony/enhanced/drlvm/trunk/vm/thread/src/thread_native_suspend.c 03/28/2007
04:24:55 Harmony-3065, TLS inlining to improve performancebuild, build test pass on win32,
RHEL4.0 32-bit w/ gcc4.0.2
modified wjwashburn  /harmony/enhanced/drlvm/trunk/vm/vmcore/src/thread/thread_generic.cpp
03/28/2007 04:24:55 Harmony-3065, TLS inlining to improve performancebuild, build test pass
on win32, RHEL4.0 32-bit w/ gcc4.0.2
modified wjwashburn  /harmony/enhanced/drlvm/trunk/vm/thread/src/thread_native_tls.c 03/28/2007
04:24:55 Harmony-3065, TLS inlining to improve performancebuild, build test pass on win32,
RHEL4.0 32-bit w/ gcc4.0.2
modified wjwashburn  /harmony/enhanced/drlvm/trunk/vm/vmi/src/vmi.cpp 03/28/2007 04:24:55
Harmony-3065, TLS inlining to improve performancebuild, build test pass on win32, RHEL4.0
32-bit w/ gcc4.0.2
modified wjwashburn  /harmony/enhanced/drlvm/trunk/vm/vmcore/include/vm_threads.h 03/28/2007
04:24:55 Harmony-3065, TLS inlining to improve performancebuild, build test pass on win32,
RHEL4.0 32-bit w/ gcc4.0.2
modified wjwashburn  /harmony/enhanced/drlvm/trunk/vm/thread/src/thread_java_monitors.c 03/28/2007
04:24:55 Harmony-3065, TLS inlining to improve performancebuild, build test pass on win32,
RHEL4.0 32-bit w/ gcc4.0.2
modified wjwashburn  /harmony/enhanced/drlvm/trunk/vm/include/open/hythread.h 03/28/2007 04:24:55
Harmony-3065, TLS inlining to improve performancebuild, build test pass on win32, RHEL4.0
32-bit w/ gcc4.0.2
modified wjwashburn  /harmony/enhanced/drlvm/trunk/vm/include/open/hythread_ext.h 03/28/2007
04:24:55 Harmony-3065, TLS inlining to improve performancebuild, build test pass on win32,
RHEL4.0 32-bit w/ gcc4.0.2

Mime
View raw message