harmony-alerts mailing list archives

Site index · List index
Message view « Date » · « Thread »
Top « Date » · « Thread »
From nom...@hursley.ibm.com
Subject [continuum] BUILD FAILURE: Classlib/linux.ia32 Build/Test
Date Thu, 22 Mar 2007 04:36:18 GMT
Online report : http://people.apache.org/~hindessm/continuum/classlib/linux.ia32/2007/03/22/20070322-043618.failure.log.gz
Build statistics:
  State: Failed
  Previous State: Failed
  Started at: Thu, 22 Mar 2007 03:28:57 +0000
  Finished at: Thu, 22 Mar 2007 04:36:16 +0000
  Total time: 1h 7m 18s
  Build Trigger: Schedule
  Exit code: 1
  Building machine hostname: hy2
  Operating system : Linux(unknown)
  Java version : 1.5.0_06(Sun Microsystems Inc.)

Changes
                            classlib/modules/security/src/test/api/java/org/apache/harmony/security/tests/java/security/cert/X509Certificate2Test.java
            classlib/modules/security/src/test/support/common/java/org/apache/harmony/security/tests/support/cert/TestUtils.java
            classlib/modules/security/src/main/java/common/org/apache/harmony/security/x509/AuthorityKeyIdentifier.java
        
****************************************************************************
Output:
****************************************************************************
Buildfile: build.xml

svn-prop:

build:
   [delete] Deleting directory /home/hybld/continuum-working-directory/6/classlib/deploy
     [echo] Classlib revision is 521108
     [echo] Post process: true
     [echo] JAPI: true
     [echo] Building with reference jdk/javac
     [exec] Buildfile: build.xml

     [exec] -init-hdk-for-clean:
     [exec]     [mkdir] Created dir: /home/hybld/continuum-working-directory/6/classlib/deploy/build/ant
     [exec]      [copy] Copying 1 file to /home/hybld/continuum-working-directory/6/classlib/deploy/build/ant

     [exec] clean-java:

     [exec] -modules-clean-bin:

     [exec] clean:
     [exec]    [delete] Deleting 30 files from /home/hybld/continuum-working-directory/6/classlib/build/classes
     [exec]    [delete] Deleting 12 files from /home/hybld/continuum-working-directory/6/classlib/modules/accessibility/bin/test

     [exec] clean:
     [exec]    [delete] Deleting 13 files from /home/hybld/continuum-working-directory/6/classlib/build/classes
     [exec]    [delete] Deleting 1 files from /home/hybld/continuum-working-directory/6/classlib/modules/annotation/bin/test

     [exec] clean:
     [exec]    [delete] Deleting 35 files from /home/hybld/continuum-working-directory/6/classlib/build/classes
     [exec]    [delete] Deleting 1 files from /home/hybld/continuum-working-directory/6/classlib/modules/applet/bin/test

     [exec] clean:
     [exec]    [delete] Deleting 42 files from /home/hybld/continuum-working-directory/6/classlib/build/classes
     [exec]    [delete] Deleting 35 files from /home/hybld/continuum-working-directory/6/classlib/modules/archive/bin/test

     [exec] clean-native-includes:
     [exec]    [delete] /home/hybld/continuum-working-directory/6/classlib/deploy/include
not found.

     [exec] clean:
     [exec]    [delete] Deleting 112 files from /home/hybld/continuum-working-directory/6/classlib/build/classes
     [exec]    [delete] Deleting 226 files from /home/hybld/continuum-working-directory/6/classlib/modules/auth/bin/test

     [exec] clean:
     [exec]    [delete] Deleting 908 files from /home/hybld/continuum-working-directory/6/classlib/build/classes
     [exec]    [delete] Deleting 612 files from /home/hybld/continuum-working-directory/6/classlib/modules/awt/bin/test

     [exec] clean:
     [exec]    [delete] Deleting 107 files from /home/hybld/continuum-working-directory/6/classlib/build/classes
     [exec]    [delete] Deleting 238 files from /home/hybld/continuum-working-directory/6/classlib/modules/beans/bin/test

     [exec] clean:
     [exec]    [delete] Deleting 125 files from /home/hybld/continuum-working-directory/6/classlib/build/classes
     [exec]    [delete] /home/hybld/continuum-working-directory/6/classlib/modules/concurrent/bin/test
not found.

     [exec] clean:
     [exec]    [delete] Deleting 48 files from /home/hybld/continuum-working-directory/6/classlib/build/classes
     [exec]    [delete] Deleting 90 files from /home/hybld/continuum-working-directory/6/classlib/modules/crypto/bin/test

     [exec] clean:
     [exec]    [delete] Deleting 93 files from /home/hybld/continuum-working-directory/6/classlib/build/classes
     [exec]    [delete] Deleting 3 files from /home/hybld/continuum-working-directory/6/classlib/modules/imageio/bin/test

     [exec] clean:
     [exec]    [delete] Deleting 9 files from /home/hybld/continuum-working-directory/6/classlib/build/classes
     [exec]    [delete] Deleting 20 files from /home/hybld/continuum-working-directory/6/classlib/modules/instrument/bin/test

     [exec] clean:
     [exec]    [delete] Deleting 177 files from /home/hybld/continuum-working-directory/6/classlib/build/classes
     [exec]    [delete] Deleting 192 files from /home/hybld/continuum-working-directory/6/classlib/modules/jndi/bin/test

     [exec] clean:
     [exec]    [delete] Deleting 43 files from /home/hybld/continuum-working-directory/6/classlib/build/classes
     [exec]    [delete] Deleting 18 files from /home/hybld/continuum-working-directory/6/classlib/modules/lang-management/bin/api
     [exec]    [delete] Deleting 16 files from /home/hybld/continuum-working-directory/6/classlib/modules/lang-management/bin/impl

     [exec] clean:
     [exec]    [delete] Deleting 34 files from /home/hybld/continuum-working-directory/6/classlib/build/classes
     [exec]    [delete] Deleting 100 files from /home/hybld/continuum-working-directory/6/classlib/modules/logging/bin/test

     [exec] clean:
     [exec]    [delete] Deleting 969 files from /home/hybld/continuum-working-directory/6/classlib/build/classes
     [exec]    [delete] Deleting 919 files from /home/hybld/continuum-working-directory/6/classlib/modules/luni/bin/test

     [exec] clean-native-includes:
     [exec]    [delete] /home/hybld/continuum-working-directory/6/classlib/deploy/include
not found.
     [exec]    [delete] /home/hybld/continuum-working-directory/6/classlib/deploy/jdk/include
not found.

     [exec] clean:
     [exec]    [delete] Deleting 29 files from /home/hybld/continuum-working-directory/6/classlib/build/classes

     [exec] clean:
     [exec]    [delete] Deleting 14 files from /home/hybld/continuum-working-directory/6/classlib/build/classes
     [exec]    [delete] Deleting 25 files from /home/hybld/continuum-working-directory/6/classlib/modules/math/bin/test

     [exec] clean:
     [exec]    [delete] Deleting 14 files from /home/hybld/continuum-working-directory/6/classlib/build/classes
     [exec]    [delete] Deleting 1 files from /home/hybld/continuum-working-directory/6/classlib/modules/misc/bin/test

     [exec] clean:
     [exec]    [delete] Deleting 142 files from /home/hybld/continuum-working-directory/6/classlib/build/classes
     [exec]    [delete] Deleted 5 directories from /home/hybld/continuum-working-directory/6/classlib/build/classes
     [exec]    [delete] Deleting 157 files from /home/hybld/continuum-working-directory/6/classlib/modules/nio/bin/test
     [exec]    [delete] Deleted 19 directories from /home/hybld/continuum-working-directory/6/classlib/modules/nio/bin/test

     [exec] clean:
     [exec]    [delete] Deleting 20 files from /home/hybld/continuum-working-directory/6/classlib/build/classes
     [exec]    [delete] Deleting 79 files from /home/hybld/continuum-working-directory/6/classlib/modules/nio_char/bin/test

     [exec] clean:
     [exec]    [delete] Deleting 37 files from /home/hybld/continuum-working-directory/6/classlib/build/classes
     [exec]    [delete] Deleting 16 files from /home/hybld/continuum-working-directory/6/classlib/modules/pack200/bin/test

     [exec] clean-native-includes:
     [exec]    [delete] /home/hybld/continuum-working-directory/6/classlib/deploy/include
not found.

     [exec] clean:

     [exec] clean:
     [exec]    [delete] Deleting 32 files from /home/hybld/continuum-working-directory/6/classlib/build/classes
     [exec]    [delete] Deleting 34 files from /home/hybld/continuum-working-directory/6/classlib/modules/prefs/bin/test

     [exec] clean:
     [exec]    [delete] Deleting 205 files from /home/hybld/continuum-working-directory/6/classlib/build/classes
     [exec]    [delete] Deleting 60 files from /home/hybld/continuum-working-directory/6/classlib/modules/print/bin/test

     [exec] clean:
     [exec]    [delete] Deleting 177 files from /home/hybld/continuum-working-directory/6/classlib/build/classes
     [exec]    [delete] Deleting 13 files from /home/hybld/continuum-working-directory/6/classlib/modules/regex/bin/test

     [exec] clean:
     [exec]    [delete] Deleting 230 files from /home/hybld/continuum-working-directory/6/classlib/build/classes
     [exec]    [delete] Deleting 53 files from /home/hybld/continuum-working-directory/6/classlib/modules/rmi/bin/test

     [exec] clean:
     [exec]    [delete] Deleting 429 files from /home/hybld/continuum-working-directory/6/classlib/build/classes
     [exec]    [delete] Deleting 617 files from /home/hybld/continuum-working-directory/6/classlib/modules/security/bin/test

     [exec] clean:
     [exec]    [delete] Deleting 2 files from /home/hybld/continuum-working-directory/6/classlib/build/classes

     [exec] clean:
     [exec]    [delete] Deleting 74 files from /home/hybld/continuum-working-directory/6/classlib/build/classes
     [exec]    [delete] Deleting 54 files from /home/hybld/continuum-working-directory/6/classlib/modules/sound/bin/test

     [exec] clean:
     [exec]    [delete] Deleting 75 files from /home/hybld/continuum-working-directory/6/classlib/build/classes
     [exec]    [delete] Deleting 57 files from /home/hybld/continuum-working-directory/6/classlib/modules/sql/bin/test

     [exec] clean:
     [exec]    [delete] Deleting 6 files from /home/hybld/continuum-working-directory/6/classlib/build/classes

     [exec] clean:
     [exec]    [delete] Deleting 1619 files from /home/hybld/continuum-working-directory/6/classlib/build/classes
     [exec]    [delete] Deleting 4 files from /home/hybld/continuum-working-directory/6/classlib/build/classes
     [exec]    [delete] Deleting 1585 files from /home/hybld/continuum-working-directory/6/classlib/modules/swing/bin/test

     [exec] clean:
     [exec]    [delete] Deleting 40 files from /home/hybld/continuum-working-directory/6/classlib/build/classes

...

     [exec]     [junit] Tests run: 1, Failures: 0, Errors: 0, Time elapsed: 0.016 sec
     [exec]     [junit] Tests run: 27, Failures: 0, Errors: 0, Time elapsed: 0.095 sec
     [exec]     [junit] Tests run: 26, Failures: 0, Errors: 0, Time elapsed: 0.473 sec
     [exec]     [junit] *** glibc detected *** double free or corruption (out): 0x6212af50
***
     [exec]     [junit] Tests FAILED
     [exec]     [junit] Running org.apache.harmony.awt.HeadlessTest
     [exec]     [junit] Tests run: 5, Failures: 0, Errors: 0, Time elapsed: 1.615 sec

     [exec] touch-failures-file:


...

     [exec]     [junit] Tests run: 19, Failures: 0, Errors: 0, Time elapsed: 0.262 sec
     [exec]     [junit] Tests run: 9, Failures: 0, Errors: 0, Time elapsed: 0.032 sec
     [exec]     [junit] Tests run: 2, Failures: 0, Errors: 0, Time elapsed: 0.004 sec
     [exec]     [junit] Tests run: 20, Failures: 3, Errors: 3, Time elapsed: 16.816 sec
     [exec]     [junit] TEST tests.api.java.net.MulticastSocketTest FAILED
     [exec]     [junit] Tests run: 2, Failures: 0, Errors: 0, Time elapsed: 0.003 sec
     [exec]     [junit] Tests run: 9, Failures: 0, Errors: 0, Time elapsed: 2.404 sec
     [exec]     [junit] Tests run: 2, Failures: 0, Errors: 0, Time elapsed: 0.004 sec
     [exec]     [junit] Tests run: 3, Failures: 0, Errors: 0, Time elapsed: 0.004 sec
     [exec]     [junit] Tests run: 2, Failures: 0, Errors: 0, Time elapsed: 0.004 sec

...

     [exec]     [junit] Tests run: 23, Failures: 0, Errors: 0, Time elapsed: 0.119 sec
     [exec]     [junit] Tests run: 19, Failures: 0, Errors: 0, Time elapsed: 0.099 sec
     [exec]     [junit] Tests run: 48, Failures: 0, Errors: 0, Time elapsed: 0.254 sec
     [exec]     [junit] Tests run: 16, Failures: 0, Errors: 0, Time elapsed: 0.364 sec
     [exec]     [junit] Tests FAILED

     [exec] touch-failures-file:

     [exec] touch-errors-file:


...

     [exec]     [junit] org.apache.harmony.rmi.test.MyException: MyRemoteObject.test_Exception
     [exec]     [junit] Done.

     [exec]     [junit] Testing test_Error...
     [exec]     [junit] java.rmi.ServerError: Error occurred while remote method invocation;
nested exception is:
     [exec]     [junit] 	java.lang.Error: MyRemoteObject.test_Error
     [exec]     [junit] Done.

     [exec]     [junit] Testing test_RuntimeException...
     [exec]     [junit] java.lang.RuntimeException: MyRemoteObject.text_RuntimeException
     [exec]     [junit] Done.

...

     [exec]     [junit] org.apache.harmony.rmi.test.MyException: MyRemoteObject.test_Exception
     [exec]     [junit] Done.

     [exec]     [junit] Testing test_Error...
     [exec]     [junit] java.rmi.ServerError: Error occurred while remote method invocation;
nested exception is:
     [exec]     [junit] 	java.lang.Error: MyRemoteObject.test_Error
     [exec]     [junit] Done.

     [exec]     [junit] Testing test_RuntimeException...
     [exec]     [junit] java.lang.RuntimeException: MyRemoteObject.text_RuntimeException
     [exec]     [junit] Done.

...

     [exec] gen-report:

     [exec] check-test-result:

     [exec] BUILD FAILED
     [exec] /home/hybld/continuum-working-directory/6/classlib/build.xml:167: The following
error occurred while executing this line:
     [exec] /home/hybld/continuum-working-directory/6/classlib/make/build-test.xml:138: There
were test crashes: /home/hybld/continuum-working-directory/6/classlib/build/test_report/TEST-java.awt.TextFieldTest.xml

     [exec] Total time: 49 minutes 43 seconds
     [exec] Result: 1
     [echo] Tests.failed is set to true

japi:

     [exec] Processing class java.lang,Object:+
     [exec] Processing package java.lang,:=============================================================================+-+++++++++++-+++++++++++++-+++++++++++++++++-+++++-+++++++++++++++++++++++-++++--^+^+++++++++--++++++++++

...

     [exec] Processing package java.lang.management,:=============================================================================++++-+++++++++++
     [exec] Processing package java.lang.ref,:=============================================================================+++++
     [exec] Processing package java.lang.reflect,:=============================================================================+++++++++++++++++++++
     [exec] Processing class ,java:
     [exec] Failed to Japize java: java.lang.RuntimeException: NoClassDefFoundError: java
     [exec] java.lang.RuntimeException: NoClassDefFoundError: java
     [exec] 	at net.wuffies.japi.ClassFile.forName(ClassFile.java:163)
     [exec] 	at net.wuffies.japi.Japize.getClassWrapper(Japize.java:1425)
     [exec] 	at net.wuffies.japi.Japize.japizeClass(Japize.java:748)
     [exec] 	at net.wuffies.japi.Japize.processClass(Japize.java:516)

...

     [exec] 	at net.wuffies.japi.Japize.doJapize(Japize.java:443)
     [exec] 	at net.wuffies.japi.Japize.main(Japize.java:316)

     [exec] Processing class ,javax:
     [exec] Failed to Japize javax: java.lang.RuntimeException: NoClassDefFoundError: javax
     [exec] java.lang.RuntimeException: NoClassDefFoundError: javax
     [exec] 	at net.wuffies.japi.ClassFile.forName(ClassFile.java:163)
     [exec] 	at net.wuffies.japi.Japize.getClassWrapper(Japize.java:1425)
     [exec] 	at net.wuffies.japi.Japize.japizeClass(Japize.java:748)
     [exec] 	at net.wuffies.japi.Japize.processClass(Japize.java:516)

...

     [exec] 	at net.wuffies.japi.Japize.doJapize(Japize.java:443)
     [exec] 	at net.wuffies.japi.Japize.main(Japize.java:316)

     [exec] Processing class ,org:
     [exec] Failed to Japize org: java.lang.RuntimeException: NoClassDefFoundError: org
     [exec] java.lang.RuntimeException: NoClassDefFoundError: org
     [exec] 	at net.wuffies.japi.ClassFile.forName(ClassFile.java:163)
     [exec] 	at net.wuffies.japi.Japize.getClassWrapper(Japize.java:1425)
     [exec] 	at net.wuffies.japi.Japize.japizeClass(Japize.java:748)
     [exec] 	at net.wuffies.japi.Japize.processClass(Japize.java:516)

...

update-index:

test-result:

BUILD FAILED
/home/hybld/continuum-working-directory/6/build.xml:204: There were test errors.

Total time: 67 minutes 17 seconds

****************************************************************************

...

Mime
View raw message