harmony-alerts mailing list archives

Site index · List index
Message view « Date » · « Thread »
Top « Date » · « Thread »
From nom...@intel.com
Subject [build-test alert] BUILD FAILED Windows XP SP2 msvc debug: classlib over drlvm
Date Fri, 16 Mar 2007 13:04:49 GMT
BUILD FAILED:
	Ant Error Message:
C:\cruise\trunk\cc\projects\classlib\trunk\build.xml:167: The following error occurred while
executing this line: C:\cruise\trunk\cc\projects\classlib\trunk\make\build-test.xml:144: There
were test failures.

Date of build:	03/16/2007 18:34:51
Time to build:	29 minutes 22 seconds
Last changed:	03/16/2007 18:05:12
Last log entry:	More ignored files generated by pngdecoder natives



***********************************************************
Execution log (errors/warnings messages):	

========================================
Testing class libraries...
========================================

Checking for depends/jars/yoko_M2-20070130/yoko.jar
Checking for depends/jars/yoko_M2-20070130/yoko-core.jar
Checking for depends/jars/yoko_M2-20070130/yoko-rmi-impl.jar
Checking for depends/jars/yoko_M2-20070130/yoko-rmi-spec.jar
Checking for depends/jars/bcel-5.2/bcel-5.2.jar
Checking for depends/jars/xalan-j_2.7.0/xalan.jar
Checking for depends/jars/xerces_2.8.0/resolver.jar
Checking for depends/jars/xerces_2.8.0/xercesImpl.jar
Checking for depends/jars/xerces_2.8.0/xml-apis.jar
Checking for depends/jars/junit_3.8.2/junit.jar
Checking for depends/jars/bcprov-jdk15-134/bcprov.jar
Checking for depends/jars/icu4j_3.4.4/icu4j_3_4_4.jar
Checking for depends/jars/mx4j_3.0.2/mx4j.zip
Checking for depends/jars/ecj_3.2/ecj_3.2.jar
Checking for depends/jars/jetty/jetty-6.0.0.jar
Checking for depends/jars/jetty/jetty-util-6.0.0.jar
Checking for depends/jars/jetty/servlet-api-2.5-6.0.0.jar
Checking for depends/libs/windows.x86/msvcr71.dll
Checking for depends/libs/windows.x86/swing_awt_deps_winxp_2006-09-28.tgz
Since fork is false, ignoring memoryMaximumSize setting
Compiling ACCESSIBILITY classes
Compiling ACCESSIBILITY tests
Since fork is false, ignoring memoryMaximumSize setting
Compiling ANNOTATION classes
Compiling ANNOTATION tests
Since fork is false, ignoring memoryMaximumSize setting
Compiling APPLET classes
Compiling APPLET tests
Since fork is false, ignoring memoryMaximumSize setting
Compiling ARCHIVE classes
Compiling ARCHIVE tests
Since fork is false, ignoring memoryMaximumSize setting
Compiling AUTH classes
Compiling AUTH tests
Since fork is false, ignoring memoryMaximumSize setting
Compiling AWT classes
Compiling AWT tests
Since fork is false, ignoring memoryMaximumSize setting
Compiling BEANS classes
Compiling support classes for BEANS tests
Compiling internal BEANS tests
Compiling BEANS tests
Since fork is false, ignoring memoryMaximumSize setting
Running internal BEANS tests
Running BEANS tests
Compiling CRYPTO classes
Compiling CRYPTO test support files
Since fork is false, ignoring memoryMaximumSize setting
Compiling CRYPTO api tests
Since fork is false, ignoring memoryMaximumSize setting
Compiling CRYPTO api injected tests
Since fork is false, ignoring memoryMaximumSize setting
Compiling CRYPTO impl injected tests
Since fork is false, ignoring memoryMaximumSize setting
Compiling CRYPTO impl tests
Since fork is false, ignoring memoryMaximumSize setting
Running CRYPTO api tests
Running CRYPTO api.injected tests
Running CRYPTO impl tests
Running CRYPTO impl injected tests
Compiling ImageIO classes
Compiling ImageIO tests
Compiling INSTRUMENT classes
Compiling INSTRUMENT tests
Since fork is false, ignoring memoryMaximumSize setting
Compiling JNDI classes
Compiling JNDI tests
Since fork is false, ignoring memoryMaximumSize setting
Compiling LANG-MANAGEMENT classes
Compiling LANG-MANAGEMENT API tests
Since fork is false, ignoring memoryMaximumSize setting
Compiling LANG-MANAGEMENT Implementation tests
Since fork is false, ignoring memoryMaximumSize setting
Compiling LOGGING classes
Compiling LOGGING tests
Since fork is false, ignoring memoryMaximumSize setting
Compiling LUNI classes
Compiling LUNI JUnit Tests
Since fork is false, ignoring memoryMaximumSize setting
Running LUNI JUnit Tests
java.io.IOException: Stream is closed
	at java.io.BufferedInputStream.read(BufferedInputStream.java:247)
	at java.io.FilterInputStream.read(FilterInputStream.java:137)
	at tests.support.Support_Exec$2.run(Support_Exec.java:199)
	at java.lang.Thread.run(Thread.java:660)
2007-03-16 18:48:01.686::INFO:  Logging to STDERR via org.mortbay.log.StdErrLog
2007-03-16 18:48:01.780::INFO:  jetty-6.0.x
2007-03-16 18:48:01.858::INFO:  Started SocketConnector @ 0.0.0.0:1195
Compiling MATH classes
Compiling MATH tests
Since fork is false, ignoring memoryMaximumSize setting
Compiling MISC classes
Compiling MISC tests
Since fork is false, ignoring memoryMaximumSize setting
Compiling NIO classes
Compiling NIO tests
Since fork is false, ignoring memoryMaximumSize setting
Compiling NIO_CHAR classes
Compiling NIO_CHAR tests
Since fork is false, ignoring memoryMaximumSize setting
Cannot find unmappable byte array for US-ASCII
Cannot find unmappable byte array for gb18030
Cannot find unmappable byte array for ISO-8859-1
Cannot find malform byte array for ISO-8859-1
Cannot find unmappable byte array for UTF-16BE
Cannot find malform byte array for UTF-16BE
Cannot find unmappable byte array for UTF-16
Cannot find malform byte array for UTF-16
Cannot find unmappable byte array for UTF-16LE
Cannot find malform byte array for UTF-16LE
Cannot find unmappable byte array for UTF-8
Compiling PACK200 classes
Compiling PACK200 tests
Since fork is false, ignoring memoryMaximumSize setting
Running PACK200 tests
Compiling PREFS classes
Compiling PREFS tests
Since fork is false, ignoring memoryMaximumSize setting
Compiling PRINT classes
Compiling Print tests
Since fork is false, ignoring memoryMaximumSize setting
Compiling REGEX classes
Compiling REGEX tests
Since fork is false, ignoring memoryMaximumSize setting
Compiling RMI classes
Compiling RMI api tests
Since fork is false, ignoring memoryMaximumSize setting
Running RMI api tests
testDirectSocket_SingleVM starting
Test server started.
Object: MyRemoteObject[UnicastServerRef[endpoint:[[10.125.122.37:2028]](local), ObjID[65536,
UID[205b5e68:1115aceef66:-8000]]]] created and exported.
Mar 16, 2007 6:53:06 PM org.apache.harmony.rmi.server.RMIReference makeStrong
FINER: main: Strongly referenced RegistryImpl
Registry created.
Object bound in the registry.
Registry located.
Mar 16, 2007 6:53:07 PM org.apache.harmony.rmi.client.ClientConnection sendDGCAck
FINER: main: Sent DGC ack to [localhost:1099] for UID[205b5e68:1115aceef66:-7ffd]
Lookup object is: Proxy[interf:[org.apache.harmony.rmi.test.MyRemoteInterface, java.rmi.Remote],
RemoteObjectInvocationHandler[UnicastRef[endpoint:[[10.125.122.37:2028]](remote), ObjID[65536,
UID[205b5e68:1115aceef66:-8000]]]]]
Testing test_String_Void...
Done.
Testing test_Void_String...
Returned: MyRemoteObject.test_Void_String
Done.
Testing test_Int_Void...
Done.
Testing test_Void_Int...
Returned: 987654321
Done.
Testing test_Remote_Void...
Done.
Testing test_Remote_Void with remote object extending another remote object...
Done.
Testing test_Void_Remote...
Mar 16, 2007 6:53:08 PM org.apache.harmony.rmi.client.ClientConnection sendDGCAck
FINER: main: Sent DGC ack to [10.125.122.37:2028] for UID[205b5e68:1115aceef66:-7fe8]
Returned: Proxy[interf:[org.apache.harmony.rmi.test.MyRemoteInterface2, java.rmi.Remote],
RemoteObjectInvocationHandler[UnicastRef[endpoint:[[10.125.122.37:2036]](remote), ObjID[65539,
UID[205b5e68:1115aceef66:-7fe9]]]]]
Done.
Testing test_Long_Long...
Returned: 998877665544332211
Done.
Testing test_String_String...
Returned: MyRemoteObject.test_String_String
Done.
Testing test_Remote_Remote...
Mar 16, 2007 6:53:08 PM org.apache.harmony.rmi.client.ClientConnection sendDGCAck
FINER: main: Sent DGC ack to [10.125.122.37:2028] for UID[205b5e68:1115aceef66:-7fde]
Returned: Proxy[interf:[org.apache.harmony.rmi.test.MyRemoteInterface2, java.rmi.Remote],
RemoteObjectInvocationHandler[UnicastRef[endpoint:[[10.125.122.37:2040]](remote), ObjID[65541,
UID[205b5e68:1115aceef66:-7fdf]]]]]
Done.
Testing test_RemoteString_Void...
Done.
Testing test_RemoteRemote_Remote...
Mar 16, 2007 6:53:08 PM org.apache.harmony.rmi.client.ClientConnection sendDGCAck
FINER: main: Sent DGC ack to [10.125.122.37:2028] for UID[205b5e68:1115aceef66:-7fd0]
Returned: Proxy[interf:[org.apache.harmony.rmi.test.MyRemoteInterface2, java.rmi.Remote],
RemoteObjectInvocationHandler[UnicastRef[endpoint:[[10.125.122.37:2048]](remote), ObjID[65545,
UID[205b5e68:1115aceef66:-7fd1]]]]]
Done.
Testing test_BooleanStringRemote_Void...
Done.
Testing test_Proxy_Void...
Done.
Testing test_Array_Void...
Done.
Testing test_Void_Array...
Done.
Testing test_RemoteArray_Void...
Done.
Testing test_Void_RemoteArray...
Mar 16, 2007 6:53:09 PM org.apache.harmony.rmi.client.ClientConnection sendDGCAck
FINER: main: Sent DGC ack to [10.125.122.37:2028] for UID[205b5e68:1115aceef66:-7fbd]
Done.
Testing test_Exception...
org.apache.harmony.rmi.test.MyException: MyRemoteObject.test_Exception
Done.
Testing test_Error...
java.rmi.ServerError: Error occurred while remote method invocation; nested exception is:
	java.lang.Error: MyRemoteObject.test_Error
Done.
Testing test_RuntimeException...
java.lang.RuntimeException: MyRemoteObject.text_RuntimeException
Done.
Testing test_RemoteException...
java.rmi.ServerException: RemoteException occurred while remote method invocation; nested
exception is:
	java.rmi.RemoteException: MyRemoteObject.text_RemoteException
Done.
Test server complete.
Test server closing.
Unexporting MyRemoteObject[UnicastServerRef[endpoint:[[10.125.122.37:2028]](local), ObjID[65536,
UID[205b5e68:1115aceef66:-8000]]]] ...
Done.
Unexporting MyRemoteObject1[UnicastServerRef[endpoint:[[10.125.122.37:2032]](local), ObjID[65537,
UID[205b5e68:1115aceef66:-7ff4]]]] ...
Done.
Unexporting MyRemoteObject4[UnicastServerRef[endpoint:[[10.125.122.37:2034]](local), ObjID[65538,
UID[205b5e68:1115aceef66:-7fef]]]] ...
Done.
Unexporting MyRemoteObject1[UnicastServerRef[endpoint:[[10.125.122.37:2038]](local), ObjID[65540,
UID[205b5e68:1115aceef66:-7fe3]]]] ...
Done.
Unexporting MyRemoteObject1[UnicastServerRef[endpoint:[[10.125.122.37:2041]](local), ObjID[65542,
UID[205b5e68:1115aceef66:-7fdd]]]] ...
Done.
Unexporting MyRemoteObject1[UnicastServerRef[endpoint:[[10.125.122.37:2043]](local), ObjID[65543,
UID[205b5e68:1115aceef66:-7fd8]]]] ...
Done.
Unexporting MyRemoteObject3[UnicastServerRef[endpoint:[[10.125.122.37:2044]](local), ObjID[65544,
UID[205b5e68:1115aceef66:-7fd7]]]] ...
Done.
Unexporting RegistryImpl ...
Done.
Unexporting MyRemoteObject1[UnicastServerRef[endpoint:[[10.125.122.37:2049]](local), ObjID[65546,
UID[205b5e68:1115aceef66:-7fcf]]]] ...
Done.
Unexporting MyRemoteObject1[UnicastServerRef[endpoint:[[10.125.122.37:2051]](local), ObjID[65547,
UID[205b5e68:1115aceef66:-7fc4]]]] ...
Done.
Unexporting MyRemoteObject1[UnicastServerRef[endpoint:[[10.125.122.37:2052]](local), ObjID[65548,
UID[205b5e68:1115aceef66:-7fc3]]]] ...
Done.
Test server exiting.
testDirectHTTP_SingleVM starting
Test server started.
Object: MyRemoteObject[UnicastServerRef[endpoint:[[10.125.122.37:2057]](local), ObjID[65536,
UID[205b5e68:1115acf1b48:-8000]]]] created and exported.
Mar 16, 2007 6:53:17 PM org.apache.harmony.rmi.server.RMIReference makeStrong
FINER: main: Strongly referenced RegistryImpl
Registry created.
Object bound in the registry.
Registry located.
Mar 16, 2007 6:53:19 PM org.apache.harmony.rmi.client.ClientConnection sendDGCAck
FINER: main: Sent DGC ack to [localhost:1099] for UID[205b5e68:1115acf1b48:-7ffd]
Lookup object is: Proxy[interf:[org.apache.harmony.rmi.test.MyRemoteInterface, java.rmi.Remote],
RemoteObjectInvocationHandler[UnicastRef[endpoint:[[10.125.122.37:2057]](remote), ObjID[65536,
UID[205b5e68:1115acf1b48:-8000]]]]]
Testing test_String_Void...
Done.
Testing test_Void_String...
Returned: MyRemoteObject.test_Void_String
Done.
Testing test_Int_Void...
Done.
Testing test_Void_Int...
Returned: 987654321
Done.
Testing test_Remote_Void...
Done.
Testing test_Remote_Void with remote object extending another remote object...
Done.
Testing test_Void_Remote...
Mar 16, 2007 6:53:19 PM org.apache.harmony.rmi.client.ClientConnection sendDGCAck
FINER: main: Sent DGC ack to [10.125.122.37:2057] for UID[205b5e68:1115acf1b48:-7fe8]
Returned: Proxy[interf:[org.apache.harmony.rmi.test.MyRemoteInterface2, java.rmi.Remote],
RemoteObjectInvocationHandler[UnicastRef[endpoint:[[10.125.122.37:2065]](remote), ObjID[65539,
UID[205b5e68:1115acf1b48:-7fe9]]]]]
Done.
Testing test_Long_Long...
Returned: 998877665544332211
Done.
Testing test_String_String...
Returned: MyRemoteObject.test_String_String
Done.
Testing test_Remote_Remote...
Mar 16, 2007 6:53:19 PM org.apache.harmony.rmi.client.ClientConnection sendDGCAck
FINER: main: Sent DGC ack to [10.125.122.37:2057] for UID[205b5e68:1115acf1b48:-7fde]
Returned: Proxy[interf:[org.apache.harmony.rmi.test.MyRemoteInterface2, java.rmi.Remote],
RemoteObjectInvocationHandler[UnicastRef[endpoint:[[10.125.122.37:2069]](remote), ObjID[65541,
UID[205b5e68:1115acf1b48:-7fdf]]]]]
Done.
Testing test_RemoteString_Void...
Done.
Testing test_RemoteRemote_Remote...
Mar 16, 2007 6:53:20 PM org.apache.harmony.rmi.client.ClientConnection sendDGCAck
FINER: main: Sent DGC ack to [10.125.122.37:2057] for UID[205b5e68:1115acf1b48:-7fd0]
Returned: Proxy[interf:[org.apache.harmony.rmi.test.MyRemoteInterface2, java.rmi.Remote],
RemoteObjectInvocationHandler[UnicastRef[endpoint:[[10.125.122.37:2076]](remote), ObjID[65545,
UID[205b5e68:1115acf1b48:-7fd1]]]]]
Done.
Testing test_BooleanStringRemote_Void...
Done.
Testing test_Proxy_Void...
Done.
Testing test_Array_Void...
Done.
Testing test_Void_Array...
Done.
Testing test_RemoteArray_Void...
Done.
Testing test_Void_RemoteArray...
Mar 16, 2007 6:53:20 PM org.apache.harmony.rmi.client.ClientConnection sendDGCAck
FINER: main: Sent DGC ack to [10.125.122.37:2057] for UID[205b5e68:1115acf1b48:-7fbd]
Done.
Testing test_Exception...
org.apache.harmony.rmi.test.MyException: MyRemoteObject.test_Exception
Done.
Testing test_Error...
java.rmi.ServerError: Error occurred while remote method invocation; nested exception is:
	java.lang.Error: MyRemoteObject.test_Error
Done.
Testing test_RuntimeException...
java.lang.RuntimeException: MyRemoteObject.text_RuntimeException
Done.
Testing test_RemoteException...
java.rmi.ServerException: RemoteException occurred while remote method invocation; nested
exception is:
	java.rmi.RemoteException: MyRemoteObject.text_RemoteException
Done.
Test server complete.
Test server closing.
Unexporting MyRemoteObject[UnicastServerRef[endpoint:[[10.125.122.37:2057]](local), ObjID[65536,
UID[205b5e68:1115acf1b48:-8000]]]] ...
Done.
Unexporting MyRemoteObject1[UnicastServerRef[endpoint:[[10.125.122.37:2061]](local), ObjID[65537,
UID[205b5e68:1115acf1b48:-7ff4]]]] ...
Done.
Unexporting MyRemoteObject4[UnicastServerRef[endpoint:[[10.125.122.37:2063]](local), ObjID[65538,
UID[205b5e68:1115acf1b48:-7fef]]]] ...
Done.
Unexporting MyRemoteObject1[UnicastServerRef[endpoint:[[10.125.122.37:2067]](local), ObjID[65540,
UID[205b5e68:1115acf1b48:-7fe3]]]] ...
Done.
Unexporting MyRemoteObject1[UnicastServerRef[endpoint:[[10.125.122.37:2070]](local), ObjID[65542,
UID[205b5e68:1115acf1b48:-7fdd]]]] ...
Done.
Unexporting MyRemoteObject1[UnicastServerRef[endpoint:[[10.125.122.37:2072]](local), ObjID[65543,
UID[205b5e68:1115acf1b48:-7fd8]]]] ...
Done.
Unexporting MyRemoteObject3[UnicastServerRef[endpoint:[[10.125.122.37:2073]](local), ObjID[65544,
UID[205b5e68:1115acf1b48:-7fd7]]]] ...
Done.
Unexporting RegistryImpl ...
Done.
Unexporting MyRemoteObject1[UnicastServerRef[endpoint:[[10.125.122.37:2077]](local), ObjID[65546,
UID[205b5e68:1115acf1b48:-7fcf]]]] ...
Done.
Unexporting MyRemoteObject1[UnicastServerRef[endpoint:[[10.125.122.37:2079]](local), ObjID[65547,
UID[205b5e68:1115acf1b48:-7fc4]]]] ...
Done.
Unexporting MyRemoteObject1[UnicastServerRef[endpoint:[[10.125.122.37:2080]](local), ObjID[65548,
UID[205b5e68:1115acf1b48:-7fc3]]]] ...
Done.
Test server exiting.
Unexporting MyRemoteObject1[UnicastServerRef[endpoint:[[10.125.122.37:2085]](local), ObjID[65536,
UID[20d6d384:1115acf420a:-7ff7]]]] ...
Done.
Unexporting MyRemoteObject1[UnicastServerRef[endpoint:[[10.125.122.37:2086]](local), ObjID[65537,
UID[20d6d384:1115acf420a:-7ff6]]]] ...
Done.
Unexporting MyRemoteObject1[UnicastServerRef[endpoint:[[10.125.122.37:2087]](local), ObjID[65538,
UID[20d6d384:1115acf420a:-7ff5]]]] ...
Done.
Unexporting MyRemoteObject1[UnicastServerRef[endpoint:[[10.125.122.37:2088]](local), ObjID[65539,
UID[20d6d384:1115acf420a:-7ff4]]]] ...
Done.
Unexporting MyRemoteObject1[UnicastServerRef[endpoint:[[10.125.122.37:2089]](local), ObjID[65540,
UID[20d6d384:1115acf420a:-7ff3]]]] ...
Done.
Unexporting MyRemoteObject1[UnicastServerRef[endpoint:[[10.125.122.37:2090]](local), ObjID[65541,
UID[20d6d384:1115acf420a:-7ff2]]]] ...
Done.
Unexporting MyRemoteObject1[UnicastServerRef[endpoint:[[10.125.122.37:2091]](local), ObjID[65542,
UID[20d6d384:1115acf420a:-7ff1]]]] ...
Done.
Unexporting MyRemoteObject1[UnicastServerRef[endpoint:[[10.125.122.37:2092]](local), ObjID[65543,
UID[20d6d384:1115acf420a:-7ff0]]]] ...
Done.
LogStream[tst]:
Compiling SECURITY classes
Compiling SECURITY test support files
Since fork is false, ignoring memoryMaximumSize setting
Compiling SECURITY api tests
Since fork is false, ignoring memoryMaximumSize setting
Compiling SECURITY api injected tests
Since fork is false, ignoring memoryMaximumSize setting
Compiling SECURITY impl injected tests
Since fork is false, ignoring memoryMaximumSize setting
Compiling SECURITY impl tests
Since fork is false, ignoring memoryMaximumSize setting
Running SECURITY api tests
Running SECURITY api.injected tests
Running SECURITY impl tests
Running SECURITY impl injected tests
Compiling SOUND classes
Compiling SOUND tests
Since fork is false, ignoring memoryMaximumSize setting
Compiling SQL classes
Compiling SQL tests
Since fork is false, ignoring memoryMaximumSize setting
Compiling Sun Compat classes
Compiling SUNCOMPAT tests
Compiling TEXT classes
Compiling TEXT tests
Since fork is false, ignoring memoryMaximumSize setting
Compiling TOOLS classes
Compiling Tools tests
Since fork is false, ignoring memoryMaximumSize setting
Compiling X-NET classes
Compiling X-NET test support files
Since fork is false, ignoring memoryMaximumSize setting
Compiling X-NET api tests
Since fork is false, ignoring memoryMaximumSize setting
Compiling X-NET impl injected tests
Since fork is false, ignoring memoryMaximumSize setting
Compiling X-NET impl tests
Since fork is false, ignoring memoryMaximumSize setting
Running X-NET api tests
Running X-NET impl tests
Running X-NET impl injected tests
The test report is in C:\cruise\trunk\cc\projects\classlib\trunk\build\test_report\html\index.html

***********************************************************
Unit Tests: (16235)
        
failure: testHarmony2305 java.awt.ButtonRTest
failure: testGetVisibleAmount java.awt.ScrollPaneAdjustableTest
Unit Test Error Details:	(2)
                
Test: testHarmony2305Class: java.awt.ButtonRTestjunit.framework.AssertionFailedError
	at java.awt.ButtonRTest.testHarmony2305(ButtonRTest.java:71)
	at java.lang.reflect.VMReflection.invokeMethod(VMReflection.java)

Test: testGetVisibleAmountClass: java.awt.ScrollPaneAdjustableTestjunit.framework.AssertionFailedError:
expected:<30> but was:<10>
	at java.awt.ScrollPaneAdjustableTest.testGetVisibleAmount(ScrollPaneAdjustableTest.java:145)
	at java.lang.reflect.VMReflection.invokeMethod(VMReflection.java)


***********************************************************
Modifications since last successful build:	(35)
            
modified gshimansky  /harmony/enhanced/classlib/trunk/modules/imageio/src/main/native/pngencoder
03/16/2007 18:05:12 More ignored files generated by pngdecoder natives
modified gshimansky  /harmony/enhanced/classlib/trunk/modules/imageio/src/main/native/pngencoder/unix
03/16/2007 18:05:12 More ignored files generated by pngdecoder natives
modified gshimansky  /harmony/enhanced/classlib/trunk/modules/imageio/src/main/native/pngencoder
03/16/2007 18:00:48 Added manifest and output log file to ignored
modified gshimansky  /harmony/enhanced/classlib/trunk/depends/libs/build 03/16/2007 18:00:48
Added manifest and output log file to ignored
add cc-drlvm log20070316165809Lbuild.292 03/16/2007 16:58:09drlvm
add cc-classlib log20070316165143Lbuild.224 03/16/2007 16:51:43classlib
modified varlax  /harmony/enhanced/drlvm/trunk/build/make/excludes/exclude.drlvm_smoke.windows.x86.int
03/16/2007 16:39:51 Applied HARMONY-3406 [drlvm][smoke tests] clean up excluded lists after
switching to test runs in 5 modes
modified varlax  /harmony/enhanced/drlvm/trunk/build/make/excludes/exclude.drlvm_smoke.windows.x86.srv
03/16/2007 16:39:51 Applied HARMONY-3406 [drlvm][smoke tests] clean up excluded lists after
switching to test runs in 5 modes
modified varlax  /harmony/enhanced/drlvm/trunk/build/make/excludes/exclude.drlvm_smoke.linux.x86.jit
03/16/2007 16:39:51 Applied HARMONY-3406 [drlvm][smoke tests] clean up excluded lists after
switching to test runs in 5 modes
modified varlax  /harmony/enhanced/drlvm/trunk/build/make/excludes/exclude.drlvm_smoke.linux.x86.int
03/16/2007 16:39:51 Applied HARMONY-3406 [drlvm][smoke tests] clean up excluded lists after
switching to test runs in 5 modes
modified varlax  /harmony/enhanced/drlvm/trunk/build/make/excludes/exclude.drlvm_smoke.linux.x86.srv
03/16/2007 16:39:51 Applied HARMONY-3406 [drlvm][smoke tests] clean up excluded lists after
switching to test runs in 5 modes
modified varlax  /harmony/enhanced/drlvm/trunk/build/make/excludes/exclude.drlvm_smoke.linux.x86_64.jet
03/16/2007 16:39:51 Applied HARMONY-3406 [drlvm][smoke tests] clean up excluded lists after
switching to test runs in 5 modes
modified varlax  /harmony/enhanced/drlvm/trunk/build/make/excludes/exclude.drlvm_smoke.linux.x86_64.opt
03/16/2007 16:39:51 Applied HARMONY-3406 [drlvm][smoke tests] clean up excluded lists after
switching to test runs in 5 modes
modified varlax  /harmony/enhanced/drlvm/trunk/build/make/excludes/exclude.drlvm_smoke.windows.x86.jet
03/16/2007 16:39:51 Applied HARMONY-3406 [drlvm][smoke tests] clean up excluded lists after
switching to test runs in 5 modes
modified varlax  /harmony/enhanced/drlvm/trunk/build/make/excludes/exclude.drlvm_smoke.windows.x86.opt
03/16/2007 16:39:51 Applied HARMONY-3406 [drlvm][smoke tests] clean up excluded lists after
switching to test runs in 5 modes
modified varlax  /harmony/enhanced/drlvm/trunk/build/make/excludes/exclude.drlvm_smoke.linux.x86_64.jit
03/16/2007 16:39:51 Applied HARMONY-3406 [drlvm][smoke tests] clean up excluded lists after
switching to test runs in 5 modes
modified varlax  /harmony/enhanced/drlvm/trunk/build/make/excludes/exclude.drlvm_smoke.windows.x86.jit
03/16/2007 16:39:51 Applied HARMONY-3406 [drlvm][smoke tests] clean up excluded lists after
switching to test runs in 5 modes
modified varlax  /harmony/enhanced/drlvm/trunk/build/make/excludes/exclude.drlvm_smoke.linux.x86.jet
03/16/2007 16:39:51 Applied HARMONY-3406 [drlvm][smoke tests] clean up excluded lists after
switching to test runs in 5 modes
modified varlax  /harmony/enhanced/drlvm/trunk/build/make/excludes/exclude.drlvm_smoke.linux.x86.opt
03/16/2007 16:39:51 Applied HARMONY-3406 [drlvm][smoke tests] clean up excluded lists after
switching to test runs in 5 modes
modified varlax  /harmony/enhanced/drlvm/trunk/build/make/excludes/exclude.drlvm_smoke.linux.x86_64.int
03/16/2007 16:39:51 Applied HARMONY-3406 [drlvm][smoke tests] clean up excluded lists after
switching to test runs in 5 modes
modified varlax  /harmony/enhanced/drlvm/trunk/build/make/excludes/exclude.drlvm_smoke.linux.x86_64.srv
03/16/2007 16:39:51 Applied HARMONY-3406 [drlvm][smoke tests] clean up excluded lists after
switching to test runs in 5 modes
added liangyx  /harmony/enhanced/classlib/trunk/modules/luni/src/test/java/tests/api/java/net/ExcludedProxyTest.java
03/16/2007 16:33:32 Apply patch for HARMONY-2097([classlib][luni] rewrite tests/api/java/net/HttpURLConnectionTest.java
which was excluded)
modified liangyx  /harmony/enhanced/classlib/trunk/modules/luni/src/test/java/tests/api/java/net/HttpURLConnectionTest.java
03/16/2007 16:33:32 Apply patch for HARMONY-2097([classlib][luni] rewrite tests/api/java/net/HttpURLConnectionTest.java
which was excluded)
modified liangyx  /harmony/enhanced/classlib/trunk/modules/luni/make/exclude.common 03/16/2007
16:33:32 Apply patch for HARMONY-2097([classlib][luni] rewrite tests/api/java/net/HttpURLConnectionTest.java
which was excluded)
modified liangyx  /harmony/enhanced/classlib/trunk/modules/luni/build.xml 03/16/2007 16:33:32
Apply patch for HARMONY-2097([classlib][luni] rewrite tests/api/java/net/HttpURLConnectionTest.java
which was excluded)
modified ayza  /harmony/enhanced/classlib/trunk/modules/awt/make/exclude.common 03/16/2007
16:26:34 Big cleanup of AWT exclude lists. Many passing tests were removed. Inspired by HARMONY-1979.
modified ayza  /harmony/enhanced/classlib/trunk/modules/awt/build.xml 03/16/2007 16:26:34
Big cleanup of AWT exclude lists. Many passing tests were removed. Inspired by HARMONY-1979.
modified ayza  /harmony/enhanced/classlib/trunk/modules/awt/make/exclude.linux.x86.ibm 03/16/2007
16:26:34 Big cleanup of AWT exclude lists. Many passing tests were removed. Inspired by HARMONY-1979.
modified ayza  /harmony/enhanced/classlib/trunk/modules/awt/make/exclude.windows.x86.drl.interm
03/16/2007 16:26:34 Big cleanup of AWT exclude lists. Many passing tests were removed. Inspired
by HARMONY-1979.
modified ayza  /harmony/enhanced/classlib/trunk/modules/awt/make/exclude.linux.x86_64.drl
03/16/2007 16:26:34 Big cleanup of AWT exclude lists. Many passing tests were removed. Inspired
by HARMONY-1979.
modified ayza  /harmony/enhanced/classlib/trunk/modules/awt/make/exclude.interm 03/16/2007
16:26:34 Big cleanup of AWT exclude lists. Many passing tests were removed. Inspired by HARMONY-1979.
modified ayza  /harmony/enhanced/classlib/trunk/modules/awt/make/exclude.windows.x86.drl 03/16/2007
16:26:34 Big cleanup of AWT exclude lists. Many passing tests were removed. Inspired by HARMONY-1979.
modified ayza  /harmony/enhanced/classlib/trunk/modules/awt/make/exclude.linux.x86_64.ibm
03/16/2007 16:26:34 Big cleanup of AWT exclude lists. Many passing tests were removed. Inspired
by HARMONY-1979.
modified ayza  /harmony/enhanced/classlib/trunk/modules/awt/make/exclude.linux.x86.drl 03/16/2007
16:26:34 Big cleanup of AWT exclude lists. Many passing tests were removed. Inspired by HARMONY-1979.
modified ayza  /harmony/enhanced/classlib/trunk/modules/awt/make/exclude.windows.x86.ibm 03/16/2007
16:26:34 Big cleanup of AWT exclude lists. Many passing tests were removed. Inspired by HARMONY-1979.

Mime
View raw message