harmony-alerts mailing list archives

Site index · List index
Message view « Date » · « Thread »
Top « Date » · « Thread »
From nom...@hursley.ibm.com
Subject [continuum] BUILD FAILURE: Classlib/linux.ia32 Build/Test
Date Tue, 13 Mar 2007 17:56:58 GMT
Online report : http://people.apache.org/~hindessm/continuum/classlib/linux.ia32/2007/03/13/20070313-175658.failure.log.gz
Build statistics:
  State: Failed
  Previous State: Failed
  Started at: Tue, 13 Mar 2007 16:46:35 +0000
  Finished at: Tue, 13 Mar 2007 17:56:55 +0000
  Total time: 1h 10m 20s
  Build Trigger: Schedule
  Exit code: 1
  Building machine hostname: hy2
  Operating system : Linux(unknown)
  Java version : 1.5.0_06(Sun Microsystems Inc.)

Changes
                            classlib/modules/swing/src/test/api/java/common/javax/swing/plaf/basic/BasicTabbedPaneUITest.java
            classlib/modules/swing/src/main/java/common/javax/swing/plaf/basic/BasicTabbedPaneUI.java
            classlib/modules/portlib/src/main/native/port/unix/freebsd/hyvmem.c
            classlib/modules/portlib/src/main/native/port/unix/freebsd/hymmap.c
            classlib/modules/portlib/src/main/native/port/unix/linux/hyvmem.c
            classlib/modules/portlib/src/main/native/port/unix/linux/hymmap.c
            classlib/modules/portlib/src/main/native/port/unix/makefile
        
****************************************************************************
Output:
****************************************************************************
Buildfile: build.xml

svn-prop:

build:
   [delete] Deleting directory /home/hybld/continuum-working-directory/6/classlib/deploy
     [echo] Classlib revision is 517765
     [echo] Post process: true
     [echo] JAPI: true
     [echo] Building with reference jdk/javac
     [exec] Buildfile: build.xml

     [exec] -init-hdk-for-clean:
     [exec]     [mkdir] Created dir: /home/hybld/continuum-working-directory/6/classlib/deploy/build/ant
     [exec]      [copy] Copying 1 file to /home/hybld/continuum-working-directory/6/classlib/deploy/build/ant

     [exec] clean-java:

     [exec] -modules-clean-bin:

     [exec] clean:
     [exec]    [delete] Deleting 30 files from /home/hybld/continuum-working-directory/6/classlib/build/classes
     [exec]    [delete] Deleting 12 files from /home/hybld/continuum-working-directory/6/classlib/modules/accessibility/bin/test

     [exec] clean:
     [exec]    [delete] Deleting 13 files from /home/hybld/continuum-working-directory/6/classlib/build/classes
     [exec]    [delete] Deleting 1 files from /home/hybld/continuum-working-directory/6/classlib/modules/annotation/bin/test

     [exec] clean:
     [exec]    [delete] Deleting 35 files from /home/hybld/continuum-working-directory/6/classlib/build/classes
     [exec]    [delete] Deleting 1 files from /home/hybld/continuum-working-directory/6/classlib/modules/applet/bin/test

     [exec] clean:
     [exec]    [delete] Deleting 42 files from /home/hybld/continuum-working-directory/6/classlib/build/classes
     [exec]    [delete] Deleting 35 files from /home/hybld/continuum-working-directory/6/classlib/modules/archive/bin/test

     [exec] clean-native-includes:
     [exec]    [delete] /home/hybld/continuum-working-directory/6/classlib/deploy/include
not found.

     [exec] clean:
     [exec]    [delete] Deleting 112 files from /home/hybld/continuum-working-directory/6/classlib/build/classes
     [exec]    [delete] Deleting 226 files from /home/hybld/continuum-working-directory/6/classlib/modules/auth/bin/test

     [exec] clean:
     [exec]    [delete] Deleting 908 files from /home/hybld/continuum-working-directory/6/classlib/build/classes
     [exec]    [delete] Deleting 615 files from /home/hybld/continuum-working-directory/6/classlib/modules/awt/bin/test

     [exec] clean:
     [exec]    [delete] Deleting 107 files from /home/hybld/continuum-working-directory/6/classlib/build/classes
     [exec]    [delete] Deleting 238 files from /home/hybld/continuum-working-directory/6/classlib/modules/beans/bin/test

     [exec] clean:
     [exec]    [delete] Deleting 125 files from /home/hybld/continuum-working-directory/6/classlib/build/classes
     [exec]    [delete] /home/hybld/continuum-working-directory/6/classlib/modules/concurrent/bin/test
not found.

     [exec] clean:
     [exec]    [delete] Deleting 48 files from /home/hybld/continuum-working-directory/6/classlib/build/classes
     [exec]    [delete] Deleting 90 files from /home/hybld/continuum-working-directory/6/classlib/modules/crypto/bin/test

     [exec] clean:
     [exec]    [delete] Deleting 87 files from /home/hybld/continuum-working-directory/6/classlib/build/classes

     [exec] clean:
     [exec]    [delete] Deleting 9 files from /home/hybld/continuum-working-directory/6/classlib/build/classes
     [exec]    [delete] Deleting 20 files from /home/hybld/continuum-working-directory/6/classlib/modules/instrument/bin/test

     [exec] clean:
     [exec]    [delete] Deleting 177 files from /home/hybld/continuum-working-directory/6/classlib/build/classes
     [exec]    [delete] Deleting 192 files from /home/hybld/continuum-working-directory/6/classlib/modules/jndi/bin/test

     [exec] clean:
     [exec]    [delete] Deleting 43 files from /home/hybld/continuum-working-directory/6/classlib/build/classes
     [exec]    [delete] /home/hybld/continuum-working-directory/6/classlib/modules/lang-management/${hy.lang-management.bin.test}
not found.

     [exec] clean:
     [exec]    [delete] Deleting 34 files from /home/hybld/continuum-working-directory/6/classlib/build/classes
     [exec]    [delete] Deleting 100 files from /home/hybld/continuum-working-directory/6/classlib/modules/logging/bin/test

     [exec] clean:
     [exec]    [delete] Deleting 965 files from /home/hybld/continuum-working-directory/6/classlib/build/classes
     [exec]    [delete] Deleting 917 files from /home/hybld/continuum-working-directory/6/classlib/modules/luni/bin/test

     [exec] clean-native-includes:
     [exec]    [delete] /home/hybld/continuum-working-directory/6/classlib/deploy/include
not found.
     [exec]    [delete] /home/hybld/continuum-working-directory/6/classlib/deploy/jdk/include
not found.

     [exec] clean:
     [exec]    [delete] Deleting 29 files from /home/hybld/continuum-working-directory/6/classlib/build/classes

     [exec] clean:
     [exec]    [delete] Deleting 14 files from /home/hybld/continuum-working-directory/6/classlib/build/classes
     [exec]    [delete] Deleting 25 files from /home/hybld/continuum-working-directory/6/classlib/modules/math/bin/test

     [exec] clean:
     [exec]    [delete] Deleting 14 files from /home/hybld/continuum-working-directory/6/classlib/build/classes
     [exec]    [delete] Deleting 1 files from /home/hybld/continuum-working-directory/6/classlib/modules/misc/bin/test

     [exec] clean:
     [exec]    [delete] Deleting 142 files from /home/hybld/continuum-working-directory/6/classlib/build/classes
     [exec]    [delete] Deleted 5 directories from /home/hybld/continuum-working-directory/6/classlib/build/classes
     [exec]    [delete] Deleting 156 files from /home/hybld/continuum-working-directory/6/classlib/modules/nio/bin/test
     [exec]    [delete] Deleted 19 directories from /home/hybld/continuum-working-directory/6/classlib/modules/nio/bin/test

     [exec] clean:
     [exec]    [delete] Deleting 20 files from /home/hybld/continuum-working-directory/6/classlib/build/classes
     [exec]    [delete] Deleting 79 files from /home/hybld/continuum-working-directory/6/classlib/modules/nio_char/bin/test

     [exec] clean:
     [exec]    [delete] Deleting 37 files from /home/hybld/continuum-working-directory/6/classlib/build/classes
     [exec]    [delete] Deleting 16 files from /home/hybld/continuum-working-directory/6/classlib/modules/pack200/bin/test

     [exec] clean-native-includes:
     [exec]    [delete] /home/hybld/continuum-working-directory/6/classlib/deploy/include
not found.

     [exec] clean:

     [exec] clean:
     [exec]    [delete] Deleting 32 files from /home/hybld/continuum-working-directory/6/classlib/build/classes
     [exec]    [delete] Deleting 34 files from /home/hybld/continuum-working-directory/6/classlib/modules/prefs/bin/test

     [exec] clean:
     [exec]    [delete] Deleting 205 files from /home/hybld/continuum-working-directory/6/classlib/build/classes
     [exec]    [delete] Deleting 60 files from /home/hybld/continuum-working-directory/6/classlib/modules/print/bin/test

     [exec] clean:
     [exec]    [delete] Deleting 177 files from /home/hybld/continuum-working-directory/6/classlib/build/classes
     [exec]    [delete] Deleting 13 files from /home/hybld/continuum-working-directory/6/classlib/modules/regex/bin/test

     [exec] clean:
     [exec]    [delete] Deleting 230 files from /home/hybld/continuum-working-directory/6/classlib/build/classes
     [exec]    [delete] Deleting 53 files from /home/hybld/continuum-working-directory/6/classlib/modules/rmi/bin/test

     [exec] clean:
     [exec]    [delete] Deleting 428 files from /home/hybld/continuum-working-directory/6/classlib/build/classes
     [exec]    [delete] Deleting 617 files from /home/hybld/continuum-working-directory/6/classlib/modules/security/bin/test

     [exec] clean:
     [exec]    [delete] Deleting 2 files from /home/hybld/continuum-working-directory/6/classlib/build/classes

     [exec] clean:
     [exec]    [delete] Deleting 74 files from /home/hybld/continuum-working-directory/6/classlib/build/classes
     [exec]    [delete] Deleting 54 files from /home/hybld/continuum-working-directory/6/classlib/modules/sound/bin/test

     [exec] clean:
     [exec]    [delete] Deleting 75 files from /home/hybld/continuum-working-directory/6/classlib/build/classes
     [exec]    [delete] Deleting 57 files from /home/hybld/continuum-working-directory/6/classlib/modules/sql/bin/test

     [exec] clean:
     [exec]    [delete] Deleting 6 files from /home/hybld/continuum-working-directory/6/classlib/build/classes

     [exec] clean:
     [exec]    [delete] Deleting 1619 files from /home/hybld/continuum-working-directory/6/classlib/build/classes
     [exec]    [delete] Deleting 4 files from /home/hybld/continuum-working-directory/6/classlib/build/classes
     [exec]    [delete] Deleting 1581 files from /home/hybld/continuum-working-directory/6/classlib/modules/swing/bin/test

     [exec] clean:
     [exec]    [delete] Deleting 40 files from /home/hybld/continuum-working-directory/6/classlib/build/classes

...

     [exec]     [junit] Write /home/hybld/continuum-working-directory/6/classlib/modules/awt/bin/test/java/awt/serialization/java.awt.Rectangle[x=0,y=0,width=1,height=2].actual
     [exec]     [junit] Write /home/hybld/continuum-working-directory/6/classlib/modules/awt/bin/test/java/awt/serialization/java.awt.Rectangle[x=1,y=2,width=3,height=4].actual
     [exec]     [junit] Tests run: 44, Failures: 0, Errors: 0, Time elapsed: 0.024 sec
     [exec]     [junit] Tests run: 17, Failures: 3, Errors: 0, Time elapsed: 15.883 sec
     [exec]     [junit] TEST java.awt.RobotTest FAILED
     [exec]     [junit] Tests run: 19, Failures: 0, Errors: 0, Time elapsed: 0.039 sec
     [exec]     [junit] Tests run: 29, Failures: 0, Errors: 0, Time elapsed: 0.029 sec
     [exec]     [junit] Tests run: 1, Failures: 0, Errors: 0, Time elapsed: 0.005 sec
     [exec]     [junit] Tests run: 1, Failures: 0, Errors: 0, Time elapsed: 0.005 sec
     [exec]     [junit] Tests run: 1, Failures: 0, Errors: 0, Time elapsed: 0.01 sec

...

     [exec]     [junit] Tests run: 4, Failures: 0, Errors: 0, Time elapsed: 0.003 sec
     [exec]     [junit] Tests run: 1, Failures: 0, Errors: 0, Time elapsed: 0.106 sec
     [exec]     [junit] Tests run: 2, Failures: 0, Errors: 0, Time elapsed: 0.005 sec
     [exec]     [junit] Tests run: 1, Failures: 0, Errors: 0, Time elapsed: 0.004 sec
     [exec]     [junit] Tests FAILED
     [exec]     [junit] Running org.apache.harmony.awt.HeadlessTest
     [exec]     [junit] Tests run: 5, Failures: 0, Errors: 0, Time elapsed: 1.454 sec

     [exec] touch-failures-file:


...

     [exec]     [junit] org.apache.harmony.rmi.test.MyException: MyRemoteObject.test_Exception
     [exec]     [junit] Done.

     [exec]     [junit] Testing test_Error...
     [exec]     [junit] java.rmi.ServerError: Error occurred while remote method invocation;
nested exception is:
     [exec]     [junit] 	java.lang.Error: MyRemoteObject.test_Error
     [exec]     [junit] Done.

     [exec]     [junit] Testing test_RuntimeException...
     [exec]     [junit] java.lang.RuntimeException: MyRemoteObject.text_RuntimeException
     [exec]     [junit] Done.

...

     [exec]     [junit] org.apache.harmony.rmi.test.MyException: MyRemoteObject.test_Exception
     [exec]     [junit] Done.

     [exec]     [junit] Testing test_Error...
     [exec]     [junit] java.rmi.ServerError: Error occurred while remote method invocation;
nested exception is:
     [exec]     [junit] 	java.lang.Error: MyRemoteObject.test_Error
     [exec]     [junit] Done.

     [exec]     [junit] Testing test_RuntimeException...
     [exec]     [junit] java.lang.RuntimeException: MyRemoteObject.text_RuntimeException
     [exec]     [junit] Done.

...

     [exec] gen-report:

     [exec] check-test-result:

     [exec] BUILD FAILED
     [exec] /home/hybld/continuum-working-directory/6/classlib/build.xml:167: The following
error occurred while executing this line:
     [exec] /home/hybld/continuum-working-directory/6/classlib/make/build-test.xml:139: There
were test failures.

     [exec] Total time: 53 minutes 2 seconds
     [exec] Result: 1
     [echo] Tests.failed is set to true

japi:

     [exec] Processing class java.lang,Object:+
     [exec] Processing package java.lang,:=============================================================================+-++++++++++++++++++++++++-+++++++++++++++++++++++++++++++++++++++++++++++++--^+^+++++++++--++++++++++

...

     [exec] Processing package java.lang.management,:=============================================================================++++-+++++++++++
     [exec] Processing package java.lang.ref,:=============================================================================+++++
     [exec] Processing package java.lang.reflect,:=============================================================================+++++++++++++++++++++
     [exec] Processing class ,java:
     [exec] Failed to Japize java: java.lang.RuntimeException: NoClassDefFoundError: java
     [exec] java.lang.RuntimeException: NoClassDefFoundError: java
     [exec] 	at net.wuffies.japi.ClassFile.forName(ClassFile.java:163)
     [exec] 	at net.wuffies.japi.Japize.getClassWrapper(Japize.java:1425)
     [exec] 	at net.wuffies.japi.Japize.japizeClass(Japize.java:748)
     [exec] 	at net.wuffies.japi.Japize.processClass(Japize.java:516)

...

     [exec] 	at net.wuffies.japi.Japize.doJapize(Japize.java:443)
     [exec] 	at net.wuffies.japi.Japize.main(Japize.java:316)

     [exec] Processing class ,javax:
     [exec] Failed to Japize javax: java.lang.RuntimeException: NoClassDefFoundError: javax
     [exec] java.lang.RuntimeException: NoClassDefFoundError: javax
     [exec] 	at net.wuffies.japi.ClassFile.forName(ClassFile.java:163)
     [exec] 	at net.wuffies.japi.Japize.getClassWrapper(Japize.java:1425)
     [exec] 	at net.wuffies.japi.Japize.japizeClass(Japize.java:748)
     [exec] 	at net.wuffies.japi.Japize.processClass(Japize.java:516)

...

     [exec] 	at net.wuffies.japi.Japize.doJapize(Japize.java:443)
     [exec] 	at net.wuffies.japi.Japize.main(Japize.java:316)

     [exec] Processing class ,org:
     [exec] Failed to Japize org: java.lang.RuntimeException: NoClassDefFoundError: org
     [exec] java.lang.RuntimeException: NoClassDefFoundError: org
     [exec] 	at net.wuffies.japi.ClassFile.forName(ClassFile.java:163)
     [exec] 	at net.wuffies.japi.Japize.getClassWrapper(Japize.java:1425)
     [exec] 	at net.wuffies.japi.Japize.japizeClass(Japize.java:748)
     [exec] 	at net.wuffies.japi.Japize.processClass(Japize.java:516)

...

     [exec] Processing package javax.sql.rowset,:=============================================================================+++++++++
     [exec] Processing package javax.sql.rowset.serial,:=============================================================================++++++
     [exec] Processing package javax.sql.rowset.spi,:=============================================================================++++++++
     [exec] Processing package javax.swing,:=============================================================================++--+-++++++--++++++++++++++++--------------------------------+++---++++++++--
     [exec] Failed to Japize javax.swing.DefaultSingleSelectionModel: java.lang.ArrayIndexOutOfBoundsException
     [exec] java.lang.ArrayIndexOutOfBoundsException
     [exec] 	at java.util.Arrays.mergeSort(Arrays.java:2470)
     [exec] 	at java.util.Arrays.mergeSort(Arrays.java:2431)
     [exec] 	at java.util.Arrays.sort(Arrays.java:2369)
     [exec] 	at java.util.Arrays.sort(Arrays.java:2329)

...

     [exec] 	at net.wuffies.japi.Japize.processRootSet(Japize.java:471)
     [exec] 	at net.wuffies.japi.Japize.doJapize(Japize.java:443)
     [exec] 	at net.wuffies.japi.Japize.main(Japize.java:316)

     [exec] Failed to Japize javax.swing.DesktopManager: java.lang.ArrayIndexOutOfBoundsException
     [exec] java.lang.ArrayIndexOutOfBoundsException
     [exec] 	at java.util.Arrays.mergeSort(Arrays.java:2452)
     [exec] 	at java.util.Arrays.mergeSort(Arrays.java:2432)
     [exec] 	at java.util.Arrays.sort(Arrays.java:2369)
     [exec] 	at java.util.Arrays.sort(Arrays.java:2329)

...

     [exec] 	at net.wuffies.japi.Japize.processRootSet(Japize.java:471)
     [exec] 	at net.wuffies.japi.Japize.doJapize(Japize.java:443)
     [exec] 	at net.wuffies.japi.Japize.main(Japize.java:316)

     [exec] Failed to Japize javax.swing.FocusManager: java.lang.ArrayIndexOutOfBoundsException
     [exec] java.lang.ArrayIndexOutOfBoundsException
     [exec] 	at java.util.Arrays.mergeSort(Arrays.java:2452)
     [exec] 	at java.util.Arrays.sort(Arrays.java:2369)
     [exec] 	at java.util.Arrays.sort(Arrays.java:2329)
     [exec] 	at net.wuffies.japi.BoundMemberSet.getFields(BoundMemberSet.java:33)

...

     [exec] 	at net.wuffies.japi.Japize.processRootSet(Japize.java:471)
     [exec] 	at net.wuffies.japi.Japize.doJapize(Japize.java:443)
     [exec] 	at net.wuffies.japi.Japize.main(Japize.java:316)

     [exec] Failed to Japize javax.swing.GrayFilter: java.lang.ArrayIndexOutOfBoundsException
     [exec] java.lang.ArrayIndexOutOfBoundsException
     [exec] 	at java.util.Arrays.mergeSort(Arrays.java:2452)
     [exec] 	at java.util.Arrays.sort(Arrays.java:2369)
     [exec] 	at java.util.Arrays.sort(Arrays.java:2329)
     [exec] 	at net.wuffies.japi.BoundMemberSet.getFields(BoundMemberSet.java:33)

...

     [exec] 	at net.wuffies.japi.Japize.processRootSet(Japize.java:471)
     [exec] 	at net.wuffies.japi.Japize.doJapize(Japize.java:443)
     [exec] 	at net.wuffies.japi.Japize.main(Japize.java:316)
     [exec] ---+
     [exec] Failed to Japize javax.swing.ImageIcon: java.lang.ArrayIndexOutOfBoundsException
     [exec] java.lang.ArrayIndexOutOfBoundsException
     [exec] 	at java.util.Arrays.mergeSort(Arrays.java:2460)
     [exec] 	at java.util.Arrays.sort(Arrays.java:2369)
     [exec] 	at java.util.Arrays.sort(Arrays.java:2329)
     [exec] 	at net.wuffies.japi.BoundMemberSet.getFields(BoundMemberSet.java:33)

...

     [exec] 	at net.wuffies.japi.Japize.processRootSet(Japize.java:471)
     [exec] 	at net.wuffies.japi.Japize.doJapize(Japize.java:443)
     [exec] 	at net.wuffies.japi.Japize.main(Japize.java:316)

     [exec] Failed to Japize javax.swing.ImageIcon$AccessibleImageIcon: java.lang.ArrayIndexOutOfBoundsException
     [exec] java.lang.ArrayIndexOutOfBoundsException
     [exec] 	at java.util.Arrays.mergeSort(Arrays.java:2450)
     [exec] 	at java.util.Arrays.mergeSort(Arrays.java:2432)
     [exec] 	at java.util.Arrays.sort(Arrays.java:2369)
     [exec] 	at java.util.Arrays.sort(Arrays.java:2329)

...

     [exec] 	at net.wuffies.japi.Japize.processRootSet(Japize.java:471)
     [exec] 	at net.wuffies.japi.Japize.doJapize(Japize.java:443)
     [exec] 	at net.wuffies.japi.Japize.main(Japize.java:316)

     [exec] Failed to Japize javax.swing.InputMap: java.lang.ArrayIndexOutOfBoundsException
     [exec] java.lang.ArrayIndexOutOfBoundsException
     [exec] 	at java.util.Arrays.mergeSort(Arrays.java:2458)
     [exec] 	at java.util.Arrays.mergeSort(Arrays.java:2432)
     [exec] 	at java.util.Arrays.sort(Arrays.java:2369)
     [exec] 	at java.util.Arrays.sort(Arrays.java:2329)

...

     [exec] 	at net.wuffies.japi.Japize.processRootSet(Japize.java:471)
     [exec] 	at net.wuffies.japi.Japize.doJapize(Japize.java:443)
     [exec] 	at net.wuffies.japi.Japize.main(Japize.java:316)

     [exec] Failed to Japize javax.swing.InputVerifier: java.lang.ArrayIndexOutOfBoundsException
     [exec] java.lang.ArrayIndexOutOfBoundsException
     [exec] 	at java.util.Arrays.mergeSort(Arrays.java:2452)
     [exec] 	at java.util.Arrays.sort(Arrays.java:2369)
     [exec] 	at java.util.Arrays.sort(Arrays.java:2329)
     [exec] 	at net.wuffies.japi.BoundMemberSet.getCalls(BoundMemberSet.java:46)

...

     [exec] 	at net.wuffies.japi.Japize.processRootSet(Japize.java:471)
     [exec] 	at net.wuffies.japi.Japize.doJapize(Japize.java:443)
     [exec] 	at net.wuffies.japi.Japize.main(Japize.java:316)

     [exec] Failed to Japize javax.swing.InternalFrameFocusTraversalPolicy: java.lang.ArrayIndexOutOfBoundsException
     [exec] java.lang.ArrayIndexOutOfBoundsException
     [exec] 	at java.util.Arrays.mergeSort(Arrays.java:2452)
     [exec] 	at java.util.Arrays.mergeSort(Arrays.java:2431)
     [exec] 	at java.util.Arrays.sort(Arrays.java:2369)
     [exec] 	at java.util.Arrays.sort(Arrays.java:2329)

...

     [exec] 	at net.wuffies.japi.Japize.processRootSet(Japize.java:471)
     [exec] 	at net.wuffies.japi.Japize.doJapize(Japize.java:443)
     [exec] 	at net.wuffies.japi.Japize.main(Japize.java:316)

     [exec] Failed to Japize javax.swing.JApplet: java.lang.ArrayIndexOutOfBoundsException
     [exec] java.lang.ArrayIndexOutOfBoundsException
     [exec] 	at java.util.Arrays.mergeSort(Arrays.java:2460)
     [exec] 	at java.util.Arrays.sort(Arrays.java:2369)
     [exec] 	at java.util.Arrays.sort(Arrays.java:2329)
     [exec] 	at net.wuffies.japi.BoundMemberSet.getFields(BoundMemberSet.java:33)

...

     [exec] 	at net.wuffies.japi.Japize.processRootSet(Japize.java:471)
     [exec] 	at net.wuffies.japi.Japize.doJapize(Japize.java:443)
     [exec] 	at net.wuffies.japi.Japize.main(Japize.java:316)

     [exec] Failed to Japize javax.swing.JApplet$AccessibleJApplet: java.lang.ArrayIndexOutOfBoundsException
     [exec] java.lang.ArrayIndexOutOfBoundsException
     [exec] 	at java.util.Arrays.mergeSort(Arrays.java:2452)
     [exec] 	at java.util.Arrays.mergeSort(Arrays.java:2432)
     [exec] 	at java.util.Arrays.sort(Arrays.java:2369)
     [exec] 	at java.util.Arrays.sort(Arrays.java:2329)

...

     [exec] 	at net.wuffies.japi.Japize.processRootSet(Japize.java:471)
     [exec] 	at net.wuffies.japi.Japize.doJapize(Japize.java:443)
     [exec] 	at net.wuffies.japi.Japize.main(Japize.java:316)

     [exec] Failed to Japize javax.swing.JButton: java.lang.ArrayIndexOutOfBoundsException
     [exec] java.lang.ArrayIndexOutOfBoundsException
     [exec] 	at java.util.Arrays.mergeSort(Arrays.java:2458)
     [exec] 	at java.util.Arrays.mergeSort(Arrays.java:2432)
     [exec] 	at java.util.Arrays.sort(Arrays.java:2369)
     [exec] 	at java.util.Arrays.sort(Arrays.java:2329)

...

     [exec] 	at net.wuffies.japi.Japize.processRootSet(Japize.java:471)
     [exec] 	at net.wuffies.japi.Japize.doJapize(Japize.java:443)
     [exec] 	at net.wuffies.japi.Japize.main(Japize.java:316)

     [exec] Failed to Japize javax.swing.JButton$AccessibleJButton: java.lang.ArrayIndexOutOfBoundsException
     [exec] java.lang.ArrayIndexOutOfBoundsException
     [exec] 	at java.util.Arrays.mergeSort(Arrays.java:2452)
     [exec] 	at java.util.Arrays.sort(Arrays.java:2369)
     [exec] 	at java.util.Arrays.sort(Arrays.java:2329)
     [exec] 	at net.wuffies.japi.BoundMemberSet.getCalls(BoundMemberSet.java:46)

...

     [exec] 	at net.wuffies.japi.Japize.processRootSet(Japize.java:471)
     [exec] 	at net.wuffies.japi.Japize.doJapize(Japize.java:443)
     [exec] 	at net.wuffies.japi.Japize.main(Japize.java:316)

     [exec] Failed to Japize javax.swing.JCheckBox: java.lang.ArrayIndexOutOfBoundsException
     [exec] java.lang.ArrayIndexOutOfBoundsException
     [exec] 	at java.util.Arrays.mergeSort(Arrays.java:2458)
     [exec] 	at java.util.Arrays.mergeSort(Arrays.java:2432)
     [exec] 	at java.util.Arrays.sort(Arrays.java:2369)
     [exec] 	at java.util.Arrays.sort(Arrays.java:2329)

...

     [exec] 	at net.wuffies.japi.Japize.processRootSet(Japize.java:471)
     [exec] 	at net.wuffies.japi.Japize.doJapize(Japize.java:443)
     [exec] 	at net.wuffies.japi.Japize.main(Japize.java:316)

     [exec] Failed to Japize javax.swing.JCheckBox$AccessibleJCheckBox: java.lang.ArrayIndexOutOfBoundsException
     [exec] java.lang.ArrayIndexOutOfBoundsException
     [exec] 	at java.util.Arrays.mergeSort(Arrays.java:2452)
     [exec] 	at java.util.Arrays.sort(Arrays.java:2369)
     [exec] 	at java.util.Arrays.sort(Arrays.java:2329)
     [exec] 	at net.wuffies.japi.BoundMemberSet.getCalls(BoundMemberSet.java:46)

...

     [exec] 	at net.wuffies.japi.Japize.processRootSet(Japize.java:471)
     [exec] 	at net.wuffies.japi.Japize.doJapize(Japize.java:443)
     [exec] 	at net.wuffies.japi.Japize.main(Japize.java:316)

     [exec] Failed to Japize javax.swing.JCheckBoxMenuItem: java.lang.ArrayIndexOutOfBoundsException
     [exec] java.lang.ArrayIndexOutOfBoundsException
     [exec] 	at java.util.Arrays.mergeSort(Arrays.java:2458)
     [exec] 	at java.util.Arrays.mergeSort(Arrays.java:2432)
     [exec] 	at java.util.Arrays.sort(Arrays.java:2369)
     [exec] 	at java.util.Arrays.sort(Arrays.java:2329)

...

     [exec] 	at net.wuffies.japi.Japize.processRootSet(Japize.java:471)
     [exec] 	at net.wuffies.japi.Japize.doJapize(Japize.java:443)
     [exec] 	at net.wuffies.japi.Japize.main(Japize.java:316)

     [exec] Failed to Japize javax.swing.JCheckBoxMenuItem$AccessibleJCheckBoxMenuItem: java.lang.ArrayIndexOutOfBoundsException
     [exec] java.lang.ArrayIndexOutOfBoundsException
     [exec] 	at java.util.Arrays.mergeSort(Arrays.java:2452)
     [exec] 	at java.util.Arrays.sort(Arrays.java:2369)
     [exec] 	at java.util.Arrays.sort(Arrays.java:2329)
     [exec] 	at net.wuffies.japi.BoundMemberSet.getCalls(BoundMemberSet.java:46)

...

     [exec] 	at net.wuffies.japi.Japize.processRootSet(Japize.java:471)
     [exec] 	at net.wuffies.japi.Japize.doJapize(Japize.java:443)
     [exec] 	at net.wuffies.japi.Japize.main(Japize.java:316)

     [exec] Failed to Japize javax.swing.JColorChooser: java.lang.ArrayIndexOutOfBoundsException
     [exec] java.lang.ArrayIndexOutOfBoundsException
     [exec] 	at java.util.Arrays.mergeSort(Arrays.java:2460)
     [exec] 	at java.util.Arrays.sort(Arrays.java:2369)
     [exec] 	at java.util.Arrays.sort(Arrays.java:2329)
     [exec] 	at net.wuffies.japi.BoundMemberSet.getFields(BoundMemberSet.java:33)

...

     [exec] 	at net.wuffies.japi.Japize.processRootSet(Japize.java:471)
     [exec] 	at net.wuffies.japi.Japize.doJapize(Japize.java:443)
     [exec] 	at net.wuffies.japi.Japize.main(Japize.java:316)
     [exec] -----
     [exec] Failed to Japize javax.swing.JColorChooser$AccessibleJColorChooser: java.lang.ArrayIndexOutOfBoundsException
     [exec] java.lang.ArrayIndexOutOfBoundsException
     [exec] 	at java.util.Arrays.mergeSort(Arrays.java:2452)
     [exec] 	at java.util.Arrays.mergeSort(Arrays.java:2432)
     [exec] 	at java.util.Arrays.sort(Arrays.java:2369)
     [exec] 	at java.util.Arrays.sort(Arrays.java:2329)

...

     [exec] 	at net.wuffies.japi.Japize.processRootSet(Japize.java:471)
     [exec] 	at net.wuffies.japi.Japize.doJapize(Japize.java:443)
     [exec] 	at net.wuffies.japi.Japize.main(Japize.java:316)

     [exec] Failed to Japize javax.swing.JComboBox: java.lang.ArrayIndexOutOfBoundsException
     [exec] java.lang.ArrayIndexOutOfBoundsException
     [exec] 	at java.util.Arrays.mergeSort(Arrays.java:2460)
     [exec] 	at java.util.Arrays.sort(Arrays.java:2369)
     [exec] 	at java.util.Arrays.sort(Arrays.java:2329)
     [exec] 	at net.wuffies.japi.BoundMemberSet.getFields(BoundMemberSet.java:33)

...

     [exec] 	at net.wuffies.japi.Japize.processRootSet(Japize.java:471)
     [exec] 	at net.wuffies.japi.Japize.doJapize(Japize.java:443)
     [exec] 	at net.wuffies.japi.Japize.main(Japize.java:316)
     [exec] -
     [exec] Failed to Japize javax.swing.JComboBox$AccessibleJComboBox: java.lang.ArrayIndexOutOfBoundsException
     [exec] java.lang.ArrayIndexOutOfBoundsException
     [exec] 	at java.util.Arrays.mergeSort(Arrays.java:2452)
     [exec] 	at java.util.Arrays.mergeSort(Arrays.java:2432)
     [exec] 	at java.util.Arrays.sort(Arrays.java:2369)
     [exec] 	at java.util.Arrays.sort(Arrays.java:2329)

...

     [exec] 	at net.wuffies.japi.Japize.processRootSet(Japize.java:471)
     [exec] 	at net.wuffies.japi.Japize.doJapize(Japize.java:443)
     [exec] 	at net.wuffies.japi.Japize.main(Japize.java:316)
     [exec] --+
     [exec] Failed to Japize javax.swing.JComponent: java.lang.ArrayIndexOutOfBoundsException
     [exec] java.lang.ArrayIndexOutOfBoundsException
     [exec] 	at java.util.Arrays.mergeSort(Arrays.java:2460)
     [exec] 	at java.util.Arrays.sort(Arrays.java:2369)
     [exec] 	at java.util.Arrays.sort(Arrays.java:2329)
     [exec] 	at net.wuffies.japi.BoundMemberSet.getFields(BoundMemberSet.java:33)

...

     [exec] 	at net.wuffies.japi.Japize.processRootSet(Japize.java:471)
     [exec] 	at net.wuffies.japi.Japize.doJapize(Japize.java:443)
     [exec] 	at net.wuffies.japi.Japize.main(Japize.java:316)
     [exec] -
     [exec] Failed to Japize javax.swing.JComponent$AccessibleJComponent: java.lang.ArrayIndexOutOfBoundsException
     [exec] java.lang.ArrayIndexOutOfBoundsException
     [exec] 	at java.util.Arrays.mergeSort(Arrays.java:2452)
     [exec] 	at java.util.Arrays.mergeSort(Arrays.java:2432)
     [exec] 	at java.util.Arrays.sort(Arrays.java:2369)
     [exec] 	at java.util.Arrays.sort(Arrays.java:2329)

...

     [exec] 	at net.wuffies.japi.Japize.processRootSet(Japize.java:471)
     [exec] 	at net.wuffies.japi.Japize.doJapize(Japize.java:443)
     [exec] 	at net.wuffies.japi.Japize.main(Japize.java:316)

     [exec] Failed to Japize javax.swing.JComponent$AccessibleJComponent$AccessibleContainerHandler:
java.lang.ArrayIndexOutOfBoundsException
     [exec] java.lang.ArrayIndexOutOfBoundsException
     [exec] 	at java.util.Arrays.mergeSort(Arrays.java:2452)
     [exec] 	at java.util.Arrays.sort(Arrays.java:2369)
     [exec] 	at java.util.Arrays.sort(Arrays.java:2329)
     [exec] 	at net.wuffies.japi.BoundMemberSet.getCalls(BoundMemberSet.java:46)

...

     [exec] 	at net.wuffies.japi.Japize.processRootSet(Japize.java:471)
     [exec] 	at net.wuffies.japi.Japize.doJapize(Japize.java:443)
     [exec] 	at net.wuffies.japi.Japize.main(Japize.java:316)

     [exec] Failed to Japize javax.swing.JComponent$AccessibleJComponent$AccessibleFocusHandler:
java.lang.ArrayIndexOutOfBoundsException
     [exec] java.lang.ArrayIndexOutOfBoundsException
     [exec] 	at java.util.Arrays.mergeSort(Arrays.java:2450)
     [exec] 	at java.util.Arrays.sort(Arrays.java:2369)
     [exec] 	at java.util.Arrays.sort(Arrays.java:2329)
     [exec] 	at net.wuffies.japi.BoundMemberSet.getCalls(BoundMemberSet.java:46)

...

     [exec] 	at net.wuffies.japi.Japize.processRootSet(Japize.java:471)
     [exec] 	at net.wuffies.japi.Japize.doJapize(Japize.java:443)
     [exec] 	at net.wuffies.japi.Japize.main(Japize.java:316)
     [exec] -
     [exec] Failed to Japize javax.swing.JDesktopPane: java.lang.ArrayIndexOutOfBoundsException
     [exec] java.lang.ArrayIndexOutOfBoundsException
     [exec] 	at java.util.Arrays.mergeSort(Arrays.java:2460)
     [exec] 	at java.util.Arrays.sort(Arrays.java:2369)
     [exec] 	at java.util.Arrays.sort(Arrays.java:2329)
     [exec] 	at net.wuffies.japi.BoundMemberSet.getFields(BoundMemberSet.java:33)

...

     [exec] 	at net.wuffies.japi.Japize.processRootSet(Japize.java:471)
     [exec] 	at net.wuffies.japi.Japize.doJapize(Japize.java:443)
     [exec] 	at net.wuffies.japi.Japize.main(Japize.java:316)

     [exec] Failed to Japize javax.swing.JDesktopPane$AccessibleJDesktopPane: java.lang.ArrayIndexOutOfBoundsException
     [exec] java.lang.ArrayIndexOutOfBoundsException
     [exec] 	at java.util.Arrays.mergeSort(Arrays.java:2452)
     [exec] 	at java.util.Arrays.mergeSort(Arrays.java:2432)
     [exec] 	at java.util.Arrays.sort(Arrays.java:2369)
     [exec] 	at java.util.Arrays.sort(Arrays.java:2329)

...

     [exec] 	at net.wuffies.japi.Japize.processRootSet(Japize.java:471)
     [exec] 	at net.wuffies.japi.Japize.doJapize(Japize.java:443)
     [exec] 	at net.wuffies.japi.Japize.main(Japize.java:316)

     [exec] Failed to Japize javax.swing.JDialog: java.lang.ArrayIndexOutOfBoundsException
     [exec] java.lang.ArrayIndexOutOfBoundsException
     [exec] 	at java.util.Arrays.mergeSort(Arrays.java:2460)
     [exec] 	at java.util.Arrays.sort(Arrays.java:2369)
     [exec] 	at java.util.Arrays.sort(Arrays.java:2329)
     [exec] 	at net.wuffies.japi.BoundMemberSet.getFields(BoundMemberSet.java:33)

...

     [exec] 	at net.wuffies.japi.Japize.processRootSet(Japize.java:471)
     [exec] 	at net.wuffies.japi.Japize.doJapize(Japize.java:443)
     [exec] 	at net.wuffies.japi.Japize.main(Japize.java:316)

     [exec] Failed to Japize javax.swing.JDialog$AccessibleJDialog: java.lang.ArrayIndexOutOfBoundsException
     [exec] java.lang.ArrayIndexOutOfBoundsException
     [exec] 	at java.util.Arrays.mergeSort(Arrays.java:2452)
     [exec] 	at java.util.Arrays.mergeSort(Arrays.java:2432)
     [exec] 	at java.util.Arrays.sort(Arrays.java:2369)
     [exec] 	at java.util.Arrays.sort(Arrays.java:2329)

...

     [exec] 	at net.wuffies.japi.Japize.processRootSet(Japize.java:471)
     [exec] 	at net.wuffies.japi.Japize.doJapize(Japize.java:443)
     [exec] 	at net.wuffies.japi.Japize.main(Japize.java:316)

     [exec] Failed to Japize javax.swing.JEditorPane: java.lang.ArrayIndexOutOfBoundsException
     [exec] java.lang.ArrayIndexOutOfBoundsException
     [exec] 	at java.util.Arrays.mergeSort(Arrays.java:2460)
     [exec] 	at java.util.Arrays.sort(Arrays.java:2369)
     [exec] 	at java.util.Arrays.sort(Arrays.java:2329)
     [exec] 	at net.wuffies.japi.BoundMemberSet.getFields(BoundMemberSet.java:33)

...

     [exec] 	at net.wuffies.japi.Japize.processRootSet(Japize.java:471)
     [exec] 	at net.wuffies.japi.Japize.doJapize(Japize.java:443)
     [exec] 	at net.wuffies.japi.Japize.main(Japize.java:316)

     [exec] Failed to Japize javax.swing.JEditorPane$AccessibleJEditorPane: java.lang.ArrayIndexOutOfBoundsException
     [exec] java.lang.ArrayIndexOutOfBoundsException
     [exec] 	at java.util.Arrays.mergeSort(Arrays.java:2452)
     [exec] 	at java.util.Arrays.sort(Arrays.java:2369)
     [exec] 	at java.util.Arrays.sort(Arrays.java:2329)
     [exec] 	at net.wuffies.japi.BoundMemberSet.getCalls(BoundMemberSet.java:46)

...

     [exec] 	at net.wuffies.japi.Japize.processRootSet(Japize.java:471)
     [exec] 	at net.wuffies.japi.Japize.doJapize(Japize.java:443)
     [exec] 	at net.wuffies.japi.Japize.main(Japize.java:316)

     [exec] Failed to Japize javax.swing.JEditorPane$AccessibleJEditorPaneHTML: java.lang.ArrayIndexOutOfBoundsException
     [exec] java.lang.ArrayIndexOutOfBoundsException
     [exec] 	at java.util.Arrays.mergeSort(Arrays.java:2452)
     [exec] 	at java.util.Arrays.sort(Arrays.java:2369)
     [exec] 	at java.util.Arrays.sort(Arrays.java:2329)
     [exec] 	at net.wuffies.japi.BoundMemberSet.getCalls(BoundMemberSet.java:46)

...

     [exec] 	at net.wuffies.japi.Japize.processRootSet(Japize.java:471)
     [exec] 	at net.wuffies.japi.Japize.doJapize(Japize.java:443)
     [exec] 	at net.wuffies.japi.Japize.main(Japize.java:316)
     [exec] -
     [exec] Failed to Japize javax.swing.JEditorPane$JEditorPaneAccessibleHypertextSupport:
java.lang.ArrayIndexOutOfBoundsException
     [exec] java.lang.ArrayIndexOutOfBoundsException
     [exec] 	at java.util.Arrays.mergeSort(Arrays.java:2452)
     [exec] 	at java.util.Arrays.sort(Arrays.java:2369)
     [exec] 	at java.util.Arrays.sort(Arrays.java:2329)
     [exec] 	at net.wuffies.japi.BoundMemberSet.getCalls(BoundMemberSet.java:46)

...

     [exec] 	at net.wuffies.japi.Japize.processRootSet(Japize.java:471)
     [exec] 	at net.wuffies.japi.Japize.doJapize(Japize.java:443)
     [exec] 	at net.wuffies.japi.Japize.main(Japize.java:316)

     [exec] Failed to Japize javax.swing.JEditorPane$JEditorPaneAccessibleHypertextSupport$HTMLLink:
java.lang.ArrayIndexOutOfBoundsException
     [exec] java.lang.ArrayIndexOutOfBoundsException
     [exec] 	at java.util.Arrays.mergeSort(Arrays.java:2452)
     [exec] 	at java.util.Arrays.sort(Arrays.java:2369)
     [exec] 	at java.util.Arrays.sort(Arrays.java:2329)
     [exec] 	at net.wuffies.japi.BoundMemberSet.getCalls(BoundMemberSet.java:46)

...

     [exec] 	at net.wuffies.japi.Japize.processRootSet(Japize.java:471)
     [exec] 	at net.wuffies.japi.Japize.doJapize(Japize.java:443)
     [exec] 	at net.wuffies.japi.Japize.main(Japize.java:316)
     [exec] -
     [exec] Failed to Japize javax.swing.JFileChooser: java.lang.ArrayIndexOutOfBoundsException
     [exec] java.lang.ArrayIndexOutOfBoundsException
     [exec] 	at java.util.Arrays.mergeSort(Arrays.java:2460)
     [exec] 	at java.util.Arrays.sort(Arrays.java:2369)
     [exec] 	at java.util.Arrays.sort(Arrays.java:2329)
     [exec] 	at net.wuffies.japi.BoundMemberSet.getFields(BoundMemberSet.java:33)

...

     [exec] 	at net.wuffies.japi.Japize.processRootSet(Japize.java:471)
     [exec] 	at net.wuffies.japi.Japize.doJapize(Japize.java:443)
     [exec] 	at net.wuffies.japi.Japize.main(Japize.java:316)

     [exec] Failed to Japize javax.swing.JFileChooser$AccessibleJFileChooser: java.lang.ArrayIndexOutOfBoundsException
     [exec] java.lang.ArrayIndexOutOfBoundsException
     [exec] 	at java.util.Arrays.mergeSort(Arrays.java:2452)
     [exec] 	at java.util.Arrays.mergeSort(Arrays.java:2432)
     [exec] 	at java.util.Arrays.sort(Arrays.java:2369)
     [exec] 	at java.util.Arrays.sort(Arrays.java:2329)

...

     [exec] 	at net.wuffies.japi.Japize.processRootSet(Japize.java:471)
     [exec] 	at net.wuffies.japi.Japize.doJapize(Japize.java:443)
     [exec] 	at net.wuffies.japi.Japize.main(Japize.java:316)

     [exec] Failed to Japize javax.swing.JFormattedTextField: java.lang.ArrayIndexOutOfBoundsException
     [exec] java.lang.ArrayIndexOutOfBoundsException
     [exec] 	at java.util.Arrays.mergeSort(Arrays.java:2458)
     [exec] 	at java.util.Arrays.mergeSort(Arrays.java:2432)
     [exec] 	at java.util.Arrays.sort(Arrays.java:2369)
     [exec] 	at java.util.Arrays.sort(Arrays.java:2329)

...

     [exec] 	at net.wuffies.japi.Japize.processRootSet(Japize.java:471)
     [exec] 	at net.wuffies.japi.Japize.doJapize(Japize.java:443)
     [exec] 	at net.wuffies.japi.Japize.main(Japize.java:316)

     [exec] Failed to Japize javax.swing.JFormattedTextField$AbstractFormatter: java.lang.ArrayIndexOutOfBoundsException
     [exec] java.lang.ArrayIndexOutOfBoundsException
     [exec] 	at java.util.Arrays.mergeSort(Arrays.java:2452)
     [exec] 	at java.util.Arrays.mergeSort(Arrays.java:2432)
     [exec] 	at java.util.Arrays.mergeSort(Arrays.java:2432)
     [exec] 	at java.util.Arrays.sort(Arrays.java:2369)

...

     [exec] 	at net.wuffies.japi.Japize.processRootSet(Japize.java:471)
     [exec] 	at net.wuffies.japi.Japize.doJapize(Japize.java:443)
     [exec] 	at net.wuffies.japi.Japize.main(Japize.java:316)
     [exec] -
     [exec] Failed to Japize javax.swing.JFormattedTextField$AbstractFormatterFactory: java.lang.ArrayIndexOutOfBoundsException
     [exec] java.lang.ArrayIndexOutOfBoundsException
     [exec] 	at java.util.Arrays.mergeSort(Arrays.java:2452)
     [exec] 	at java.util.Arrays.sort(Arrays.java:2369)
     [exec] 	at java.util.Arrays.sort(Arrays.java:2329)
     [exec] 	at net.wuffies.japi.BoundMemberSet.getCalls(BoundMemberSet.java:46)

...

     [exec] 	at net.wuffies.japi.Japize.processRootSet(Japize.java:471)
     [exec] 	at net.wuffies.japi.Japize.doJapize(Japize.java:443)
     [exec] 	at net.wuffies.japi.Japize.main(Japize.java:316)
     [exec] ------
     [exec] Failed to Japize javax.swing.JFrame: java.lang.ArrayIndexOutOfBoundsException
     [exec] java.lang.ArrayIndexOutOfBoundsException
     [exec] 	at java.util.Arrays.mergeSort(Arrays.java:2460)
     [exec] 	at java.util.Arrays.sort(Arrays.java:2369)
     [exec] 	at java.util.Arrays.sort(Arrays.java:2329)
     [exec] 	at net.wuffies.japi.BoundMemberSet.getFields(BoundMemberSet.java:33)

...

     [exec] 	at net.wuffies.japi.Japize.processRootSet(Japize.java:471)
     [exec] 	at net.wuffies.japi.Japize.doJapize(Japize.java:443)
     [exec] 	at net.wuffies.japi.Japize.main(Japize.java:316)

     [exec] Failed to Japize javax.swing.JFrame$AccessibleJFrame: java.lang.ArrayIndexOutOfBoundsException
     [exec] java.lang.ArrayIndexOutOfBoundsException
     [exec] 	at java.util.Arrays.mergeSort(Arrays.java:2452)
     [exec] 	at java.util.Arrays.mergeSort(Arrays.java:2432)
     [exec] 	at java.util.Arrays.sort(Arrays.java:2369)
     [exec] 	at java.util.Arrays.sort(Arrays.java:2329)

...

     [exec] 	at net.wuffies.japi.Japize.processRootSet(Japize.java:471)
     [exec] 	at net.wuffies.japi.Japize.doJapize(Japize.java:443)
     [exec] 	at net.wuffies.japi.Japize.main(Japize.java:316)

     [exec] Failed to Japize javax.swing.JInternalFrame: java.lang.ArrayIndexOutOfBoundsException
     [exec] java.lang.ArrayIndexOutOfBoundsException
     [exec] 	at java.util.Arrays.mergeSort(Arrays.java:2460)
     [exec] 	at java.util.Arrays.sort(Arrays.java:2369)
     [exec] 	at java.util.Arrays.sort(Arrays.java:2329)
     [exec] 	at net.wuffies.japi.BoundMemberSet.getFields(BoundMemberSet.java:33)

...

     [exec] 	at net.wuffies.japi.Japize.processRootSet(Japize.java:471)
     [exec] 	at net.wuffies.japi.Japize.doJapize(Japize.java:443)
     [exec] 	at net.wuffies.japi.Japize.main(Japize.java:316)

     [exec] Failed to Japize javax.swing.JInternalFrame$AccessibleJInternalFrame: java.lang.ArrayIndexOutOfBoundsException
     [exec] java.lang.ArrayIndexOutOfBoundsException
     [exec] 	at java.util.Arrays.mergeSort(Arrays.java:2452)
     [exec] 	at java.util.Arrays.mergeSort(Arrays.java:2432)
     [exec] 	at java.util.Arrays.sort(Arrays.java:2369)
     [exec] 	at java.util.Arrays.sort(Arrays.java:2329)

...

     [exec] 	at net.wuffies.japi.Japize.processRootSet(Japize.java:471)
     [exec] 	at net.wuffies.japi.Japize.doJapize(Japize.java:443)
     [exec] 	at net.wuffies.japi.Japize.main(Japize.java:316)

     [exec] Failed to Japize javax.swing.JInternalFrame$JDesktopIcon: java.lang.ArrayIndexOutOfBoundsException
     [exec] java.lang.ArrayIndexOutOfBoundsException
     [exec] 	at java.util.Arrays.mergeSort(Arrays.java:2460)
     [exec] 	at java.util.Arrays.sort(Arrays.java:2369)
     [exec] 	at java.util.Arrays.sort(Arrays.java:2329)
     [exec] 	at net.wuffies.japi.BoundMemberSet.getFields(BoundMemberSet.java:33)

...

     [exec] 	at net.wuffies.japi.Japize.processRootSet(Japize.java:471)
     [exec] 	at net.wuffies.japi.Japize.doJapize(Japize.java:443)
     [exec] 	at net.wuffies.japi.Japize.main(Japize.java:316)

     [exec] Failed to Japize javax.swing.JInternalFrame$JDesktopIcon$AccessibleJDesktopIcon:
java.lang.ArrayIndexOutOfBoundsException
     [exec] java.lang.ArrayIndexOutOfBoundsException
     [exec] 	at java.util.Arrays.mergeSort(Arrays.java:2452)
     [exec] 	at java.util.Arrays.mergeSort(Arrays.java:2432)
     [exec] 	at java.util.Arrays.sort(Arrays.java:2369)
     [exec] 	at java.util.Arrays.sort(Arrays.java:2329)

...

     [exec] 	at net.wuffies.japi.Japize.processRootSet(Japize.java:471)
     [exec] 	at net.wuffies.japi.Japize.doJapize(Japize.java:443)
     [exec] 	at net.wuffies.japi.Japize.main(Japize.java:316)

     [exec] Failed to Japize javax.swing.JLabel: java.lang.ArrayIndexOutOfBoundsException
     [exec] java.lang.ArrayIndexOutOfBoundsException
     [exec] 	at java.util.Arrays.mergeSort(Arrays.java:2458)
     [exec] 	at java.util.Arrays.mergeSort(Arrays.java:2432)
     [exec] 	at java.util.Arrays.sort(Arrays.java:2369)
     [exec] 	at java.util.Arrays.sort(Arrays.java:2329)

...

     [exec] 	at net.wuffies.japi.Japize.processRootSet(Japize.java:471)
     [exec] 	at net.wuffies.japi.Japize.doJapize(Japize.java:443)
     [exec] 	at net.wuffies.japi.Japize.main(Japize.java:316)
     [exec] -
     [exec] Failed to Japize javax.swing.JLabel$AccessibleJLabel: java.lang.ArrayIndexOutOfBoundsException
     [exec] java.lang.ArrayIndexOutOfBoundsException
     [exec] 	at java.util.Arrays.mergeSort(Arrays.java:2452)
     [exec] 	at java.util.Arrays.sort(Arrays.java:2369)
     [exec] 	at java.util.Arrays.sort(Arrays.java:2329)
     [exec] 	at net.wuffies.japi.BoundMemberSet.getCalls(BoundMemberSet.java:46)

...

     [exec] 	at net.wuffies.japi.Japize.processRootSet(Japize.java:471)
     [exec] 	at net.wuffies.japi.Japize.doJapize(Japize.java:443)
     [exec] 	at net.wuffies.japi.Japize.main(Japize.java:316)

     [exec] Failed to Japize javax.swing.JLayeredPane: java.lang.ArrayIndexOutOfBoundsException
     [exec] java.lang.ArrayIndexOutOfBoundsException
     [exec] 	at java.util.Arrays.mergeSort(Arrays.java:2460)
     [exec] 	at java.util.Arrays.sort(Arrays.java:2369)
     [exec] 	at java.util.Arrays.sort(Arrays.java:2329)
     [exec] 	at net.wuffies.japi.BoundMemberSet.getFields(BoundMemberSet.java:33)

...

     [exec] 	at net.wuffies.japi.Japize.processRootSet(Japize.java:471)
     [exec] 	at net.wuffies.japi.Japize.doJapize(Japize.java:443)
     [exec] 	at net.wuffies.japi.Japize.main(Japize.java:316)

     [exec] Failed to Japize javax.swing.JLayeredPane$AccessibleJLayeredPane: java.lang.ArrayIndexOutOfBoundsException
     [exec] java.lang.ArrayIndexOutOfBoundsException
     [exec] 	at java.util.Arrays.mergeSort(Arrays.java:2452)
     [exec] 	at java.util.Arrays.mergeSort(Arrays.java:2432)
     [exec] 	at java.util.Arrays.sort(Arrays.java:2369)
     [exec] 	at java.util.Arrays.sort(Arrays.java:2329)

...

     [exec] 	at net.wuffies.japi.Japize.processRootSet(Japize.java:471)
     [exec] 	at net.wuffies.japi.Japize.doJapize(Japize.java:443)
     [exec] 	at net.wuffies.japi.Japize.main(Japize.java:316)

     [exec] Failed to Japize javax.swing.JList: java.lang.ArrayIndexOutOfBoundsException
     [exec] java.lang.ArrayIndexOutOfBoundsException
     [exec] 	at java.util.Arrays.mergeSort(Arrays.java:2460)
     [exec] 	at java.util.Arrays.sort(Arrays.java:2369)
     [exec] 	at java.util.Arrays.sort(Arrays.java:2329)
     [exec] 	at net.wuffies.japi.BoundMemberSet.getFields(BoundMemberSet.java:33)

...

update-index:

test-result:

BUILD FAILED
/home/hybld/continuum-working-directory/6/build.xml:204: There were test failures.

Total time: 70 minutes 18 seconds

****************************************************************************

...

Mime
View raw message