harmony-alerts mailing list archives

Site index · List index
Message view « Date » · « Thread »
Top « Date » · « Thread »
From nom...@intel.com
Subject [build-test alert] BUILD FAILED lnx gcc debug: Eclipse Unit Tests
Date Thu, 08 Mar 2007 09:18:56 GMT
Failures & errors report:
********
Failures (0):
********
Errors (122):
--------
testcase:
	classname="org.eclipse.jdt.core.tests.builder.BasicBuildTests"
	name="testTags3"
	time="20.877"
	error:
		message="assertion failed: Core exception in testing environment: Could not write file: /export/users/nrinskay/EUT_CC/trunk/cc/projects/ (...)"
		details:
		org.eclipse.core.runtime.AssertionFailedException: assertion failed: Core exception in testing environment: Could not write fil (...)
--------
--------
testcase:
	classname="org.eclipse.jdt.core.tests.builder.BasicBuildTests"
	name="testUnusedImport"
	time="0.363"
	error:
		message="Could not write file: /export/users/nrinskay/EUT_CC/trunk/cc/projects/eut/eclipse-testing/test-eclipse/eclipse/jdt_builder_fold (...)"
		details:
		Java Model Exception: Core Exception [code 272] Could not write file: /export/users/nrinskay/EUT_CC/trunk/cc/projects/eut/eclip (...)
--------
--------
testcase:
	classname="org.eclipse.jdt.core.tests.builder.BasicBuildTests"
	name="test98667"
	time="0.442"
	error:
		message="Could not write file: /export/users/nrinskay/EUT_CC/trunk/cc/projects/eut/eclipse-testing/test-eclipse/eclipse/jdt_builder_fold (...)"
		details:
		Java Model Exception: Core Exception [code 272] Could not write file: /export/users/nrinskay/EUT_CC/trunk/cc/projects/eut/eclip (...)
--------
--------
testcase:
	classname="org.eclipse.jdt.core.tests.builder.BuildpathTests"
	name="testClasspathFileChange"
	time="0.557"
	error:
		message="Could not write file: /export/users/nrinskay/EUT_CC/trunk/cc/projects/eut/eclipse-testing/test-eclipse/eclipse/jdt_builder_fold (...)"
		details:
		Java Model Exception: Core Exception [code 272] Could not write file: /export/users/nrinskay/EUT_CC/trunk/cc/projects/eut/eclip (...)
--------
--------
testcase:
	classname="org.eclipse.jdt.core.tests.builder.BuildpathTests"
	name="testClosedProject"
	time="6.39"
	error:
		message="assertion failed: Core exception in testing environment: Could not write file: /export/users/nrinskay/EUT_CC/trunk/cc/projects/ (...)"
		details:
		org.eclipse.core.runtime.AssertionFailedException: assertion failed: Core exception in testing environment: Could not write fil (...)
--------
--------
testcase:
	classname="org.eclipse.jdt.core.tests.builder.BuildpathTests"
	name="testCorruptBuilder"
	time="0.169"
	error:
		message="assertion failed: Core exception in testing environment: Could not write file: /export/users/nrinskay/EUT_CC/trunk/cc/projects/ (...)"
		details:
		org.eclipse.core.runtime.AssertionFailedException: assertion failed: Core exception in testing environment: Could not write fil (...)
--------
--------
testcase:
	classname="org.eclipse.jdt.core.tests.builder.BuildpathTests"
	name="testCorruptBuilder2"
	time="19.446"
	error:
		message="assertion failed: Core exception in testing environment: Failed to read the project description file (.project) for P1.  The fi (...)"
		details:
		org.eclipse.core.runtime.AssertionFailedException: assertion failed: Core exception in testing environment: Failed to read the  (...)
--------
--------
testcase:
	classname="org.eclipse.jdt.core.tests.builder.BuildpathTests"
	name="testExternalJarChange"
	time="0.102"
	error:
		message="assertion failed: Core exception in testing environment: Could not write file: /export/users/nrinskay/EUT_CC/trunk/cc/projects/ (...)"
		details:
		org.eclipse.core.runtime.AssertionFailedException: assertion failed: Core exception in testing environment: Could not write fil (...)
--------
--------
testcase:
	classname="org.eclipse.jdt.core.tests.builder.BuildpathTests"
	name="testMissingBuilder"
	time="10.162"
	error:
		message="assertion failed: Core exception in testing environment: Failed to read the project description file (.project) for P1.  The fi (...)"
		details:
		org.eclipse.core.runtime.AssertionFailedException: assertion failed: Core exception in testing environment: Failed to read the  (...)
--------
--------
testcase:
	classname="org.eclipse.jdt.core.tests.builder.BuildpathTests"
	name="testMissingLibrary1"
	time="25.45"
	error:
		message="assertion failed: Core exception in testing environment: Failed to read the project description file (.project) for Project.  T (...)"
		details:
		org.eclipse.core.runtime.AssertionFailedException: assertion failed: Core exception in testing environment: Failed to read the  (...)
--------
--------
testcase:
	classname="org.eclipse.jdt.core.tests.builder.BuildpathTests"
	name="testMissingLibrary2"
	time="14.442"
	error:
		message="assertion failed: Core exception in testing environment: Failed to read the project description file (.project) for Project.  T (...)"
		details:
		org.eclipse.core.runtime.AssertionFailedException: assertion failed: Core exception in testing environment: Failed to read the  (...)
--------
--------
testcase:
	classname="org.eclipse.jdt.core.tests.builder.BuildpathTests"
	name="testMissingProject"
	time="0.07"
	error:
		message="assertion failed: Core exception in testing environment: Could not write file: /export/users/nrinskay/EUT_CC/trunk/cc/projects/ (...)"
		details:
		org.eclipse.core.runtime.AssertionFailedException: assertion failed: Core exception in testing environment: Could not write fil (...)
--------
--------
testcase:
	classname="org.eclipse.jdt.core.tests.builder.BuildpathTests"
	name="testMissingOptionalProject"
	time="16.263"
	error:
		message="assertion failed: Core exception in testing environment: Failed to read the project description file (.project) for MP1.  The f (...)"
		details:
		org.eclipse.core.runtime.AssertionFailedException: assertion failed: Core exception in testing environment: Failed to read the  (...)
--------
--------
testcase:
	classname="org.eclipse.jdt.core.tests.builder.CopyResourceTests"
	name="testSimpleProject"
	time="13.791"
	error:
		message="assertion failed: Core exception in testing environment: Failed to read the project description file (.project) for P1.  The fi (...)"
		details:
		org.eclipse.core.runtime.AssertionFailedException: assertion failed: Core exception in testing environment: Failed to read the  (...)
--------
--------
testcase:
	classname="org.eclipse.jdt.core.tests.builder.CopyResourceTests"
	name="testProjectWithBin"
	time="0.195"
	error:
		message="assertion failed: Core exception in testing environment: Could not write file: /export/users/nrinskay/EUT_CC/trunk/cc/projects/ (...)"
		details:
		org.eclipse.core.runtime.AssertionFailedException: assertion failed: Core exception in testing environment: Could not write fil (...)
--------
--------
testcase:
	classname="org.eclipse.jdt.core.tests.builder.CopyResourceTests"
	name="testProjectWithSrcBin"
	time="0.179"
	error:
		message="assertion failed: Core exception in testing environment: Could not write file: /export/users/nrinskay/EUT_CC/trunk/cc/projects/ (...)"
		details:
		org.eclipse.core.runtime.AssertionFailedException: assertion failed: Core exception in testing environment: Could not write fil (...)
--------
--------
testcase:
	classname="org.eclipse.jdt.core.tests.builder.CopyResourceTests"
	name="testProjectWith2SrcBin"
	time="0.038"
	error:
		message="assertion failed: Core exception in testing environment: Cannot create file because existing file of wrong type exists: /export (...)"
		details:
		org.eclipse.core.runtime.AssertionFailedException: assertion failed: Core exception in testing environment: Cannot create file  (...)
--------
--------
testcase:
	classname="org.eclipse.jdt.core.tests.builder.CopyResourceTests"
	name="testProjectWith2SrcAsBin"
	time="0.067"
	error:
		message="assertion failed: Core exception in testing environment: Cannot create file because existing file of wrong type exists: /export (...)"
		details:
		org.eclipse.core.runtime.AssertionFailedException: assertion failed: Core exception in testing environment: Cannot create file  (...)
--------
--------
testcase:
	classname="org.eclipse.jdt.core.tests.builder.CopyResourceTests"
	name="testProjectWith2Src2Bin"
	time="0.049"
	error:
		message="assertion failed: Core exception in testing environment: Cannot create file because existing file of wrong type exists: /export (...)"
		details:
		org.eclipse.core.runtime.AssertionFailedException: assertion failed: Core exception in testing environment: Cannot create file  (...)
--------
--------
testcase:
	classname="org.eclipse.jdt.core.tests.builder.CopyResourceTests"
	name="test2ProjectWith1Bin"
	time="0.026"
	error:
		message="assertion failed: Core exception in testing environment: Cannot create file because existing file of wrong type exists: /export (...)"
		details:
		org.eclipse.core.runtime.AssertionFailedException: assertion failed: Core exception in testing environment: Cannot create file  (...)
--------
--------
testcase:
	classname="org.eclipse.jdt.core.tests.builder.DependencyTests"
	name="testAbstractMethod"
	time="13.513"
	error:
		message="assertion failed: Core exception in testing environment: Failed to read the project description file (.project) for Project.  T (...)"
		details:
		org.eclipse.core.runtime.AssertionFailedException: assertion failed: Core exception in testing environment: Failed to read the  (...)
--------
--------
testcase:
	classname="org.eclipse.jdt.core.tests.builder.DependencyTests"
	name="testExactMethodDeleting"
	time="0.06"
	error:
		message="assertion failed: Core exception in testing environment: Failed to read the project description file (.project) for Project.  T (...)"
		details:
		org.eclipse.core.runtime.AssertionFailedException: assertion failed: Core exception in testing environment: Failed to read the  (...)
--------
--------
testcase:
	classname="org.eclipse.jdt.core.tests.builder.DependencyTests"
	name="testExactMethodVisibility"
	time="0.048"
	error:
		message="assertion failed: Core exception in testing environment: Failed to read the project description file (.project) for Project.  T (...)"
		details:
		org.eclipse.core.runtime.AssertionFailedException: assertion failed: Core exception in testing environment: Failed to read the  (...)
--------
--------
testcase:
	classname="org.eclipse.jdt.core.tests.builder.DependencyTests"
	name="testExternalJarChanged"
	time="0.046"
	error:
		message="assertion failed: Core exception in testing environment: Failed to read the project description file (.project) for Project.  T (...)"
		details:
		org.eclipse.core.runtime.AssertionFailedException: assertion failed: Core exception in testing environment: Failed to read the  (...)
--------
--------
testcase:
	classname="org.eclipse.jdt.core.tests.builder.DependencyTests"
	name="testFieldDeleting"
	time="0.046"
	error:
		message="assertion failed: Core exception in testing environment: Failed to read the project description file (.project) for Project.  T (...)"
		details:
		org.eclipse.core.runtime.AssertionFailedException: assertion failed: Core exception in testing environment: Failed to read the  (...)
--------
--------
testcase:
	classname="org.eclipse.jdt.core.tests.builder.DependencyTests"
	name="testFieldVisibility"
	time="0.09"
	error:
		message="assertion failed: Core exception in testing environment: Failed to read the project description file (.project) for Project.  T (...)"
		details:
		org.eclipse.core.runtime.AssertionFailedException: assertion failed: Core exception in testing environment: Failed to read the  (...)
--------
--------
testcase:
	classname="org.eclipse.jdt.core.tests.builder.DependencyTests"
	name="testInterfaceDeleting"
	time="0.046"
	error:
		message="assertion failed: Core exception in testing environment: Failed to read the project description file (.project) for Project.  T (...)"
		details:
		org.eclipse.core.runtime.AssertionFailedException: assertion failed: Core exception in testing environment: Failed to read the  (...)
--------
--------
testcase:
	classname="org.eclipse.jdt.core.tests.builder.DependencyTests"
	name="testMemberTypeDeleting"
	time="0.037"
	error:
		message="assertion failed: Core exception in testing environment: Failed to read the project description file (.project) for Project.  T (...)"
		details:
		org.eclipse.core.runtime.AssertionFailedException: assertion failed: Core exception in testing environment: Failed to read the  (...)
--------
--------
testcase:
	classname="org.eclipse.jdt.core.tests.builder.DependencyTests"
	name="testMemberTypeVisibility"
	time="0.043"
	error:
		message="assertion failed: Core exception in testing environment: Failed to read the project description file (.project) for Project.  T (...)"
		details:
		org.eclipse.core.runtime.AssertionFailedException: assertion failed: Core exception in testing environment: Failed to read the  (...)
--------
--------
testcase:
	classname="org.eclipse.jdt.core.tests.builder.DependencyTests"
	name="testMethodDeleting"
	time="0.05"
	error:
		message="assertion failed: Core exception in testing environment: Failed to read the project description file (.project) for Project.  T (...)"
		details:
		org.eclipse.core.runtime.AssertionFailedException: assertion failed: Core exception in testing environment: Failed to read the  (...)
--------
--------
testcase:
	classname="org.eclipse.jdt.core.tests.builder.DependencyTests"
	name="testMethodVisibility"
	time="0.049"
	error:
		message="assertion failed: Core exception in testing environment: Failed to read the project description file (.project) for Project.  T (...)"
		details:
		org.eclipse.core.runtime.AssertionFailedException: assertion failed: Core exception in testing environment: Failed to read the  (...)
--------
--------
testcase:
	classname="org.eclipse.jdt.core.tests.builder.DependencyTests"
	name="testTypeDeleting"
	time="0.042"
	error:
		message="assertion failed: Core exception in testing environment: Failed to read the project description file (.project) for Project.  T (...)"
		details:
		org.eclipse.core.runtime.AssertionFailedException: assertion failed: Core exception in testing environment: Failed to read the  (...)
--------
--------
testcase:
	classname="org.eclipse.jdt.core.tests.builder.DependencyTests"
	name="testTypeVisibility"
	time="0.059"
	error:
		message="assertion failed: Core exception in testing environment: Failed to read the project description file (.project) for Project.  T (...)"
		details:
		org.eclipse.core.runtime.AssertionFailedException: assertion failed: Core exception in testing environment: Failed to read the  (...)
--------
--------
testcase:
	classname="org.eclipse.jdt.core.tests.builder.DependencyTests"
	name="testTypeVisibility2"
	time="0.065"
	error:
		message="assertion failed: Core exception in testing environment: Failed to read the project description file (.project) for Project.  T (...)"
		details:
		org.eclipse.core.runtime.AssertionFailedException: assertion failed: Core exception in testing environment: Failed to read the  (...)
--------
--------
testcase:
	classname="org.eclipse.jdt.core.tests.builder.DependencyTests"
	name="testTypeVariable"
	time="0.093"
	error:
		message="assertion failed: Core exception in testing environment: Failed to read the project description file (.project) for Project.  T (...)"
		details:
		org.eclipse.core.runtime.AssertionFailedException: assertion failed: Core exception in testing environment: Failed to read the  (...)
--------
--------
testcase:
	classname="org.eclipse.jdt.core.tests.builder.ErrorsTests"
	name="testErrors"
	time="0.044"
	error:
		message="assertion failed: Core exception in testing environment: Failed to read the project description file (.project) for Project.  T (...)"
		details:
		org.eclipse.core.runtime.AssertionFailedException: assertion failed: Core exception in testing environment: Failed to read the  (...)
--------
--------
testcase:
	classname="org.eclipse.jdt.core.tests.builder.ErrorsTests"
	name="testRenameToNonJava"
	time="0.042"
	error:
		message="assertion failed: Core exception in testing environment: Failed to read the project description file (.project) for Project.  T (...)"
		details:
		org.eclipse.core.runtime.AssertionFailedException: assertion failed: Core exception in testing environment: Failed to read the  (...)
--------
--------
testcase:
	classname="org.eclipse.jdt.core.tests.builder.EfficiencyTests"
	name="testEfficiency"
	time="0.038"
	error:
		message="assertion failed: Core exception in testing environment: Failed to read the project description file (.project) for Project.  T (...)"
		details:
		org.eclipse.core.runtime.AssertionFailedException: assertion failed: Core exception in testing environment: Failed to read the  (...)
--------
--------
testcase:
	classname="org.eclipse.jdt.core.tests.builder.EfficiencyTests"
	name="testMethodAddition"
	time="0.044"
	error:
		message="assertion failed: Core exception in testing environment: Failed to read the project description file (.project) for Project.  T (...)"
		details:
		org.eclipse.core.runtime.AssertionFailedException: assertion failed: Core exception in testing environment: Failed to read the  (...)
--------
--------
testcase:
	classname="org.eclipse.jdt.core.tests.builder.EfficiencyTests"
	name="testLocalTypeAddition"
	time="0.047"
	error:
		message="assertion failed: Core exception in testing environment: Failed to read the project description file (.project) for Project.  T (...)"
		details:
		org.eclipse.core.runtime.AssertionFailedException: assertion failed: Core exception in testing environment: Failed to read the  (...)
--------
--------
testcase:
	classname="org.eclipse.jdt.core.tests.builder.EfficiencyTests"
	name="testLocalTypeAddition2"
	time="0.04"
	error:
		message="assertion failed: Core exception in testing environment: Failed to read the project description file (.project) for Project.  T (...)"
		details:
		org.eclipse.core.runtime.AssertionFailedException: assertion failed: Core exception in testing environment: Failed to read the  (...)
--------
--------
testcase:
	classname="org.eclipse.jdt.core.tests.builder.EfficiencyTests"
	name="testLocalTypeRemoval"
	time="0.046"
	error:
		message="assertion failed: Core exception in testing environment: Failed to read the project description file (.project) for Project.  T (...)"
		details:
		org.eclipse.core.runtime.AssertionFailedException: assertion failed: Core exception in testing environment: Failed to read the  (...)
--------
--------
testcase:
	classname="org.eclipse.jdt.core.tests.builder.EfficiencyTests"
	name="testLocalTypeRemoval2"
	time="0.051"
	error:
		message="assertion failed: Core exception in testing environment: Failed to read the project description file (.project) for Project.  T (...)"
		details:
		org.eclipse.core.runtime.AssertionFailedException: assertion failed: Core exception in testing environment: Failed to read the  (...)
--------
--------
testcase:
	classname="org.eclipse.jdt.core.tests.builder.ExecutionTests"
	name="testSuccess"
	time="0.035"
	error:
		message="assertion failed: Core exception in testing environment: Failed to read the project description file (.project) for Project.  T (...)"
		details:
		org.eclipse.core.runtime.AssertionFailedException: assertion failed: Core exception in testing environment: Failed to read the  (...)
--------
--------
testcase:
	classname="org.eclipse.jdt.core.tests.builder.ExecutionTests"
	name="testFailure"
	time="0.037"
	error:
		message="assertion failed: Core exception in testing environment: Failed to read the project description file (.project) for Project.  T (...)"
		details:
		org.eclipse.core.runtime.AssertionFailedException: assertion failed: Core exception in testing environment: Failed to read the  (...)
--------
--------
testcase:
	classname="org.eclipse.jdt.core.tests.builder.IncrementalTests"
	name="testAddDuplicateSecondaryType"
	time="0.052"
	error:
		message="assertion failed: Core exception in testing environment: Failed to read the project description file (.project) for Project.  T (...)"
		details:
		org.eclipse.core.runtime.AssertionFailedException: assertion failed: Core exception in testing environment: Failed to read the  (...)
--------
--------
testcase:
	classname="org.eclipse.jdt.core.tests.builder.IncrementalTests"
	name="testDefaultPackage"
	time="0.033"
	error:
		message="assertion failed: Core exception in testing environment: Failed to read the project description file (.project) for Project.  T (...)"
		details:
		org.eclipse.core.runtime.AssertionFailedException: assertion failed: Core exception in testing environment: Failed to read the  (...)
--------
--------
testcase:
	classname="org.eclipse.jdt.core.tests.builder.IncrementalTests"
	name="testDefaultPackage2"
	time="0.038"
	error:
		message="assertion failed: Core exception in testing environment: Failed to read the project description file (.project) for Project.  T (...)"
		details:
		org.eclipse.core.runtime.AssertionFailedException: assertion failed: Core exception in testing environment: Failed to read the  (...)
--------
--------
testcase:
	classname="org.eclipse.jdt.core.tests.builder.IncrementalTests"
	name="testRenameMainType"
	time="0.039"
	error:
		message="assertion failed: Core exception in testing environment: Failed to read the project description file (.project) for Project.  T (...)"
		details:
		org.eclipse.core.runtime.AssertionFailedException: assertion failed: Core exception in testing environment: Failed to read the  (...)
--------
--------
testcase:
	classname="org.eclipse.jdt.core.tests.builder.IncrementalTests"
	name="testRemoveSecondaryType"
	time="0.037"
	error:
		message="assertion failed: Core exception in testing environment: Failed to read the project description file (.project) for Project.  T (...)"
		details:
		org.eclipse.core.runtime.AssertionFailedException: assertion failed: Core exception in testing environment: Failed to read the  (...)
--------
--------
testcase:
	classname="org.eclipse.jdt.core.tests.builder.IncrementalTests"
	name="testRemoveSecondaryType2"
	time="0.07"
	error:
		message="assertion failed: Core exception in testing environment: Failed to read the project description file (.project) for Project.  T (...)"
		details:
		org.eclipse.core.runtime.AssertionFailedException: assertion failed: Core exception in testing environment: Failed to read the  (...)
--------
--------
testcase:
	classname="org.eclipse.jdt.core.tests.builder.IncrementalTests"
	name="testMoveSecondaryType"
	time="0.047"
	error:
		message="assertion failed: Core exception in testing environment: Failed to read the project description file (.project) for Project.  T (...)"
		details:
		org.eclipse.core.runtime.AssertionFailedException: assertion failed: Core exception in testing environment: Failed to read the  (...)
--------
--------
testcase:
	classname="org.eclipse.jdt.core.tests.builder.IncrementalTests"
	name="testMoveMemberType"
	time="0.077"
	error:
		message="assertion failed: Core exception in testing environment: Failed to read the project description file (.project) for Project.  T (...)"
		details:
		org.eclipse.core.runtime.AssertionFailedException: assertion failed: Core exception in testing environment: Failed to read the  (...)
--------
--------
testcase:
	classname="org.eclipse.jdt.core.tests.builder.IncrementalTests"
	name="testMovePackage"
	time="0.068"
	error:
		message="assertion failed: Core exception in testing environment: Failed to read the project description file (.project) for Project.  T (...)"
		details:
		org.eclipse.core.runtime.AssertionFailedException: assertion failed: Core exception in testing environment: Failed to read the  (...)
--------
--------
testcase:
	classname="org.eclipse.jdt.core.tests.builder.IncrementalTests"
	name="testMemberTypeFromClassFile"
	time="0.054"
	error:
		message="assertion failed: Core exception in testing environment: Failed to read the project description file (.project) for Project.  T (...)"
		details:
		org.eclipse.core.runtime.AssertionFailedException: assertion failed: Core exception in testing environment: Failed to read the  (...)
--------
--------
testcase:
	classname="org.eclipse.jdt.core.tests.builder.IncrementalTests"
	name="testObjectWithSuperInterfaces"
	time="0.037"
	error:
		message="assertion failed: Core exception in testing environment: Failed to read the project description file (.project) for Project.  T (...)"
		details:
		org.eclipse.core.runtime.AssertionFailedException: assertion failed: Core exception in testing environment: Failed to read the  (...)
--------
--------
testcase:
	classname="org.eclipse.jdt.core.tests.builder.IncrementalTests"
	name="testMemberTypeCollisionWithBinary"
	time="0.084"
	error:
		message="assertion failed: Core exception in testing environment: Failed to read the project description file (.project) for Project.  T (...)"
		details:
		org.eclipse.core.runtime.AssertionFailedException: assertion failed: Core exception in testing environment: Failed to read the  (...)
--------
--------
testcase:
	classname="org.eclipse.jdt.core.tests.builder.IncrementalTests"
	name="test129316"
	time="0.066"
	error:
		message="assertion failed: Core exception in testing environment: Failed to read the project description file (.project) for Project.  T (...)"
		details:
		org.eclipse.core.runtime.AssertionFailedException: assertion failed: Core exception in testing environment: Failed to read the  (...)
--------
--------
testcase:
	classname="org.eclipse.jdt.core.tests.builder.IncrementalTests"
	name="testSecondaryType"
	time="0.054"
	error:
		message="assertion failed: Core exception in testing environment: Failed to read the project description file (.project) for Project.  T (...)"
		details:
		org.eclipse.core.runtime.AssertionFailedException: assertion failed: Core exception in testing environment: Failed to read the  (...)
--------
--------
testcase:
	classname="org.eclipse.jdt.core.tests.builder.MultiProjectTests"
	name="testCompileOnlyDependent"
	time="27.194"
	error:
		message="assertion failed: Core exception in testing environment: Could not write file: /export/users/nrinskay/EUT_CC/trunk/cc/projects/ (...)"
		details:
		org.eclipse.core.runtime.AssertionFailedException: assertion failed: Core exception in testing environment: Could not write fil (...)
--------
--------
testcase:
	classname="org.eclipse.jdt.core.tests.builder.MultiProjectTests"
	name="testCompileOnlyStructuralDependent"
	time="15.348"
	error:
		message="Could not write file: /export/users/nrinskay/EUT_CC/trunk/cc/projects/eut/eclipse-testing/test-eclipse/eclipse/jdt_builder_fold (...)"
		details:
		Java Model Exception: Core Exception [code 272] Could not write file: /export/users/nrinskay/EUT_CC/trunk/cc/projects/eut/eclip (...)
--------
--------
testcase:
	classname="org.eclipse.jdt.core.tests.builder.MultiProjectTests"
	name="testRemoveField"
	time="18.982"
	error:
		message="assertion failed: Core exception in testing environment: Could not write file: /export/users/nrinskay/EUT_CC/trunk/cc/projects/ (...)"
		details:
		org.eclipse.core.runtime.AssertionFailedException: assertion failed: Core exception in testing environment: Could not write fil (...)
--------
--------
testcase:
	classname="org.eclipse.jdt.core.tests.builder.MultiProjectTests"
	name="testCompileOrder"
	time="0.057"
	error:
		message="assertion failed: Core exception in testing environment: Failed to read the project description file (.project) for P1.  The fi (...)"
		details:
		org.eclipse.core.runtime.AssertionFailedException: assertion failed: Core exception in testing environment: Failed to read the  (...)
--------
--------
testcase:
	classname="org.eclipse.jdt.core.tests.builder.MultiProjectTests"
	name="testCycle1"
	time="0.12"
	error:
		message="assertion failed: Core exception in testing environment: Failed to read the project description file (.project) for P1.  The fi (...)"
		details:
		org.eclipse.core.runtime.AssertionFailedException: assertion failed: Core exception in testing environment: Failed to read the  (...)
--------
--------
testcase:
	classname="org.eclipse.jdt.core.tests.builder.MultiProjectTests"
	name="testCycle2"
	time="0.196"
	error:
		message="assertion failed: Core exception in testing environment: Failed to read the project description file (.project) for P1.  The fi (...)"
		details:
		org.eclipse.core.runtime.AssertionFailedException: assertion failed: Core exception in testing environment: Failed to read the  (...)
--------
--------
testcase:
	classname="org.eclipse.jdt.core.tests.builder.MultiProjectTests"
	name="testCycle3"
	time="15.38"
	error:
		message="assertion failed: Core exception in testing environment: Failed to read the project description file (.project) for P1.  The fi (...)"
		details:
		org.eclipse.core.runtime.AssertionFailedException: assertion failed: Core exception in testing environment: Failed to read the  (...)
--------
--------
testcase:
	classname="org.eclipse.jdt.core.tests.builder.MultiProjectTests"
	name="testCycle4"
	time="25.777"
	error:
		message="assertion failed: Core exception in testing environment: Failed to read the project description file (.project) for P1.  The fi (...)"
		details:
		org.eclipse.core.runtime.AssertionFailedException: assertion failed: Core exception in testing environment: Failed to read the  (...)
--------
--------
testcase:
	classname="org.eclipse.jdt.core.tests.builder.MultiProjectTests"
	name="testCycle5"
	time="23.521"
	error:
		message="assertion failed: Core exception in testing environment: Failed to read the project description file (.project) for P1.  The fi (...)"
		details:
		org.eclipse.core.runtime.AssertionFailedException: assertion failed: Core exception in testing environment: Failed to read the  (...)
--------
--------
testcase:
	classname="org.eclipse.jdt.core.tests.builder.MultiProjectTests"
	name="testExcludePartOfAnotherProject1"
	time="0.054"
	error:
		message="assertion failed: Core exception in testing environment: Cannot create file because existing file of wrong type exists: /export (...)"
		details:
		org.eclipse.core.runtime.AssertionFailedException: assertion failed: Core exception in testing environment: Cannot create file  (...)
--------
--------
testcase:
	classname="org.eclipse.jdt.core.tests.builder.MultiProjectTests"
	name="testExcludePartOfAnotherProject2"
	time="0.061"
	error:
		message="assertion failed: Core exception in testing environment: Cannot create file because existing file of wrong type exists: /export (...)"
		details:
		org.eclipse.core.runtime.AssertionFailedException: assertion failed: Core exception in testing environment: Cannot create file  (...)
--------
--------
testcase:
	classname="org.eclipse.jdt.core.tests.builder.MultiProjectTests"
	name="testExcludePartOfAnotherProject3"
	time="0.061"
	error:
		message="assertion failed: Core exception in testing environment: Cannot create file because existing file of wrong type exists: /export (...)"
		details:
		org.eclipse.core.runtime.AssertionFailedException: assertion failed: Core exception in testing environment: Cannot create file  (...)
--------
--------
testcase:
	classname="org.eclipse.jdt.core.tests.builder.MultiProjectTests"
	name="testIncludePartOfAnotherProject1"
	time="0.031"
	error:
		message="assertion failed: Core exception in testing environment: Cannot create file because existing file of wrong type exists: /export (...)"
		details:
		org.eclipse.core.runtime.AssertionFailedException: assertion failed: Core exception in testing environment: Cannot create file  (...)
--------
--------
testcase:
	classname="org.eclipse.jdt.core.tests.builder.MultiProjectTests"
	name="testIncludePartOfAnotherProject2"
	time="0.085"
	error:
		message="assertion failed: Core exception in testing environment: Cannot create file because existing file of wrong type exists: /export (...)"
		details:
		org.eclipse.core.runtime.AssertionFailedException: assertion failed: Core exception in testing environment: Cannot create file  (...)
--------
--------
testcase:
	classname="org.eclipse.jdt.core.tests.builder.MultiProjectTests"
	name="testIncludePartOfAnotherProject3"
	time="0.05"
	error:
		message="assertion failed: Core exception in testing environment: Cannot create file because existing file of wrong type exists: /export (...)"
		details:
		org.eclipse.core.runtime.AssertionFailedException: assertion failed: Core exception in testing environment: Cannot create file  (...)
--------
--------
testcase:
	classname="org.eclipse.jdt.core.tests.builder.MultiProjectTests"
	name="testIgnoreIfBetterNonAccessibleRule1"
	time="0.061"
	error:
		message="assertion failed: Core exception in testing environment: Cannot create file because existing file of wrong type exists: /export (...)"
		details:
		org.eclipse.core.runtime.AssertionFailedException: assertion failed: Core exception in testing environment: Cannot create file  (...)
--------
--------
testcase:
	classname="org.eclipse.jdt.core.tests.builder.MultiProjectTests"
	name="testIgnoreIfBetterNonAccessibleRule2"
	time="0.103"
	error:
		message="assertion failed: Core exception in testing environment: Cannot create file because existing file of wrong type exists: /export (...)"
		details:
		org.eclipse.core.runtime.AssertionFailedException: assertion failed: Core exception in testing environment: Cannot create file  (...)
--------
--------
testcase:
	classname="org.eclipse.jdt.core.tests.builder.MultiProjectTests"
	name="testMissingRequiredBinaries"
	time="21.754"
	error:
		message="assertion failed: Core exception in testing environment: Failed to read the project description file (.project) for P1.  The fi (...)"
		details:
		org.eclipse.core.runtime.AssertionFailedException: assertion failed: Core exception in testing environment: Failed to read the  (...)
--------
--------
testcase:
	classname="org.eclipse.jdt.core.tests.builder.MultiSourceFolderAndOutputFolderTests"
	name="test0001"
	time="0.036"
	error:
		message="assertion failed: Core exception in testing environment: Cannot create file because existing file of wrong type exists: /export (...)"
		details:
		org.eclipse.core.runtime.AssertionFailedException: assertion failed: Core exception in testing environment: Cannot create file  (...)
--------
--------
testcase:
	classname="org.eclipse.jdt.core.tests.builder.MultiSourceFolderAndOutputFolderTests"
	name="test0002"
	time="0.083"
	error:
		message="assertion failed: Core exception in testing environment: Cannot create file because existing file of wrong type exists: /export (...)"
		details:
		org.eclipse.core.runtime.AssertionFailedException: assertion failed: Core exception in testing environment: Cannot create file  (...)
--------
--------
testcase:
	classname="org.eclipse.jdt.core.tests.builder.MultiSourceFolderAndOutputFolderTests"
	name="test0003"
	time="0.076"
	error:
		message="assertion failed: Core exception in testing environment: Cannot create file because existing file of wrong type exists: /export (...)"
		details:
		org.eclipse.core.runtime.AssertionFailedException: assertion failed: Core exception in testing environment: Cannot create file  (...)
--------
--------
testcase:
	classname="org.eclipse.jdt.core.tests.builder.MultiSourceFolderAndOutputFolderTests"
	name="test0004"
	time="0.049"
	error:
		message="assertion failed: Core exception in testing environment: Cannot create file because existing file of wrong type exists: /export (...)"
		details:
		org.eclipse.core.runtime.AssertionFailedException: assertion failed: Core exception in testing environment: Cannot create file  (...)
--------
--------
testcase:
	classname="org.eclipse.jdt.core.tests.builder.MultiSourceFolderAndOutputFolderTests"
	name="test0005"
	time="0.073"
	error:
		message="assertion failed: Core exception in testing environment: Cannot create file because existing file of wrong type exists: /export (...)"
		details:
		org.eclipse.core.runtime.AssertionFailedException: assertion failed: Core exception in testing environment: Cannot create file  (...)
--------
--------
testcase:
	classname="org.eclipse.jdt.core.tests.builder.MultiSourceFolderAndOutputFolderTests"
	name="test0006"
	time="0.036"
	error:
		message="assertion failed: Core exception in testing environment: Cannot create file because existing file of wrong type exists: /export (...)"
		details:
		org.eclipse.core.runtime.AssertionFailedException: assertion failed: Core exception in testing environment: Cannot create file  (...)
--------
--------
testcase:
	classname="org.eclipse.jdt.core.tests.builder.MultiSourceFolderAndOutputFolderTests"
	name="test0007"
	time="0.113"
	error:
		message="assertion failed: Core exception in testing environment: Cannot create file because existing file of wrong type exists: /export (...)"
		details:
		org.eclipse.core.runtime.AssertionFailedException: assertion failed: Core exception in testing environment: Cannot create file  (...)
--------
--------
testcase:
	classname="org.eclipse.jdt.core.tests.builder.MultiSourceFolderAndOutputFolderTests"
	name="test0008"
	time="0.047"
	error:
		message="assertion failed: Core exception in testing environment: Cannot create file because existing file of wrong type exists: /export (...)"
		details:
		org.eclipse.core.runtime.AssertionFailedException: assertion failed: Core exception in testing environment: Cannot create file  (...)
--------
--------
testcase:
	classname="org.eclipse.jdt.core.tests.builder.MultiSourceFolderAndOutputFolderTests"
	name="test0009"
	time="0.067"
	error:
		message="assertion failed: Core exception in testing environment: Cannot create file because existing file of wrong type exists: /export (...)"
		details:
		org.eclipse.core.runtime.AssertionFailedException: assertion failed: Core exception in testing environment: Cannot create file  (...)
--------
--------
testcase:
	classname="org.eclipse.jdt.core.tests.builder.MultiSourceFolderAndOutputFolderTests"
	name="test0010"
	time="0.05"
	error:
		message="assertion failed: Core exception in testing environment: Cannot create file because existing file of wrong type exists: /export (...)"
		details:
		org.eclipse.core.runtime.AssertionFailedException: assertion failed: Core exception in testing environment: Cannot create file  (...)
--------
--------
testcase:
	classname="org.eclipse.jdt.core.tests.builder.MultiSourceFolderAndOutputFolderTests"
	name="test0011"
	time="0.08"
	error:
		message="assertion failed: Core exception in testing environment: Cannot create file because existing file of wrong type exists: /export (...)"
		details:
		org.eclipse.core.runtime.AssertionFailedException: assertion failed: Core exception in testing environment: Cannot create file  (...)
--------
--------
testcase:
	classname="org.eclipse.jdt.core.tests.builder.MultiSourceFolderAndOutputFolderTests"
	name="test0012"
	time="0.049"
	error:
		message="assertion failed: Core exception in testing environment: Cannot create file because existing file of wrong type exists: /export (...)"
		details:
		org.eclipse.core.runtime.AssertionFailedException: assertion failed: Core exception in testing environment: Cannot create file  (...)
--------
--------
testcase:
	classname="org.eclipse.jdt.core.tests.builder.OutputFolderTests"
	name="testChangeOutputFolder"
	time="15.233"
	error:
		message="assertion failed: Core exception in testing environment: Failed to read the project description file (.project) for Project.  T (...)"
		details:
		org.eclipse.core.runtime.AssertionFailedException: assertion failed: Core exception in testing environment: Failed to read the  (...)
--------
--------
testcase:
	classname="org.eclipse.jdt.core.tests.builder.OutputFolderTests"
	name="testDeleteOutputFolder"
	time="15.227"
	error:
		message="assertion failed: Core exception in testing environment: Failed to read the project description file (.project) for Project.  T (...)"
		details:
		org.eclipse.core.runtime.AssertionFailedException: assertion failed: Core exception in testing environment: Failed to read the  (...)
--------
--------
testcase:
	classname="org.eclipse.jdt.core.tests.builder.OutputFolderTests"
	name="testInvalidOutput"
	time="0.046"
	error:
		message="assertion failed: Core exception in testing environment: Cannot create file because existing file of wrong type exists: /export (...)"
		details:
		org.eclipse.core.runtime.AssertionFailedException: assertion failed: Core exception in testing environment: Cannot create file  (...)
--------
--------
testcase:
	classname="org.eclipse.jdt.core.tests.builder.OutputFolderTests"
	name="testSimpleProject"
	time="17.715"
	error:
		message="assertion failed: Core exception in testing environment: Failed to read the project description file (.project) for P1.  The fi (...)"
		details:
		org.eclipse.core.runtime.AssertionFailedException: assertion failed: Core exception in testing environment: Failed to read the  (...)
--------
--------
testcase:
	classname="org.eclipse.jdt.core.tests.builder.OutputFolderTests"
	name="testProjectWithBin"
	time="23.832"
	error:
		message="assertion failed: Core exception in testing environment: Failed to read the project description file (.project) for P2.  The fi (...)"
		details:
		org.eclipse.core.runtime.AssertionFailedException: assertion failed: Core exception in testing environment: Failed to read the  (...)
--------
--------
testcase:
	classname="org.eclipse.jdt.core.tests.builder.OutputFolderTests"
	name="testProjectWithSrcBin"
	time="15.992"
	error:
		message="assertion failed: Core exception in testing environment: Failed to read the project description file (.project) for P3.  The fi (...)"
		details:
		org.eclipse.core.runtime.AssertionFailedException: assertion failed: Core exception in testing environment: Failed to read the  (...)
--------
--------
testcase:
	classname="org.eclipse.jdt.core.tests.builder.OutputFolderTests"
	name="testProjectWith2SrcBin"
	time="0.045"
	error:
		message="assertion failed: Core exception in testing environment: Cannot create file because existing file of wrong type exists: /export (...)"
		details:
		org.eclipse.core.runtime.AssertionFailedException: assertion failed: Core exception in testing environment: Cannot create file  (...)
--------
--------
testcase:
	classname="org.eclipse.jdt.core.tests.builder.OutputFolderTests"
	name="testProjectWith2SrcAsBin"
	time="0.089"
	error:
		message="assertion failed: Core exception in testing environment: Cannot create file because existing file of wrong type exists: /export (...)"
		details:
		org.eclipse.core.runtime.AssertionFailedException: assertion failed: Core exception in testing environment: Cannot create file  (...)
--------
--------
testcase:
	classname="org.eclipse.jdt.core.tests.builder.OutputFolderTests"
	name="testProjectWith2Src2Bin"
	time="0.083"
	error:
		message="assertion failed: Core exception in testing environment: Cannot create file because existing file of wrong type exists: /export (...)"
		details:
		org.eclipse.core.runtime.AssertionFailedException: assertion failed: Core exception in testing environment: Cannot create file  (...)
--------
--------
testcase:
	classname="org.eclipse.jdt.core.tests.builder.OutputFolderTests"
	name="testProjectWith3Src2Bin"
	time="0.085"
	error:
		message="assertion failed: Core exception in testing environment: Cannot create file because existing file of wrong type exists: /export (...)"
		details:
		org.eclipse.core.runtime.AssertionFailedException: assertion failed: Core exception in testing environment: Cannot create file  (...)
--------
--------
testcase:
	classname="org.eclipse.jdt.core.tests.builder.OutputFolderTests"
	name="test2ProjectWith1Bin"
	time="0.061"
	error:
		message="assertion failed: Core exception in testing environment: Cannot create file because existing file of wrong type exists: /export (...)"
		details:
		org.eclipse.core.runtime.AssertionFailedException: assertion failed: Core exception in testing environment: Cannot create file  (...)
--------
--------
testcase:
	classname="org.eclipse.jdt.core.tests.builder.PackageTests"
	name="testPackageProblem"
	time="18.655"
	error:
		message="assertion failed: Core exception in testing environment: Failed to read the project description file (.project) for Project.  T (...)"
		details:
		org.eclipse.core.runtime.AssertionFailedException: assertion failed: Core exception in testing environment: Failed to read the  (...)
--------
--------
testcase:
	classname="org.eclipse.jdt.core.tests.builder.StaticFinalTests"
	name="testBoolean"
	time="17.242"
	error:
		message="assertion failed: Core exception in testing environment: Failed to read the project description file (.project) for Project.  T (...)"
		details:
		org.eclipse.core.runtime.AssertionFailedException: assertion failed: Core exception in testing environment: Failed to read the  (...)
--------
--------
testcase:
	classname="org.eclipse.jdt.core.tests.builder.StaticFinalTests"
	name="testByte"
	time="16.724"
	error:
		message="assertion failed: Core exception in testing environment: Failed to read the project description file (.project) for Project.  T (...)"
		details:
		org.eclipse.core.runtime.AssertionFailedException: assertion failed: Core exception in testing environment: Failed to read the  (...)
--------
--------
testcase:
	classname="org.eclipse.jdt.core.tests.builder.StaticFinalTests"
	name="testChar"
	time="17.527"
	error:
		message="assertion failed: Core exception in testing environment: Failed to read the project description file (.project) for Project.  T (...)"
		details:
		org.eclipse.core.runtime.AssertionFailedException: assertion failed: Core exception in testing environment: Failed to read the  (...)
--------
--------
testcase:
	classname="org.eclipse.jdt.core.tests.builder.StaticFinalTests"
	name="testDouble"
	time="22.601"
	error:
		message="assertion failed: Core exception in testing environment: Failed to read the project description file (.project) for Project.  T (...)"
		details:
		org.eclipse.core.runtime.AssertionFailedException: assertion failed: Core exception in testing environment: Failed to read the  (...)
--------
--------
testcase:
	classname="org.eclipse.jdt.core.tests.builder.StaticFinalTests"
	name="testFloat"
	time="17.264"
	error:
		message="assertion failed: Core exception in testing environment: Failed to read the project description file (.project) for Project.  T (...)"
		details:
		org.eclipse.core.runtime.AssertionFailedException: assertion failed: Core exception in testing environment: Failed to read the  (...)
--------
--------
testcase:
	classname="org.eclipse.jdt.core.tests.builder.StaticFinalTests"
	name="testInt"
	time="15.787"
	error:
		message="assertion failed: Core exception in testing environment: Failed to read the project description file (.project) for Project.  T (...)"
		details:
		org.eclipse.core.runtime.AssertionFailedException: assertion failed: Core exception in testing environment: Failed to read the  (...)
--------
--------
testcase:
	classname="org.eclipse.jdt.core.tests.builder.StaticFinalTests"
	name="testLong"
	time="14.546"
	error:
		message="assertion failed: Core exception in testing environment: Failed to read the project description file (.project) for Project.  T (...)"
		details:
		org.eclipse.core.runtime.AssertionFailedException: assertion failed: Core exception in testing environment: Failed to read the  (...)
--------
--------
testcase:
	classname="org.eclipse.jdt.core.tests.builder.StaticFinalTests"
	name="testShort"
	time="18.636"
	error:
		message="assertion failed: Core exception in testing environment: Failed to read the project description file (.project) for Project.  T (...)"
		details:
		org.eclipse.core.runtime.AssertionFailedException: assertion failed: Core exception in testing environment: Failed to read the  (...)
--------
--------
testcase:
	classname="org.eclipse.jdt.core.tests.builder.StaticFinalTests"
	name="testString"
	time="15.117"
	error:
		message="assertion failed: Core exception in testing environment: Failed to read the project description file (.project) for Project.  T (...)"
		details:
		org.eclipse.core.runtime.AssertionFailedException: assertion failed: Core exception in testing environment: Failed to read the  (...)
--------
--------
testcase:
	classname="org.eclipse.jdt.core.tests.builder.Java50Tests"
	name="testAnnotation"
	time="18.303"
	error:
		message="assertion failed: Core exception in testing environment: Failed to read the project description file (.project) for Project.  T (...)"
		details:
		org.eclipse.core.runtime.AssertionFailedException: assertion failed: Core exception in testing environment: Failed to read the  (...)
--------
--------
testcase:
	classname="org.eclipse.jdt.core.tests.builder.Java50Tests"
	name="testParameterizedType1"
	time="11.808"
	error:
		message="assertion failed: Core exception in testing environment: Failed to read the project description file (.project) for Project.  T (...)"
		details:
		org.eclipse.core.runtime.AssertionFailedException: assertion failed: Core exception in testing environment: Failed to read the  (...)
--------
--------
testcase:
	classname="org.eclipse.jdt.core.tests.builder.Java50Tests"
	name="testParameterizedType2"
	time="0.045"
	error:
		message="assertion failed: Core exception in testing environment: Failed to read the project description file (.project) for Project.  T (...)"
		details:
		org.eclipse.core.runtime.AssertionFailedException: assertion failed: Core exception in testing environment: Failed to read the  (...)
--------
--------
testcase:
	classname="org.eclipse.jdt.core.tests.builder.PackageInfoTest"
	name="test001"
	time="0.046"
	error:
		message="assertion failed: Core exception in testing environment: Failed to read the project description file (.project) for Project.  T (...)"
		details:
		org.eclipse.core.runtime.AssertionFailedException: assertion failed: Core exception in testing environment: Failed to read the  (...)
--------
--------
testcase:
	classname="org.eclipse.jdt.core.tests.builder.PackageInfoTest"
	name="test002"
	time="0.046"
	error:
		message="assertion failed: Core exception in testing environment: Failed to read the project description file (.project) for Project.  T (...)"
		details:
		org.eclipse.core.runtime.AssertionFailedException: assertion failed: Core exception in testing environment: Failed to read the  (...)
--------
--------
testcase:
	classname="org.eclipse.jdt.core.tests.builder.ParticipantBuildTests"
	name="testBuildStarting"
	time="0.05"
	error:
		message="assertion failed: Core exception in testing environment: Failed to read the project description file (.project) for Project.  T (...)"
		details:
		org.eclipse.core.runtime.AssertionFailedException: assertion failed: Core exception in testing environment: Failed to read the  (...)
--------
--------
testcase:
	classname="org.eclipse.jdt.core.tests.builder.ParticipantBuildTests"
	name="testDefaultValue"
	time="0.047"
	error:
		message="assertion failed: Core exception in testing environment: Failed to read the project description file (.project) for Project.  T (...)"
		details:
		org.eclipse.core.runtime.AssertionFailedException: assertion failed: Core exception in testing environment: Failed to read the  (...)
--------
--------
testcase:
	classname="org.eclipse.jdt.core.tests.builder.ParticipantBuildTests"
	name="testParticipantProblems"
	time="0.231"
	error:
		message="assertion failed: Core exception in testing environment: Failed to read the project description file (.project) for Project.  T (...)"
		details:
		org.eclipse.core.runtime.AssertionFailedException: assertion failed: Core exception in testing environment: Failed to read the  (...)
--------
--------
testcase:
	classname="org.eclipse.jdt.core.tests.builder.ParticipantBuildTests"
	name="testProcessAnnotationDeclarations"
	time="0.04"
	error:
		message="assertion failed: Core exception in testing environment: Failed to read the project description file (.project) for Project.  T (...)"
		details:
		org.eclipse.core.runtime.AssertionFailedException: assertion failed: Core exception in testing environment: Failed to read the  (...)
--------
--------
testcase:
	classname="org.eclipse.jdt.core.tests.builder.ParticipantBuildTests"
	name="testProcessAnnotationQualifiedReferences"
	time="0.038"
	error:
		message="assertion failed: Core exception in testing environment: Failed to read the project description file (.project) for Project.  T (...)"
		details:
		org.eclipse.core.runtime.AssertionFailedException: assertion failed: Core exception in testing environment: Failed to read the  (...)
--------
--------
testcase:
	classname="org.eclipse.jdt.core.tests.builder.ParticipantBuildTests"
	name="testProcessAnnotationReferences"
	time="0.037"
	error:
		message="assertion failed: Core exception in testing environment: Failed to read the project description file (.project) for Project.  T (...)"
		details:
		org.eclipse.core.runtime.AssertionFailedException: assertion failed: Core exception in testing environment: Failed to read the  (...)
--------
--------
testcase:
	classname="org.eclipse.jdt.core.tests.builder.ParticipantBuildTests"
	name="testResolvedMethod"
	time="0.046"
	error:
		message="assertion failed: Core exception in testing environment: Failed to read the project description file (.project) for Project.  T (...)"
		details:
		org.eclipse.core.runtime.AssertionFailedException: assertion failed: Core exception in testing environment: Failed to read the  (...)
--------
********
Missing suites (1):
org.eclipse.pde.ui.tests.AllPDETests
********
BUILD COMPLETE:	build.14

Date of build:	03/08/2007 08:43:20
Time to build:	183 minutes 10 seconds
Last changed:	03/08/2007 12:04:15
Last log entry:	drlvm

***********************************************************
Modifications since last successful build:	(18)
            
add cc-drlvm log20070308120415Lbuild.15 03/08/2007 12:04:15drlvm
add cc-drlvm log20070308083104Lbuild.14 03/08/2007 08:31:04drlvm
add cc-drlvm log20070308083104Lbuild.14 03/08/2007 08:31:04drlvm
add cc-drlvm log20070308083104Lbuild.14 03/08/2007 08:31:04drlvm
add cc-drlvm log20070308083104Lbuild.14 03/08/2007 08:31:04drlvm
add cc-drlvm log20070308083104Lbuild.14 03/08/2007 08:31:04drlvm
add cc-drlvm log20070308083104Lbuild.14 03/08/2007 08:31:04drlvm
add cc-drlvm log20070308083104Lbuild.14 03/08/2007 08:31:04drlvm
add cc-drlvm log20070308083104Lbuild.14 03/08/2007 08:31:04drlvm
add cc-drlvm log20070308083104Lbuild.14 03/08/2007 08:31:04drlvm
add cc-drlvm log20070308083104Lbuild.14 03/08/2007 08:31:04drlvm
add cc-drlvm log20070308083104Lbuild.14 03/08/2007 08:31:04drlvm
add cc-drlvm log20070308083104Lbuild.14 03/08/2007 08:31:04drlvm
add cc-drlvm log20070308083104Lbuild.14 03/08/2007 08:31:04drlvm
add cc-drlvm log20070308083104Lbuild.14 03/08/2007 08:31:04drlvm
add cc-drlvm log20070308083104Lbuild.14 03/08/2007 08:31:04drlvm
add cc-drlvm log20070308083104Lbuild.14 03/08/2007 08:31:04drlvm
add cc-drlvm log20070308083104Lbuild.14 03/08/2007 08:31:04drlvm

Mime
View raw message