harmony-alerts mailing list archives

Site index · List index
Message view « Date » · « Thread »
Top « Date » · « Thread »
From nom...@intel.com
Subject [build-test alert] BUILD FAILED Windows XP SP2 msvc debug: classlib over drlvm
Date Tue, 06 Mar 2007 10:39:12 GMT
BUILD FAILED:
	Ant Error Message:
C:\cruise\trunk\cc\projects\classlib\trunk\build.xml:167: The following error occurred while
executing this line: C:\cruise\trunk\cc\projects\classlib\trunk\make\build-test.xml:52: The
following error occurred while executing this line: C:\cruise\trunk\cc\projects\classlib\trunk\make\properties.xml:354:
The following error occurred while executing this line: C:\cruise\trunk\cc\projects\classlib\trunk\modules\nio_char\build.xml:135:
Compile failed; see the compiler error output for details.

Date of build:	03/06/2007 16:24:26
Time to build:	14 minutes 18 seconds
Last changed:	03/06/2007 16:14:02
Last log entry:	drlvm

***********************************************************
Execution log (errors/warnings messages):	

========================================
Testing class libraries...
========================================

Checking for depends/jars/yoko_M2-20070130/yoko.jar
Checking for depends/jars/yoko_M2-20070130/yoko-core.jar
Checking for depends/jars/yoko_M2-20070130/yoko-rmi-impl.jar
Checking for depends/jars/yoko_M2-20070130/yoko-rmi-spec.jar
Checking for depends/jars/bcel-5.2/bcel-5.2.jar
Checking for depends/jars/xalan-j_2.7.0/xalan.jar
Checking for depends/jars/xerces_2.8.0/resolver.jar
Checking for depends/jars/xerces_2.8.0/xercesImpl.jar
Checking for depends/jars/xerces_2.8.0/xml-apis.jar
Checking for depends/jars/junit_3.8.2/junit.jar
Checking for depends/jars/bcprov-jdk15-134/bcprov.jar
Checking for depends/jars/icu4j_3.4.4/icu4j_3_4_4.jar
Checking for depends/jars/mx4j_3.0.2/mx4j.zip
Checking for depends/jars/ecj_3.2/ecj_3.2.jar
Checking for depends/jars/jetty/jetty-6.0.0.jar
Checking for depends/jars/jetty/jetty-util-6.0.0.jar
Checking for depends/jars/jetty/servlet-api-2.5-6.0.0.jar
Checking for depends/libs/windows.x86/msvcr71.dll
Checking for depends/libs/windows.x86/swing_awt_deps_winxp_2006-09-28.tgz
Since fork is false, ignoring memoryMaximumSize setting
Compiling ACCESSIBILITY classes
Compiling ACCESSIBILITY tests
Since fork is false, ignoring memoryMaximumSize setting
Compiling ANNOTATION classes
Compiling ANNOTATION tests
Since fork is false, ignoring memoryMaximumSize setting
Compiling APPLET classes
Compiling APPLET tests
Since fork is false, ignoring memoryMaximumSize setting
Compiling ARCHIVE classes
Compiling ARCHIVE tests
Since fork is false, ignoring memoryMaximumSize setting
Compiling AUTH classes
Compiling AUTH tests
Since fork is false, ignoring memoryMaximumSize setting
Compiling AWT classes
Compiling AWT tests
Since fork is false, ignoring memoryMaximumSize setting
java.lang.RuntimeException: expected from EDT
	at java.awt.EventDispatchThreadRTest$1.run(EventDispatchThreadRTest.java:29)
	at java.awt.event.InvocationEvent.runAndNotify(InvocationEvent.java:90)
	at java.awt.event.InvocationEvent.dispatch(InvocationEvent.java:77)
	at java.awt.EventQueueCore.dispatchEventImpl(EventQueueCore.java:140)
	at java.awt.EventQueue.dispatchEvent(EventQueue.java:144)
	at java.awt.EventDispatchThread.runModalLoop(EventDispatchThread.java:73)
	at java.awt.EventDispatchThread.run(EventDispatchThread.java:45)
Compiling BEANS classes
Compiling support classes for BEANS tests
Compiling internal BEANS tests
Compiling BEANS tests
Since fork is false, ignoring memoryMaximumSize setting
Running internal BEANS tests
Running BEANS tests
Compiling CRYPTO classes
Compiling CRYPTO test support files
Since fork is false, ignoring memoryMaximumSize setting
Compiling CRYPTO api tests
Since fork is false, ignoring memoryMaximumSize setting
Compiling CRYPTO api injected tests
Since fork is false, ignoring memoryMaximumSize setting
Compiling CRYPTO impl injected tests
Since fork is false, ignoring memoryMaximumSize setting
Compiling CRYPTO impl tests
Since fork is false, ignoring memoryMaximumSize setting
Running CRYPTO api tests
Running CRYPTO api.injected tests
Running CRYPTO impl tests
Running CRYPTO impl injected tests
Compiling ImageIO classes
Compiling ImageIO tests
Compiling INSTRUMENT classes
Compiling INSTRUMENT tests
Since fork is false, ignoring memoryMaximumSize setting
Compiling JNDI classes
Compiling JNDI tests
Since fork is false, ignoring memoryMaximumSize setting
Compiling LANG-MANAGEMENT classes
Compiling LANG-MANAGEMENT API tests
Compiling LANG-MANAGEMENT Implementation tests
Compiling LOGGING classes
Compiling LOGGING tests
Since fork is false, ignoring memoryMaximumSize setting
Compiling LUNI classes
Compiling LUNI JUnit Tests
Since fork is false, ignoring memoryMaximumSize setting
Running LUNI JUnit Tests
java.io.IOException: Stream is closed
	at java.io.BufferedInputStream.read(BufferedInputStream.java:247)
	at java.io.FilterInputStream.read(FilterInputStream.java:137)
	at tests.support.Support_Exec$2.run(Support_Exec.java:199)
	at java.lang.Thread.run(Thread.java:660)
Compiling MATH classes
Compiling MATH tests
Since fork is false, ignoring memoryMaximumSize setting
Compiling MISC classes
Compiling MISC tests
Since fork is false, ignoring memoryMaximumSize setting
Compiling NIO classes
Compiling NIO tests
Since fork is false, ignoring memoryMaximumSize setting
Compiling NIO_CHAR classes
Compiling NIO_CHAR tests
Since fork is false, ignoring memoryMaximumSize setting
----------
1. ERROR in C:\cruise\trunk\cc\projects\classlib\trunk\modules\nio_char\src\test\java\tests\api\java\nio\charset\ASCCharsetTest.java
 (at line 22)
	public class ASCCharsetTest extends AbstractCharsetTestCase {
	                                    ^^^^^^^^^^^^^^^^^^^^^^^
AbstractCharsetTestCase cannot be resolved to a type
----------
2. ERROR in C:\cruise\trunk\cc\projects\classlib\trunk\modules\nio_char\src\test\java\tests\api\java\nio\charset\ASCCharsetTest.java
 (at line 29)
	super(arg0, "US-ASCII", new String[] { "ISO646-US", "ASCII", "cp367",
				"ascii7", "ANSI_X3.4-1986", "iso-ir-6", "us", "646",
				"iso_646.irv:1983", "csASCII", "ANSI_X3.4-1968",
				"ISO_646.irv:1991" }, true, true); // "ibm-367"
	^^^^^^^^^^^^^^^^^^^^^^^^^^^^^^^^^^^^^^^^^^^^^^^^^^^^^^^^^^^^^^^^^^^^^^^^^^^^^^^^^^^^^^^^^^^^^^^^^^^^^^^^^^^^^^^^^^^^^^^^^^^^^^^^^^^^^^^^^^^^^^^^^^^^^^^^^^^^^^^^^^^^^^^^^^^^^^^^^^^^^^^^^^^^^^^^^^^^^^^^^^^^^^^^^^^^^^^^^^^^
The constructor Object(String, String, String[], boolean, boolean) is undefined
----------
3. ERROR in C:\cruise\trunk\cc\projects\classlib\trunk\modules\nio_char\src\test\java\tests\api\java\nio\charset\ASCCharsetTest.java
 (at line 43)
	this.testingCharset.newEncoder().replacement()[0],
	     ^^^^^^^^^^^^^^
testingCharset cannot be resolved or is not a field
----------
4. ERROR in C:\cruise\trunk\cc\projects\classlib\trunk\modules\nio_char\src\test\java\tests\api\java\nio\charset\ASCCharsetTest.java
 (at line 45)
	internalTestEncode(input, output);
	^^^^^^^^^^^^^^^^^^
The method internalTestEncode(String, byte[]) is undefined for the type ASCCharsetTest
----------
5. ERROR in C:\cruise\trunk\cc\projects\classlib\trunk\modules\nio_char\src\test\java\tests\api\java\nio\charset\ASCCharsetTest.java
 (at line 56)
	internalTestDecode(input, output);
	^^^^^^^^^^^^^^^^^^
The method internalTestDecode(byte[], char[]) is undefined for the type ASCCharsetTest
----------
----------
6. ERROR in C:\cruise\trunk\cc\projects\classlib\trunk\modules\nio_char\src\test\java\tests\api\java\nio\charset\AbstractCharsetTestCase.java
 (at line 12)
	public abstract class ConcreteCharsetTest extends TestCase {
	                      ^^^^^^^^^^^^^^^^^^^
The public type ConcreteCharsetTest must be defined in its own file
----------
----------
7. ERROR in C:\cruise\trunk\cc\projects\classlib\trunk\modules\nio_char\src\test\java\tests\api\java\nio\charset\ISOCharsetTest.java
 (at line 22)
	public class ISOCharsetTest extends AbstractCharsetTestCase {
	                                    ^^^^^^^^^^^^^^^^^^^^^^^
AbstractCharsetTestCase cannot be resolved to a type
----------
8. ERROR in C:\cruise\trunk\cc\projects\classlib\trunk\modules\nio_char\src\test\java\tests\api\java\nio\charset\ISOCharsetTest.java
 (at line 28)
	super(arg0, "ISO-8859-1", new String[] { "iso-ir-100", "8859_1",
				"ISO_8859-1", "ISO8859_1", "819", "csISOLatin1", "IBM-819",
				"ISO_8859-1:1987", "latin1", "cp819", "ISO8859-1", "IBM819",
				"ISO_8859_1", "l1" }, true, true);
	^^^^^^^^^^^^^^^^^^^^^^^^^^^^^^^^^^^^^^^^^^^^^^^^^^^^^^^^^^^^^^^^^^^^^^^^^^^^^^^^^^^^^^^^^^^^^^^^^^^^^^^^^^^^^^^^^^^^^^^^^^^^^^^^^^^^^^^^^^^^^^^^^^^^^^^^^^^^^^^^^^^^^^^^^^^^^^^^^^^^^^^^^^^^^^^^^^^^^^^^^^^^^^^^^^^^^^^^^^^^^^^^^^^^^^^^^^
The constructor Object(String, String, String[], boolean, boolean) is undefined
----------
9. ERROR in C:\cruise\trunk\cc\projects\classlib\trunk\modules\nio_char\src\test\java\tests\api\java\nio\charset\ISOCharsetTest.java
 (at line 42)
	this.testingCharset.newEncoder().replacement()[0],
	     ^^^^^^^^^^^^^^
testingCharset cannot be resolved or is not a field
----------
10. ERROR in C:\cruise\trunk\cc\projects\classlib\trunk\modules\nio_char\src\test\java\tests\api\java\nio\charset\ISOCharsetTest.java
 (at line 44)
	internalTestEncode(input, output);
	^^^^^^^^^^^^^^^^^^
The method internalTestEncode(String, byte[]) is undefined for the type ISOCharsetTest
----------
11. ERROR in C:\cruise\trunk\cc\projects\classlib\trunk\modules\nio_char\src\test\java\tests\api\java\nio\charset\ISOCharsetTest.java
 (at line 55)
	internalTestDecode(input, output);
	^^^^^^^^^^^^^^^^^^
The method internalTestDecode(byte[], char[]) is undefined for the type ISOCharsetTest
----------
----------
12. ERROR in C:\cruise\trunk\cc\projects\classlib\trunk\modules\nio_char\src\test\java\tests\api\java\nio\charset\UTF16BECharsetTest.java
 (at line 22)
	public class UTF16BECharsetTest extends AbstractCharsetTestCase {
	                                        ^^^^^^^^^^^^^^^^^^^^^^^
AbstractCharsetTestCase cannot be resolved to a type
----------
13. ERROR in C:\cruise\trunk\cc\projects\classlib\trunk\modules\nio_char\src\test\java\tests\api\java\nio\charset\UTF16BECharsetTest.java
 (at line 28)
	super(arg0, "UTF-16BE", new String[] { "X-UTF-16BE", "UTF_16BE" },
				true, true); // "ISO-10646-UCS-2"
	^^^^^^^^^^^^^^^^^^^^^^^^^^^^^^^^^^^^^^^^^^^^^^^^^^^^^^^^^^^^^^^^^^^^^^^^^^^^^^^^^^^
The constructor Object(String, String, String[], boolean, boolean) is undefined
----------
14. ERROR in C:\cruise\trunk\cc\projects\classlib\trunk\modules\nio_char\src\test\java\tests\api\java\nio\charset\UTF16BECharsetTest.java
 (at line 40)
	internalTestEncode(input, output);
	^^^^^^^^^^^^^^^^^^
The method internalTestEncode(String, byte[]) is undefined for the type UTF16BECharsetTest
----------
15. ERROR in C:\cruise\trunk\cc\projects\classlib\trunk\modules\nio_char\src\test\java\tests\api\java\nio\charset\UTF16BECharsetTest.java
 (at line 51)
	internalTestDecode(input, output);
	^^^^^^^^^^^^^^^^^^
The method internalTestDecode(byte[], char[]) is undefined for the type UTF16BECharsetTest
----------
----------
16. ERROR in C:\cruise\trunk\cc\projects\classlib\trunk\modules\nio_char\src\test\java\tests\api\java\nio\charset\UTF16CharsetTest.java
 (at line 22)
	public class UTF16CharsetTest extends AbstractCharsetTestCase {
	                                      ^^^^^^^^^^^^^^^^^^^^^^^
AbstractCharsetTestCase cannot be resolved to a type
----------
17. ERROR in C:\cruise\trunk\cc\projects\classlib\trunk\modules\nio_char\src\test\java\tests\api\java\nio\charset\UTF16CharsetTest.java
 (at line 28)
	super(arg0, "UTF-16", new String[] { "UTF_16" }, true, true);
	^^^^^^^^^^^^^^^^^^^^^^^^^^^^^^^^^^^^^^^^^^^^^^^^^^^^^^^^^^^^
The constructor Object(String, String, String[], boolean, boolean) is undefined
----------
----------
18. ERROR in C:\cruise\trunk\cc\projects\classlib\trunk\modules\nio_char\src\test\java\tests\api\java\nio\charset\UTF16LECharsetTest.java
 (at line 22)
	public class UTF16LECharsetTest extends AbstractCharsetTestCase {
	                                        ^^^^^^^^^^^^^^^^^^^^^^^
AbstractCharsetTestCase cannot be resolved to a type
----------
19. ERROR in C:\cruise\trunk\cc\projects\classlib\trunk\modules\nio_char\src\test\java\tests\api\java\nio\charset\UTF16LECharsetTest.java
 (at line 28)
	super(arg0, "UTF-16LE", new String[] { "UTF_16LE", "X-UTF-16LE" },
				true, true);
	^^^^^^^^^^^^^^^^^^^^^^^^^^^^^^^^^^^^^^^^^^^^^^^^^^^^^^^^^^^^^^^^^^^^^^^^^^^^^^^^^^^
The constructor Object(String, String, String[], boolean, boolean) is undefined
----------
20. ERROR in C:\cruise\trunk\cc\projects\classlib\trunk\modules\nio_char\src\test\java\tests\api\java\nio\charset\UTF16LECharsetTest.java
 (at line 40)
	internalTestEncode(input, output);
	^^^^^^^^^^^^^^^^^^
The method internalTestEncode(String, byte[]) is undefined for the type UTF16LECharsetTest
----------
21. ERROR in C:\cruise\trunk\cc\projects\classlib\trunk\modules\nio_char\src\test\java\tests\api\java\nio\charset\UTF16LECharsetTest.java
 (at line 51)
	internalTestDecode(input, output);
	^^^^^^^^^^^^^^^^^^
The method internalTestDecode(byte[], char[]) is undefined for the type UTF16LECharsetTest
----------
----------
22. ERROR in C:\cruise\trunk\cc\projects\classlib\trunk\modules\nio_char\src\test\java\tests\api\java\nio\charset\UTF8CharsetTest.java
 (at line 22)
	public class UTF8CharsetTest extends AbstractCharsetTestCase {
	                                     ^^^^^^^^^^^^^^^^^^^^^^^
AbstractCharsetTestCase cannot be resolved to a type
----------
23. ERROR in C:\cruise\trunk\cc\projects\classlib\trunk\modules\nio_char\src\test\java\tests\api\java\nio\charset\UTF8CharsetTest.java
 (at line 29)
	super(arg0, "UTF-8", new String[] { "UTF8" }, true, true);
	^^^^^^^^^^^^^^^^^^^^^^^^^^^^^^^^^^^^^^^^^^^^^^^^^^^^^^^^^
The constructor Object(String, String, String[], boolean, boolean) is undefined
----------
24. ERROR in C:\cruise\trunk\cc\projects\classlib\trunk\modules\nio_char\src\test\java\tests\api\java\nio\charset\UTF8CharsetTest.java
 (at line 40)
	internalTestDecode(input, output);
	^^^^^^^^^^^^^^^^^^
The method internalTestDecode(byte[], char[]) is undefined for the type UTF8CharsetTest
----------
25. ERROR in C:\cruise\trunk\cc\projects\classlib\trunk\modules\nio_char\src\test\java\tests\api\java\nio\charset\UTF8CharsetTest.java
 (at line 51)
	internalTestEncode(input, output);
	^^^^^^^^^^^^^^^^^^
The method internalTestEncode(String, byte[]) is undefined for the type UTF8CharsetTest
----------
25 problems (25 errors)

***********************************************************
Unit Tests: (11994)
        

***********************************************************
Modifications since last successful build:	(14)
            
add cc-drlvm log20070306161402Lbuild.233 03/06/2007 16:14:02drlvm
modified liangyx  /harmony/enhanced/classlib/trunk/modules/nio_char/src/test/java/tests/api/java/nio/charset/AbstractCharsetTestCase.java
03/06/2007 16:07:15 fix bugs of HARMONY-3306 patch
modified varlax  /harmony/enhanced/drlvm/trunk/build/make/targets/ehwa.test.xml 03/06/2007
15:47:11 Applied HARMONY-3276 and HARMONY-3303 test mode tweaks.
modified varlax  /harmony/enhanced/drlvm/trunk/build/make/test.properties 03/06/2007 15:47:11
Applied HARMONY-3276 and HARMONY-3303 test mode tweaks.
add cc-classlib log20070306144336Lbuild.177 03/06/2007 14:43:36classlib
modified liangyx  /harmony/enhanced/classlib/trunk/modules/nio_char/src/test/java/tests/api/java/nio/charset/ISOCharsetTest.java
03/06/2007 14:35:59 Apply patch for HARMONY-3306 ([classlib][luni]rename ConcreteCharsetTest
and move it out from exclude list)
modified liangyx  /harmony/enhanced/classlib/trunk/modules/nio_char/src/test/java/tests/api/java/nio/charset/UTF16BECharsetTest.java
03/06/2007 14:35:59 Apply patch for HARMONY-3306 ([classlib][luni]rename ConcreteCharsetTest
and move it out from exclude list)
added liangyx  /harmony/enhanced/classlib/trunk/modules/nio_char/src/test/java/tests/api/java/nio/charset/AbstractCharsetTestCase.java
03/06/2007 14:35:59 Apply patch for HARMONY-3306 ([classlib][luni]rename ConcreteCharsetTest
and move it out from exclude list)
deleted liangyx  /harmony/enhanced/classlib/trunk/modules/nio_char/src/test/java/tests/api/java/nio/charset/ConcreteCharsetTest.java
03/06/2007 14:35:59 Apply patch for HARMONY-3306 ([classlib][luni]rename ConcreteCharsetTest
and move it out from exclude list)
modified liangyx  /harmony/enhanced/classlib/trunk/modules/nio_char/make/exclude.common 03/06/2007
14:35:59 Apply patch for HARMONY-3306 ([classlib][luni]rename ConcreteCharsetTest and move
it out from exclude list)
modified liangyx  /harmony/enhanced/classlib/trunk/modules/nio_char/src/test/java/tests/api/java/nio/charset/UTF16CharsetTest.java
03/06/2007 14:35:59 Apply patch for HARMONY-3306 ([classlib][luni]rename ConcreteCharsetTest
and move it out from exclude list)
modified liangyx  /harmony/enhanced/classlib/trunk/modules/nio_char/src/test/java/tests/api/java/nio/charset/ASCCharsetTest.java
03/06/2007 14:35:59 Apply patch for HARMONY-3306 ([classlib][luni]rename ConcreteCharsetTest
and move it out from exclude list)
modified liangyx  /harmony/enhanced/classlib/trunk/modules/nio_char/src/test/java/tests/api/java/nio/charset/UTF16LECharsetTest.java
03/06/2007 14:35:59 Apply patch for HARMONY-3306 ([classlib][luni]rename ConcreteCharsetTest
and move it out from exclude list)
modified liangyx  /harmony/enhanced/classlib/trunk/modules/nio_char/src/test/java/tests/api/java/nio/charset/UTF8CharsetTest.java
03/06/2007 14:35:59 Apply patch for HARMONY-3306 ([classlib][luni]rename ConcreteCharsetTest
and move it out from exclude list)

Mime
View raw message