harmony-alerts mailing list archives

Site index · List index
Message view « Date » · « Thread »
Top « Date » · « Thread »
From nom...@intel.com
Subject [build-test alert] BUILD FAILED Linux SUSE 9 gcc debug: classlib over drlvm
Date Mon, 05 Mar 2007 11:13:25 GMT
BUILD FAILED:
	Ant Error Message:
/export/cruise/trunk/cc/projects/classlib/trunk/build.xml:167: The following error occurred
while executing this line: /export/cruise/trunk/cc/projects/classlib/trunk/make/build-test.xml:133:
There were test crashes: /export/cruise/trunk/cc/projects/classlib/trunk/build/test_report/TEST-org.apache.harmony.archive.tests.java.util.jar.JarFileTest.xml:/export/cruise/trunk/cc/projects/classlib/trunk/build/test_report/TEST-org.apache.harmony.security.tests.PolicyEntryTest.xml:/export/cruise/trunk/cc/projects/classlib/trunk/build/test_report/TEST-org.apache.harmony.security.tests.java.security.cert.CertificateFactory4Test.xml

Date of build:	03/05/2007 16:39:13
Time to build:	33 minutes 44 seconds
Last changed:	03/05/2007 16:09:02
Last log entry:	Apply patch for HARMONY-3238([classlib][luni] InputStreamReader allocates
fixed space internal buffer)

***********************************************************
Execution log (errors/warnings messages):	
Tests FAILED
Tests FAILED

========================================
Testing class libraries...
========================================
Checking for depends/jars/yoko_M2-20070130/yoko.jar
Checking for depends/jars/yoko_M2-20070130/yoko-core.jar
Checking for depends/jars/yoko_M2-20070130/yoko-rmi-impl.jar
Checking for depends/jars/yoko_M2-20070130/yoko-rmi-spec.jar
Checking for depends/jars/bcel-5.2/bcel-5.2.jar
Checking for depends/jars/xalan-j_2.7.0/xalan.jar
Checking for depends/jars/xerces_2.8.0/resolver.jar
Checking for depends/jars/xerces_2.8.0/xercesImpl.jar
Checking for depends/jars/xerces_2.8.0/xml-apis.jar
Checking for depends/jars/junit_3.8.2/junit.jar
Checking for depends/jars/bcprov-jdk15-134/bcprov.jar
Checking for depends/jars/icu4j_3.4.4/icu4j_3_4_4.jar
Checking for depends/jars/mx4j_3.0.2/mx4j.zip
Checking for depends/jars/ecj_3.2/ecj_3.2.jar
Checking for depends/jars/jetty/jetty-6.0.0.jar
Checking for depends/jars/jetty/jetty-util-6.0.0.jar
Checking for depends/jars/jetty/servlet-api-2.5-6.0.0.jar
Checking for depends/libs/build/lcms/icc34.h
Checking for depends/libs/build/lcms/lcms.h
Checking for depends/libs/build/png/pngconf.h
Checking for depends/libs/build/png/png.h
Checking for depends/libs/build/jpeg/jconfig.lnx
Checking for depends/libs/build/jpeg/jpeglib.h
Checking for depends/libs/build/jpeg/jmorecfg.h
Checking for depends/libs/build/jpeg/jerror.h
Checking for depends/libs/build/lcms/liblcms.linux.x86
Checking for depends/libs/build/png/libpng.linux.x86
Checking for depends/libs/build/jpeg/libjpeg.linux.x86
Since fork is false, ignoring memoryMaximumSize setting
Compiling ACCESSIBILITY classes
Compiling ACCESSIBILITY tests
Since fork is false, ignoring memoryMaximumSize setting
Compiling ANNOTATION classes
Compiling ANNOTATION tests
Since fork is false, ignoring memoryMaximumSize setting
Compiling APPLET classes
Compiling APPLET tests
Since fork is false, ignoring memoryMaximumSize setting
Compiling ARCHIVE classes
Compiling ARCHIVE tests
Since fork is false, ignoring memoryMaximumSize setting
SIGSEGV in VM code.
Stack trace:
	1: hysock_getaddrinfo_family (/export/cruise/trunk/cc/projects/classlib/trunk/modules/portlib/src/main/native/port/unix/hysock.c:1096)
	2: Java_java_net_InetAddress_getHostByNameImpl (../shared/inetadds.c:184)
	3: IP is 0x52FF608E <native code>
	4: java/net/InetAddress.lookupHostByName(Ljava/lang/String;)Ljava/net/InetAddress; (InetAddress.java:434)
	5: java/net/InetAddress.getByName(Ljava/lang/String;)Ljava/net/InetAddress; (InetAddress.java:273)
	6: java/net/InetSocketAddress.<init>(Ljava/lang/String;IZ)V (InetSocketAddress.java:66)
	7: java/net/InetSocketAddress.<init>(Ljava/lang/String;I)V (InetSocketAddress.java:51)
	8: org/apache/harmony/luni/internal/net/www/protocol/http/HttpURLConnection.getHTTPConnection(Ljava/net/Proxy;)Ljava/net/Socket;
(HttpURLConnection.java:635)
	9: org/apache/harmony/luni/internal/net/www/protocol/http/HttpURLConnection.connect()V (HttpURLConnection.java:619)
	10: org/apache/harmony/luni/internal/net/www/protocol/http/HttpURLConnection.getInputStream()Ljava/io/InputStream;
(HttpURLConnection.java:870)
	11: java/net/URL.openStream()Ljava/io/InputStream; (URL.java:664)
	12: org/apache/harmony/archive/tests/java/util/jar/JarFileTest.test_getJarEntryLjava_lang_String()V
(JarFileTest.java:151)
	13: vm_invoke_native_array_stub (/export/cruise/trunk/cc/projects/drlvm/trunk/vm/vmcore/src/util/ia32/base/invoke_native_stub_ia32.asm:41)
	14: JIT_execute_method_default(void*, _jmethodID*, jvalue*, jvalue*) (/export/cruise/trunk/cc/projects/drlvm/trunk/vm/vmcore/src/util/ia32/base/ini_iA32.cpp:199)
	15: DrlEMImpl::executeMethod(_jmethodID*, jvalue*, jvalue*) (/export/cruise/trunk/cc/projects/drlvm/trunk/vm/em/src/DrlEMImpl.cpp:539)
	16: ExecuteMethod (/export/cruise/trunk/cc/projects/drlvm/trunk/vm/em/src/em_intf.cpp:43)
	17: vm_execute_java_method_array(_jmethodID*, jvalue*, jvalue*) (/export/cruise/trunk/cc/projects/drlvm/trunk/vm/vmcore/src/jit/ini.cpp:51)
	18: call_method_no_ref_result (/export/cruise/trunk/cc/projects/drlvm/trunk/vm/vmcore/src/jni/jni_method.cpp:187)
	19: CallVoidMethodA(JNIEnv_External*, _jobject*, _jmethodID*, jvalue*) (/export/cruise/trunk/cc/projects/drlvm/trunk/vm/vmcore/src/jni/jni_method.cpp:225)
	20: invoke_primitive_method (/export/cruise/trunk/cc/projects/drlvm/trunk/vm/vmcore/src/kernel_classes/native/java_lang_reflect_VMReflection.cpp:186)
	21: Java_java_lang_reflect_VMReflection_invokeMethod (/export/cruise/trunk/cc/projects/drlvm/trunk/vm/vmcore/src/kernel_classes/native/java_lang_reflect_VMReflection.cpp:222)
	22: IP is 0x52E8D393 <native code>
	23: java/lang/reflect/Method.invoke(Ljava/lang/Object;[Ljava/lang/Object;)Ljava/lang/Object;
(Method.java:381)
	24: junit/framework/TestCase.runTest()V (TestCase.java:154)
	25: junit/framework/TestCase.runBare()V (TestCase.java:127)
	26: junit/framework/TestResult$1.protect()V (TestResult.java:106)
	27: junit/framework/TestResult.runProtected(Ljunit/framework/Test;Ljunit/framework/Protectable;)V
(TestResult.java:124)
	28: junit/framework/TestResult.run(Ljunit/framework/TestCase;)V (TestResult.java:109)
	29: junit/framework/TestCase.run(Ljunit/framework/TestResult;)V (TestCase.java:118)
	30: junit/framework/TestSuite.runTest(Ljunit/framework/Test;Ljunit/framework/TestResult;)V
(TestSuite.java:208)
	31: junit/framework/TestSuite.run(Ljunit/framework/TestResult;)V (TestSuite.java:203)
	32: org/apache/tools/ant/taskdefs/optional/junit/JUnitTestRunner.run()V (JUnitTestRunner.java:297)
	33: org/apache/tools/ant/taskdefs/optional/junit/JUnitTestRunner.launch(Lorg/apache/tools/ant/taskdefs/optional/junit/JUnitTest;ZZZZLjava/util/Properties;)I
(JUnitTestRunner.java:672)
	34: org/apache/tools/ant/taskdefs/optional/junit/JUnitTestRunner.main([Ljava/lang/String;)V
(JUnitTestRunner.java:546)
	35: vm_invoke_native_array_stub (/export/cruise/trunk/cc/projects/drlvm/trunk/vm/vmcore/src/util/ia32/base/invoke_native_stub_ia32.asm:41)
	36: JIT_execute_method_default(void*, _jmethodID*, jvalue*, jvalue*) (/export/cruise/trunk/cc/projects/drlvm/trunk/vm/vmcore/src/util/ia32/base/ini_iA32.cpp:199)
	37: DrlEMImpl::executeMethod(_jmethodID*, jvalue*, jvalue*) (/export/cruise/trunk/cc/projects/drlvm/trunk/vm/em/src/DrlEMImpl.cpp:539)
	38: ExecuteMethod (/export/cruise/trunk/cc/projects/drlvm/trunk/vm/em/src/em_intf.cpp:43)
	39: vm_execute_java_method_array(_jmethodID*, jvalue*, jvalue*) (/export/cruise/trunk/cc/projects/drlvm/trunk/vm/vmcore/src/jit/ini.cpp:51)
	40: call_static_method_no_ref_result (/export/cruise/trunk/cc/projects/drlvm/trunk/vm/vmcore/src/jni/jni_method.cpp:1154)
	41: CallStaticVoidMethodA(JNIEnv_External*, _jobject*, _jmethodID*, jvalue*) (/export/cruise/trunk/cc/projects/drlvm/trunk/vm/vmcore/src/jni/jni_method.cpp:1562)
	42: CallStaticVoidMethodV(JNIEnv_External*, _jobject*, _jmethodID*, char*) (/export/cruise/trunk/cc/projects/drlvm/trunk/vm/vmcore/src/jni/jni_method.cpp:1546)
	43: CallStaticVoidMethod(JNIEnv_External*, _jobject*, _jmethodID*, ...) (/export/cruise/trunk/cc/projects/drlvm/trunk/vm/vmcore/src/jni/jni_method.cpp:1536)
	44: ?? (??:-1)
	45: ?? (??:-1)
	46: ?? (??:-1)
	47: ?? (??:-1)
	48: __libc_start_main (??:-1)
	49: ?? (??:-1)
<end of stack trace>
Compiling AUTH classes
Compiling AUTH tests
Since fork is false, ignoring memoryMaximumSize setting
Compiling AWT classes
Compiling AWT tests
Since fork is false, ignoring memoryMaximumSize setting
java.lang.RuntimeException: expected from EDT
	at java.awt.EventDispatchThreadRTest$1.run(EventDispatchThreadRTest.java:29)
	at java.awt.event.InvocationEvent.runAndNotify(InvocationEvent.java:90)
	at java.awt.event.InvocationEvent.dispatch(InvocationEvent.java:77)
	at java.awt.EventQueueCore.dispatchEventImpl(EventQueueCore.java:140)
	at java.awt.EventQueue.dispatchEvent(EventQueue.java:144)
	at java.awt.EventDispatchThread.runModalLoop(EventDispatchThread.java:73)
	at java.awt.EventDispatchThread.run(EventDispatchThread.java:45)
Compiling BEANS classes
Compiling support classes for BEANS tests
Compiling internal BEANS tests
Compiling BEANS tests
Since fork is false, ignoring memoryMaximumSize setting
Running internal BEANS tests
Running BEANS tests
Compiling CRYPTO classes
Compiling CRYPTO test support files
Since fork is false, ignoring memoryMaximumSize setting
Compiling CRYPTO api tests
Since fork is false, ignoring memoryMaximumSize setting
Compiling CRYPTO api injected tests
Since fork is false, ignoring memoryMaximumSize setting
Compiling CRYPTO impl injected tests
Since fork is false, ignoring memoryMaximumSize setting
Compiling CRYPTO impl tests
Since fork is false, ignoring memoryMaximumSize setting
Running CRYPTO api tests
Running CRYPTO api.injected tests
Running CRYPTO impl tests
Running CRYPTO impl injected tests
Compiling ImageIO classes
Compiling ImageIO tests
Compiling INSTRUMENT classes
Compiling INSTRUMENT tests
Since fork is false, ignoring memoryMaximumSize setting
Compiling JNDI classes
Compiling JNDI tests
Since fork is false, ignoring memoryMaximumSize setting
Compiling LANG-MANAGEMENT classes
Compiling LANG-MANAGEMENT API tests
Compiling LANG-MANAGEMENT Implementation tests
Compiling LOGGING classes
Compiling LOGGING tests
Since fork is false, ignoring memoryMaximumSize setting
Compiling LUNI classes
Compiling LUNI JUnit Tests
Since fork is false, ignoring memoryMaximumSize setting
Running LUNI JUnit Tests
Compiling MATH classes
Compiling MATH tests
Since fork is false, ignoring memoryMaximumSize setting
Compiling MISC classes
Compiling MISC tests
Since fork is false, ignoring memoryMaximumSize setting
Compiling NIO classes
Compiling NIO tests
Since fork is false, ignoring memoryMaximumSize setting
Compiling NIO_CHAR classes
Compiling NIO_CHAR tests
Since fork is false, ignoring memoryMaximumSize setting
Cannot find unmappable byte array for US-ASCII
Cannot find unmappable byte array for gb18030
Cannot find unmappable byte array for ISO-8859-1
Cannot find malform byte array for ISO-8859-1
Cannot find unmappable byte array for UTF-16BE
Cannot find malform byte array for UTF-16BE
Cannot find unmappable byte array for UTF-16LE
Cannot find malform byte array for UTF-16LE
Cannot find unmappable byte array for UTF-8
Compiling PACK200 classes
Compiling PACK200 tests
Since fork is false, ignoring memoryMaximumSize setting
Running PACK200 tests
init: passed
hyerror: passed
hytime: passed
hyfile: passed
Compiling PREFS classes
Compiling PREFS tests
Since fork is false, ignoring memoryMaximumSize setting
Compiling PRINT classes
Compiling Print tests
Since fork is false, ignoring memoryMaximumSize setting
java.net.ConnectException: localhost/127.0.0.1:631 - Connection refused
	at org.apache.harmony.luni.net.PlainSocketImpl.connect(PlainSocketImpl.java:229)
	at org.apache.harmony.luni.net.PlainSocketImpl.connect(PlainSocketImpl.java:508)
	at java.net.Socket.connect(Socket.java:930)
	at org.apache.harmony.luni.internal.net.www.protocol.http.HttpURLConnection.getHTTPConnection(HttpURLConnection.java:636)
	at org.apache.harmony.luni.internal.net.www.protocol.http.HttpURLConnection.connect(HttpURLConnection.java:617)
	at org.apache.harmony.x.print.ipp.IppClient.request(IppClient.java:110)
	at org.apache.harmony.x.print.ipp.IppClient.request(IppClient.java:87)
	at org.apache.harmony.x.print.cups.CUPSPrintServiceProvider.findDefaultPrintService(CUPSPrintServiceProvider.java:471)
	at org.apache.harmony.x.print.cups.CUPSPrintServiceProvider.getDefaultPrintService(CUPSPrintServiceProvider.java:168)
	at javax.print.PrintServiceLookup.lookupDefaultPrintService(PrintServiceLookup.java:138)
	at javax.print.attribute.HashAttributeTest.testAdd2(HashAttributeTest.java)
	at java.lang.reflect.VMReflection.invokeMethod(VMReflection.java)
	at java.lang.reflect.Method.invoke(Method.java:381)
	at junit.framework.TestCase.runTest(TestCase.java:154)
	at junit.framework.TestCase.runBare(TestCase.java:125)
	at junit.framework.TestResult$1.protect(TestResult.java)
	at junit.framework.TestResult.runProtected(TestResult.java)
	at junit.framework.TestResult.run(TestResult.java:104)
	at junit.framework.TestCase.run(TestCase.java)
	at junit.framework.TestSuite.runTest(TestSuite.java)
	at junit.framework.TestSuite.run(TestSuite.java:202)
	at org.apache.tools.ant.taskdefs.optional.junit.JUnitTestRunner.run(JUnitTestRunner.java:294)
	at org.apache.tools.ant.taskdefs.optional.junit.JUnitTestRunner.launch(JUnitTestRunner.java:670)
	at org.apache.tools.ant.taskdefs.optional.junit.JUnitTestRunner.main(JUnitTestRunner.java:545)
java.net.ConnectException: localhost/127.0.0.1:631 - Connection refused
	at org.apache.harmony.luni.net.PlainSocketImpl.connect(PlainSocketImpl.java:229)
	at org.apache.harmony.luni.net.PlainSocketImpl.connect(PlainSocketImpl.java:508)
	at java.net.Socket.connect(Socket.java:930)
	at org.apache.harmony.luni.internal.net.www.protocol.http.HttpURLConnection.getHTTPConnection(HttpURLConnection.java:636)
	at org.apache.harmony.luni.internal.net.www.protocol.http.HttpURLConnection.connect(HttpURLConnection.java:617)
	at org.apache.harmony.x.print.ipp.IppClient.request(IppClient.java:110)
	at org.apache.harmony.x.print.ipp.IppClient.request(IppClient.java:87)
	at org.apache.harmony.x.print.cups.CUPSPrintServiceProvider.findDefaultPrintService(CUPSPrintServiceProvider.java:471)
	at org.apache.harmony.x.print.cups.CUPSPrintServiceProvider.getDefaultPrintService(CUPSPrintServiceProvider.java:168)
	at javax.print.PrintServiceLookup.lookupDefaultPrintService(PrintServiceLookup.java:138)
	at javax.print.attribute.HashAttributeTest.testEquals(HashAttributeTest.java:283)
	at java.lang.reflect.VMReflection.invokeMethod(VMReflection.java)
	at java.lang.reflect.Method.invoke(Method.java:381)
	at junit.framework.TestCase.runTest(TestCase.java:154)
	at junit.framework.TestCase.runBare(TestCase.java:125)
	at junit.framework.TestResult$1.protect(TestResult.java)
	at junit.framework.TestResult.runProtected(TestResult.java)
	at junit.framework.TestResult.run(TestResult.java:104)
	at junit.framework.TestCase.run(TestCase.java)
	at junit.framework.TestSuite.runTest(TestSuite.java)
	at junit.framework.TestSuite.run(TestSuite.java:202)
	at org.apache.tools.ant.taskdefs.optional.junit.JUnitTestRunner.run(JUnitTestRunner.java:294)
	at org.apache.tools.ant.taskdefs.optional.junit.JUnitTestRunner.launch(JUnitTestRunner.java:670)
	at org.apache.tools.ant.taskdefs.optional.junit.JUnitTestRunner.main(JUnitTestRunner.java:545)
java.net.ConnectException: localhost/127.0.0.1:631 - Connection refused
	at org.apache.harmony.luni.net.PlainSocketImpl.connect(PlainSocketImpl.java:229)
	at org.apache.harmony.luni.net.PlainSocketImpl.connect(PlainSocketImpl.java:508)
	at java.net.Socket.connect(Socket.java:930)
	at org.apache.harmony.luni.internal.net.www.protocol.http.HttpURLConnection.getHTTPConnection(HttpURLConnection.java:636)
	at org.apache.harmony.luni.internal.net.www.protocol.http.HttpURLConnection.connect(HttpURLConnection.java:617)
	at org.apache.harmony.x.print.ipp.IppClient.request(IppClient.java:110)
	at org.apache.harmony.x.print.ipp.IppClient.request(IppClient.java:87)
	at org.apache.harmony.x.print.cups.CUPSPrintServiceProvider.findDefaultPrintService(CUPSPrintServiceProvider.java:471)
	at org.apache.harmony.x.print.cups.CUPSPrintServiceProvider.getDefaultPrintService(CUPSPrintServiceProvider.java:168)
	at javax.print.PrintServiceLookup.lookupDefaultPrintService(PrintServiceLookup.java:138)
	at javax.print.attribute.HashAttributeTest.testAdd2(HashAttributeTest.java)
	at java.lang.reflect.VMReflection.invokeMethod(VMReflection.java)
	at java.lang.reflect.Method.invoke(Method.java:381)
	at junit.framework.TestCase.runTest(TestCase.java:154)
	at junit.framework.TestCase.runBare(TestCase.java:125)
	at junit.framework.TestResult$1.protect(TestResult.java)
	at junit.framework.TestResult.runProtected(TestResult.java)
	at junit.framework.TestResult.run(TestResult.java:104)
	at junit.framework.TestCase.run(TestCase.java)
	at junit.framework.TestSuite.runTest(TestSuite.java)
	at junit.framework.TestSuite.run(TestSuite.java:202)
	at junit.framework.TestSuite.runTest(TestSuite.java)
	at junit.framework.TestSuite.run(TestSuite.java:202)
	at org.apache.tools.ant.taskdefs.optional.junit.JUnitTestRunner.run(JUnitTestRunner.java:294)
	at org.apache.tools.ant.taskdefs.optional.junit.JUnitTestRunner.launch(JUnitTestRunner.java:670)
	at org.apache.tools.ant.taskdefs.optional.junit.JUnitTestRunner.main(JUnitTestRunner.java:545)
java.net.ConnectException: localhost/127.0.0.1:631 - Connection refused
	at org.apache.harmony.luni.net.PlainSocketImpl.connect(PlainSocketImpl.java:229)
	at org.apache.harmony.luni.net.PlainSocketImpl.connect(PlainSocketImpl.java:508)
	at java.net.Socket.connect(Socket.java:930)
	at org.apache.harmony.luni.internal.net.www.protocol.http.HttpURLConnection.getHTTPConnection(HttpURLConnection.java:636)
	at org.apache.harmony.luni.internal.net.www.protocol.http.HttpURLConnection.connect(HttpURLConnection.java:617)
	at org.apache.harmony.x.print.ipp.IppClient.request(IppClient.java:110)
	at org.apache.harmony.x.print.ipp.IppClient.request(IppClient.java:87)
	at org.apache.harmony.x.print.cups.CUPSPrintServiceProvider.findDefaultPrintService(CUPSPrintServiceProvider.java:471)
	at org.apache.harmony.x.print.cups.CUPSPrintServiceProvider.getDefaultPrintService(CUPSPrintServiceProvider.java:168)
	at javax.print.PrintServiceLookup.lookupDefaultPrintService(PrintServiceLookup.java:138)
	at javax.print.attribute.HashAttributeTest.testEquals(HashAttributeTest.java:283)
	at java.lang.reflect.VMReflection.invokeMethod(VMReflection.java)
	at java.lang.reflect.Method.invoke(Method.java:381)
	at junit.framework.TestCase.runTest(TestCase.java:154)
	at junit.framework.TestCase.runBare(TestCase.java:125)
	at junit.framework.TestResult$1.protect(TestResult.java)
	at junit.framework.TestResult.runProtected(TestResult.java)
	at junit.framework.TestResult.run(TestResult.java:104)
	at junit.framework.TestCase.run(TestCase.java)
	at junit.framework.TestSuite.runTest(TestSuite.java)
	at junit.framework.TestSuite.run(TestSuite.java:202)
	at junit.framework.TestSuite.runTest(TestSuite.java)
	at junit.framework.TestSuite.run(TestSuite.java:202)
	at org.apache.tools.ant.taskdefs.optional.junit.JUnitTestRunner.run(JUnitTestRunner.java:294)
	at org.apache.tools.ant.taskdefs.optional.junit.JUnitTestRunner.launch(JUnitTestRunner.java:670)
	at org.apache.tools.ant.taskdefs.optional.junit.JUnitTestRunner.main(JUnitTestRunner.java:545)
Compiling REGEX classes
Compiling REGEX tests
Since fork is false, ignoring memoryMaximumSize setting
Compiling RMI classes
Compiling RMI api tests
Since fork is false, ignoring memoryMaximumSize setting
Running RMI api tests
Unexporting MyRemoteObject1[UnicastServerRef[endpoint:[[10.125.122.35:35879]](local), ObjID[65536,
UID[42c16424:11121c36084:-7ff7]]]] ...
Done.
Unexporting MyRemoteObject1[UnicastServerRef[endpoint:[[10.125.122.35:35880]](local), ObjID[65537,
UID[42c16424:11121c36084:-7ff6]]]] ...
Done.
Unexporting MyRemoteObject1[UnicastServerRef[endpoint:[[10.125.122.35:35881]](local), ObjID[65538,
UID[42c16424:11121c36084:-7ff5]]]] ...
Done.
Unexporting MyRemoteObject1[UnicastServerRef[endpoint:[[10.125.122.35:35882]](local), ObjID[65539,
UID[42c16424:11121c36084:-7ff4]]]] ...
Done.
Unexporting MyRemoteObject1[UnicastServerRef[endpoint:[[10.125.122.35:35883]](local), ObjID[65540,
UID[42c16424:11121c36084:-7ff3]]]] ...
Done.
Unexporting MyRemoteObject1[UnicastServerRef[endpoint:[[10.125.122.35:35884]](local), ObjID[65541,
UID[42c16424:11121c36084:-7ff2]]]] ...
Done.
Unexporting MyRemoteObject1[UnicastServerRef[endpoint:[[10.125.122.35:35885]](local), ObjID[65542,
UID[42c16424:11121c36084:-7ff1]]]] ...
Done.
Unexporting MyRemoteObject1[UnicastServerRef[endpoint:[[10.125.122.35:35886]](local), ObjID[65543,
UID[42c16424:11121c36084:-7ff0]]]] ...
Done.
LogStream[tst]:
Compiling SECURITY classes
Compiling SECURITY test support files
Since fork is false, ignoring memoryMaximumSize setting
Compiling SECURITY api tests
Since fork is false, ignoring memoryMaximumSize setting
Compiling SECURITY api injected tests
Since fork is false, ignoring memoryMaximumSize setting
Compiling SECURITY impl injected tests
Since fork is false, ignoring memoryMaximumSize setting
Compiling SECURITY impl tests
Since fork is false, ignoring memoryMaximumSize setting
Running SECURITY api tests
SIGSEGV in VM code.
Stack trace:
	1: hysock_getaddrinfo_family (/export/cruise/trunk/cc/projects/classlib/trunk/modules/portlib/src/main/native/port/unix/hysock.c:1096)
	2: Java_java_net_InetAddress_getHostByNameImpl (../shared/inetadds.c:184)
	3: IP is 0x532272AE <native code>
	4: java/net/InetAddress.lookupHostByName(Ljava/lang/String;)Ljava/net/InetAddress; (InetAddress.java:434)
	5: java/net/InetAddress.getByName(Ljava/lang/String;)Ljava/net/InetAddress; (InetAddress.java:273)
	6: java/net/InetSocketAddress.<init>(Ljava/lang/String;IZ)V (InetSocketAddress.java:66)
	7: java/net/InetSocketAddress.<init>(Ljava/lang/String;I)V (InetSocketAddress.java:51)
	8: org/apache/harmony/luni/internal/net/www/protocol/http/HttpURLConnection.getHTTPConnection(Ljava/net/Proxy;)Ljava/net/Socket;
(HttpURLConnection.java:635)
	9: org/apache/harmony/luni/internal/net/www/protocol/http/HttpURLConnection.connect()V (HttpURLConnection.java:619)
	10: org/apache/harmony/luni/internal/net/www/protocol/http/HttpURLConnection.getInputStream()Ljava/io/InputStream;
(HttpURLConnection.java:870)
	11: java/net/URL.openStream()Ljava/io/InputStream; (URL.java:664)
	12: org/apache/harmony/security/tests/java/security/cert/CertificateFactory4Test.test_generateCertificatesLjava_io_InputStream()V
(CertificateFactory4Test.java:91)
	13: vm_invoke_native_array_stub (/export/cruise/trunk/cc/projects/drlvm/trunk/vm/vmcore/src/util/ia32/base/invoke_native_stub_ia32.asm:41)
	14: JIT_execute_method_default(void*, _jmethodID*, jvalue*, jvalue*) (/export/cruise/trunk/cc/projects/drlvm/trunk/vm/vmcore/src/util/ia32/base/ini_iA32.cpp:199)
	15: DrlEMImpl::executeMethod(_jmethodID*, jvalue*, jvalue*) (/export/cruise/trunk/cc/projects/drlvm/trunk/vm/em/src/DrlEMImpl.cpp:539)
	16: ExecuteMethod (/export/cruise/trunk/cc/projects/drlvm/trunk/vm/em/src/em_intf.cpp:43)
	17: vm_execute_java_method_array(_jmethodID*, jvalue*, jvalue*) (/export/cruise/trunk/cc/projects/drlvm/trunk/vm/vmcore/src/jit/ini.cpp:51)
	18: call_method_no_ref_result (/export/cruise/trunk/cc/projects/drlvm/trunk/vm/vmcore/src/jni/jni_method.cpp:187)
	19: CallVoidMethodA(JNIEnv_External*, _jobject*, _jmethodID*, jvalue*) (/export/cruise/trunk/cc/projects/drlvm/trunk/vm/vmcore/src/jni/jni_method.cpp:225)
	20: invoke_primitive_method (/export/cruise/trunk/cc/projects/drlvm/trunk/vm/vmcore/src/kernel_classes/native/java_lang_reflect_VMReflection.cpp:186)
	21: Java_java_lang_reflect_VMReflection_invokeMethod (/export/cruise/trunk/cc/projects/drlvm/trunk/vm/vmcore/src/kernel_classes/native/java_lang_reflect_VMReflection.cpp:222)
	22: IP is 0x52E8D753 <native code>
	23: java/lang/reflect/Method.invoke(Ljava/lang/Object;[Ljava/lang/Object;)Ljava/lang/Object;
(Method.java:381)
	24: junit/framework/TestCase.runTest()V (TestCase.java:154)
	25: junit/framework/TestCase.runBare()V (TestCase.java:127)
	26: junit/framework/TestResult$1.protect()V (TestResult.java:106)
	27: junit/framework/TestResult.runProtected(Ljunit/framework/Test;Ljunit/framework/Protectable;)V
(TestResult.java:124)
	28: junit/framework/TestResult.run(Ljunit/framework/TestCase;)V (TestResult.java:109)
	29: junit/framework/TestCase.run(Ljunit/framework/TestResult;)V (TestCase.java:118)
	30: junit/framework/TestSuite.runTest(Ljunit/framework/Test;Ljunit/framework/TestResult;)V
(TestSuite.java:208)
	31: junit/framework/TestSuite.run(Ljunit/framework/TestResult;)V (TestSuite.java:203)
	32: org/apache/tools/ant/taskdefs/optional/junit/JUnitTestRunner.run()V (JUnitTestRunner.java:297)
	33: org/apache/tools/ant/taskdefs/optional/junit/JUnitTestRunner.launch(Lorg/apache/tools/ant/taskdefs/optional/junit/JUnitTest;ZZZZLjava/util/Properties;)I
(JUnitTestRunner.java:672)
	34: org/apache/tools/ant/taskdefs/optional/junit/JUnitTestRunner.main([Ljava/lang/String;)V
(JUnitTestRunner.java:546)
	35: vm_invoke_native_array_stub (/export/cruise/trunk/cc/projects/drlvm/trunk/vm/vmcore/src/util/ia32/base/invoke_native_stub_ia32.asm:41)
	36: JIT_execute_method_default(void*, _jmethodID*, jvalue*, jvalue*) (/export/cruise/trunk/cc/projects/drlvm/trunk/vm/vmcore/src/util/ia32/base/ini_iA32.cpp:199)
	37: DrlEMImpl::executeMethod(_jmethodID*, jvalue*, jvalue*) (/export/cruise/trunk/cc/projects/drlvm/trunk/vm/em/src/DrlEMImpl.cpp:539)
	38: ExecuteMethod (/export/cruise/trunk/cc/projects/drlvm/trunk/vm/em/src/em_intf.cpp:43)
	39: vm_execute_java_method_array(_jmethodID*, jvalue*, jvalue*) (/export/cruise/trunk/cc/projects/drlvm/trunk/vm/vmcore/src/jit/ini.cpp:51)
	40: call_static_method_no_ref_result (/export/cruise/trunk/cc/projects/drlvm/trunk/vm/vmcore/src/jni/jni_method.cpp:1154)
	41: CallStaticVoidMethodA(JNIEnv_External*, _jobject*, _jmethodID*, jvalue*) (/export/cruise/trunk/cc/projects/drlvm/trunk/vm/vmcore/src/jni/jni_method.cpp:1562)
	42: CallStaticVoidMethodV(JNIEnv_External*, _jobject*, _jmethodID*, char*) (/export/cruise/trunk/cc/projects/drlvm/trunk/vm/vmcore/src/jni/jni_method.cpp:1546)
	43: CallStaticVoidMethod(JNIEnv_External*, _jobject*, _jmethodID*, ...) (/export/cruise/trunk/cc/projects/drlvm/trunk/vm/vmcore/src/jni/jni_method.cpp:1536)
	44: ?? (??:-1)
	45: ?? (??:-1)
	46: ?? (??:-1)
	47: ?? (??:-1)
	48: __libc_start_main (??:-1)
	49: ?? (??:-1)
<end of stack trace>
Running SECURITY api.injected tests
Running SECURITY impl tests
SIGSEGV in VM code.
Stack trace:
	1: hysock_getaddrinfo_family (/export/cruise/trunk/cc/projects/classlib/trunk/modules/portlib/src/main/native/port/unix/hysock.c:1096)
	2: Java_java_net_InetAddress_getHostByNameImpl (../shared/inetadds.c:184)
	3: IP is 0x52E9837E <native code>
	4: java/net/InetAddress.lookupHostByName(Ljava/lang/String;)Ljava/net/InetAddress; (InetAddress.java:434)
	5: java/net/InetAddress.getByName(Ljava/lang/String;)Ljava/net/InetAddress; (InetAddress.java:273)
	6: java/net/URLStreamHandler.getHostAddress(Ljava/net/URL;)Ljava/net/InetAddress; (URLStreamHandler.java:376)
	7: java/net/URLStreamHandler.hostsEqual(Ljava/net/URL;Ljava/net/URL;)Z (URLStreamHandler.java:404)
	8: java/net/URLStreamHandler.sameFile(Ljava/net/URL;Ljava/net/URL;)Z (URLStreamHandler.java:430)
	9: java/net/URLStreamHandler.equals(Ljava/net/URL;Ljava/net/URL;)Z (URLStreamHandler.java:348)
	10: java/net/URL.equals(Ljava/lang/Object;)Z (URL.java:528)
	11: java/security/CodeSource.implies(Ljava/security/CodeSource;)Z (CodeSource.java:336)
	12: org/apache/harmony/security/PolicyEntry.impliesCodeSource(Ljava/security/CodeSource;)Z
(PolicyEntry.java:71)
	13: org/apache/harmony/security/tests/PolicyEntryTest.testImpliesCodeSource()V (PolicyEntryTest.java:87)
	14: vm_invoke_native_array_stub (/export/cruise/trunk/cc/projects/drlvm/trunk/vm/vmcore/src/util/ia32/base/invoke_native_stub_ia32.asm:41)
	15: JIT_execute_method_default(void*, _jmethodID*, jvalue*, jvalue*) (/export/cruise/trunk/cc/projects/drlvm/trunk/vm/vmcore/src/util/ia32/base/ini_iA32.cpp:199)
	16: DrlEMImpl::executeMethod(_jmethodID*, jvalue*, jvalue*) (/export/cruise/trunk/cc/projects/drlvm/trunk/vm/em/src/DrlEMImpl.cpp:539)
	17: ExecuteMethod (/export/cruise/trunk/cc/projects/drlvm/trunk/vm/em/src/em_intf.cpp:43)
	18: vm_execute_java_method_array(_jmethodID*, jvalue*, jvalue*) (/export/cruise/trunk/cc/projects/drlvm/trunk/vm/vmcore/src/jit/ini.cpp:51)
	19: call_method_no_ref_result (/export/cruise/trunk/cc/projects/drlvm/trunk/vm/vmcore/src/jni/jni_method.cpp:187)
	20: CallVoidMethodA(JNIEnv_External*, _jobject*, _jmethodID*, jvalue*) (/export/cruise/trunk/cc/projects/drlvm/trunk/vm/vmcore/src/jni/jni_method.cpp:225)
	21: invoke_primitive_method (/export/cruise/trunk/cc/projects/drlvm/trunk/vm/vmcore/src/kernel_classes/native/java_lang_reflect_VMReflection.cpp:186)
	22: Java_java_lang_reflect_VMReflection_invokeMethod (/export/cruise/trunk/cc/projects/drlvm/trunk/vm/vmcore/src/kernel_classes/native/java_lang_reflect_VMReflection.cpp:222)
	23: IP is 0x52E8D393 <native code>
	24: java/lang/reflect/Method.invoke(Ljava/lang/Object;[Ljava/lang/Object;)Ljava/lang/Object;
(Method.java:381)
	25: junit/framework/TestCase.runTest()V (TestCase.java:154)
	26: junit/framework/TestCase.runBare()V (TestCase.java:127)
	27: junit/framework/TestResult$1.protect()V (TestResult.java:106)
	28: junit/framework/TestResult.runProtected(Ljunit/framework/Test;Ljunit/framework/Protectable;)V
(TestResult.java:124)
	29: junit/framework/TestResult.run(Ljunit/framework/TestCase;)V (TestResult.java:109)
	30: junit/framework/TestCase.run(Ljunit/framework/TestResult;)V (TestCase.java:118)
	31: junit/framework/TestSuite.runTest(Ljunit/framework/Test;Ljunit/framework/TestResult;)V
(TestSuite.java:208)
	32: junit/framework/TestSuite.run(Ljunit/framework/TestResult;)V (TestSuite.java:203)
	33: org/apache/tools/ant/taskdefs/optional/junit/JUnitTestRunner.run()V (JUnitTestRunner.java:297)
	34: org/apache/tools/ant/taskdefs/optional/junit/JUnitTestRunner.launch(Lorg/apache/tools/ant/taskdefs/optional/junit/JUnitTest;ZZZZLjava/util/Properties;)I
(JUnitTestRunner.java:672)
	35: org/apache/tools/ant/taskdefs/optional/junit/JUnitTestRunner.main([Ljava/lang/String;)V
(JUnitTestRunner.java:546)
	36: vm_invoke_native_array_stub (/export/cruise/trunk/cc/projects/drlvm/trunk/vm/vmcore/src/util/ia32/base/invoke_native_stub_ia32.asm:41)
	37: JIT_execute_method_default(void*, _jmethodID*, jvalue*, jvalue*) (/export/cruise/trunk/cc/projects/drlvm/trunk/vm/vmcore/src/util/ia32/base/ini_iA32.cpp:199)
	38: DrlEMImpl::executeMethod(_jmethodID*, jvalue*, jvalue*) (/export/cruise/trunk/cc/projects/drlvm/trunk/vm/em/src/DrlEMImpl.cpp:539)
	39: ExecuteMethod (/export/cruise/trunk/cc/projects/drlvm/trunk/vm/em/src/em_intf.cpp:43)
	40: vm_execute_java_method_array(_jmethodID*, jvalue*, jvalue*) (/export/cruise/trunk/cc/projects/drlvm/trunk/vm/vmcore/src/jit/ini.cpp:51)
	41: call_static_method_no_ref_result (/export/cruise/trunk/cc/projects/drlvm/trunk/vm/vmcore/src/jni/jni_method.cpp:1154)
	42: CallStaticVoidMethodA(JNIEnv_External*, _jobject*, _jmethodID*, jvalue*) (/export/cruise/trunk/cc/projects/drlvm/trunk/vm/vmcore/src/jni/jni_method.cpp:1562)
	43: CallStaticVoidMethodV(JNIEnv_External*, _jobject*, _jmethodID*, char*) (/export/cruise/trunk/cc/projects/drlvm/trunk/vm/vmcore/src/jni/jni_method.cpp:1546)
	44: CallStaticVoidMethod(JNIEnv_External*, _jobject*, _jmethodID*, ...) (/export/cruise/trunk/cc/projects/drlvm/trunk/vm/vmcore/src/jni/jni_method.cpp:1536)
	45: ?? (??:-1)
	46: ?? (??:-1)
	47: ?? (??:-1)
	48: ?? (??:-1)
	49: __libc_start_main (??:-1)
	50: ?? (??:-1)
<end of stack trace>
Running SECURITY impl injected tests
Compiling SOUND classes
Compiling SOUND tests
Since fork is false, ignoring memoryMaximumSize setting
Compiling SQL classes
Compiling SQL tests
Since fork is false, ignoring memoryMaximumSize setting
Compiling Sun Compat classes
Compiling SUNCOMPAT tests
Compiling TEXT classes
Compiling TEXT tests
Since fork is false, ignoring memoryMaximumSize setting
Compiling TOOLS classes
Compiling Tools tests
Since fork is false, ignoring memoryMaximumSize setting
Compiling X-NET classes
Compiling X-NET test support files
Since fork is false, ignoring memoryMaximumSize setting
Compiling X-NET api tests
Since fork is false, ignoring memoryMaximumSize setting
Compiling X-NET impl injected tests
Since fork is false, ignoring memoryMaximumSize setting
Compiling X-NET impl tests
Since fork is false, ignoring memoryMaximumSize setting
Running X-NET api tests
Running X-NET impl tests
Running X-NET impl injected tests
The test report is in /export/cruise/trunk/cc/projects/classlib/trunk/build/test_report/html/index.html

***********************************************************
Unit Tests: (14394)
        
error: org.apache.harmony.archive.tests.java.util.jar.JarFileTest vmcrash.CrashedTests
error: org.apache.harmony.security.tests.PolicyEntryTest vmcrash.CrashedTests
error: org.apache.harmony.security.tests.java.security.cert.CertificateFactory4Test vmcrash.CrashedTests
Unit Test Error Details:	(3)
                
Test: org.apache.harmony.archive.tests.java.util.jar.JarFileTestClass: vmcrash.CrashedTests
Test: org.apache.harmony.security.tests.PolicyEntryTestClass: vmcrash.CrashedTests
Test: org.apache.harmony.security.tests.java.security.cert.CertificateFactory4TestClass: vmcrash.CrashedTests

***********************************************************
Modifications since last successful build:	(27)
            
modified liangyx  /harmony/enhanced/classlib/trunk/modules/luni/src/main/java/java/io/InputStreamReader.java
03/05/2007 16:09:02 Apply patch for HARMONY-3238([classlib][luni] InputStreamReader allocates
fixed space internal buffer)
modified liangyx  /harmony/enhanced/classlib/trunk/modules/luni/make/exclude.common 03/05/2007
16:09:02 Apply patch for HARMONY-3238([classlib][luni] InputStreamReader allocates fixed space
internal buffer)
modified liangyx  /harmony/enhanced/classlib/trunk/support/src/test/java/tests/support/Support_Exec.java
03/05/2007 15:44:39 Fix HARMONY-1671 according to Anton's comments
modified liangyx  /harmony/enhanced/classlib/trunk/modules/jndi/src/test/java/org/apache/harmony/jndi/tests/javax/naming/ldap/whitebox/TestRdnWhiteBoxDevelopment.java
03/05/2007 15:35:01 Change the file encoding from iso8859-1 to ascii
deleted liangyx  /harmony/enhanced/classlib/trunk/modules/luni/src/test/java/org/apache/harmony/tests
03/05/2007 15:24:29 Remove package org.apache.harmony.tests
added liangyx  /harmony/enhanced/classlib/trunk/modules/luni/src/test/java/org/apache/harmony/luni/tests/internal
03/05/2007 15:17:42 refactor tests in org.apache.harmony.tests into org.apache.harmony.luni.tests
modified liangyx  /harmony/enhanced/classlib/trunk/modules/luni/src/test/java/org/apache/harmony/luni/tests/internal/net/www/protocol/https/HttpsURLConnectionTest.java
03/05/2007 15:17:42 refactor tests in org.apache.harmony.tests into org.apache.harmony.luni.tests
deleted liangyx  /harmony/enhanced/classlib/trunk/modules/luni/src/test/java/org/apache/harmony/tests/internal/net/www/protocol/https
03/05/2007 15:17:42 refactor tests in org.apache.harmony.tests into org.apache.harmony.luni.tests
added liangyx  /harmony/enhanced/classlib/trunk/modules/luni/src/test/java/org/apache/harmony/luni/tests/internal/net/www
03/05/2007 15:17:42 refactor tests in org.apache.harmony.tests into org.apache.harmony.luni.tests
added liangyx  /harmony/enhanced/classlib/trunk/modules/luni/src/test/java/org/apache/harmony/luni/tests/java/net/URITest.java
03/05/2007 15:17:42 refactor tests in org.apache.harmony.tests into org.apache.harmony.luni.tests
added liangyx  /harmony/enhanced/classlib/trunk/modules/luni/src/test/java/org/apache/harmony/luni/tests/internal/net/www/protocol
03/05/2007 15:17:42 refactor tests in org.apache.harmony.tests into org.apache.harmony.luni.tests
added liangyx  /harmony/enhanced/classlib/trunk/modules/luni/src/test/java/org/apache/harmony/luni/tests/internal/net/www/protocol/https
03/05/2007 15:17:42 refactor tests in org.apache.harmony.tests into org.apache.harmony.luni.tests
added liangyx  /harmony/enhanced/classlib/trunk/modules/luni/src/test/java/org/apache/harmony/luni/tests/java/net/URLEncoderTest.java
03/05/2007 15:17:42 refactor tests in org.apache.harmony.tests into org.apache.harmony.luni.tests
added liangyx  /harmony/enhanced/classlib/trunk/modules/luni/src/test/java/org/apache/harmony/luni/tests/java/net/URLTest.java
03/05/2007 15:17:42 refactor tests in org.apache.harmony.tests into org.apache.harmony.luni.tests
modified liangyx  /harmony/enhanced/classlib/trunk/modules/luni/src/test/java/org/apache/harmony/luni/tests/java/net/InetAddressTest.java
03/05/2007 15:17:42 refactor tests in org.apache.harmony.tests into org.apache.harmony.luni.tests
deleted liangyx  /harmony/enhanced/classlib/trunk/modules/luni/src/test/java/org/apache/harmony/tests/internal/net/www/protocol/http
03/05/2007 15:17:42 refactor tests in org.apache.harmony.tests into org.apache.harmony.luni.tests
deleted liangyx  /harmony/enhanced/classlib/trunk/modules/luni/src/test/java/org/apache/harmony/tests/java/net
03/05/2007 15:17:42 refactor tests in org.apache.harmony.tests into org.apache.harmony.luni.tests
added liangyx  /harmony/enhanced/classlib/trunk/modules/luni/src/test/java/org/apache/harmony/luni/tests/internal/net
03/05/2007 15:17:42 refactor tests in org.apache.harmony.tests into org.apache.harmony.luni.tests
modified liangyx  /harmony/enhanced/classlib/trunk/modules/luni/src/test/java/org/apache/harmony/luni/tests/java/net/test_protocol/Handler.java
03/05/2007 15:17:42 refactor tests in org.apache.harmony.tests into org.apache.harmony.luni.tests
added liangyx  /harmony/enhanced/classlib/trunk/modules/luni/src/test/java/org/apache/harmony/luni/tests/internal/net/www/protocol/http
03/05/2007 15:17:42 refactor tests in org.apache.harmony.tests into org.apache.harmony.luni.tests
added liangyx  /harmony/enhanced/classlib/trunk/modules/luni/src/test/java/org/apache/harmony/luni/tests/java/net/test_protocol
03/05/2007 15:17:42 refactor tests in org.apache.harmony.tests into org.apache.harmony.luni.tests
modified liangyx  /harmony/enhanced/classlib/trunk/modules/luni/src/test/java/org/apache/harmony/luni/tests/internal/net/www/protocol/http/HttpURLConnectionTest.java
03/05/2007 15:17:42 refactor tests in org.apache.harmony.tests into org.apache.harmony.luni.tests
added liangyx  /harmony/enhanced/classlib/trunk/modules/luni/src/test/java/org/apache/harmony/luni/tests/java/net/URLConnectionTest.java
03/05/2007 15:17:42 refactor tests in org.apache.harmony.tests into org.apache.harmony.luni.tests
add cc-drlvm log20070305145133Lbuild.194 03/05/2007 14:51:33drlvm
add cc-classlib log20070305144720Lbuild.151 03/05/2007 14:47:20classlib
added liangyx  /harmony/enhanced/classlib/trunk/modules/luni/src/test/java/org/apache/harmony/luni/tests/java/net/ContentHandlerTest.java
03/05/2007 14:15:07 We should check whether the content object is one of the types specified,
not content.getClass()
modified liangyx  /harmony/enhanced/classlib/trunk/modules/luni/src/main/java/java/net/ContentHandler.java
03/05/2007 14:15:07 We should check whether the content object is one of the types specified,
not content.getClass()

Mime
View raw message