harmony-alerts mailing list archives

Site index · List index
Message view « Date » · « Thread »
Top « Date » · « Thread »
From ge...@apache.org
Subject [build-test alert] BUILD FAILED lnx gcc debug: classlib over drlvm
Date Mon, 05 Mar 2007 13:07:36 GMT
BUILD FAILED:
	Ant Error Message:
/home/geir/dev/apache/harmony/enhanced/buildtest/trunk/cc/projects/classlib/trunk/build.xml:167:
The following error occurred while executing this line: /home/geir/dev/apache/harmony/enhanced/buildtest/trunk/cc/projects/classlib/trunk/make/build-test.xml:289:
Could not create task or type of type: replaceregexp.  Ant could not find the task or a class
this task relies upon.  This is common and has a number of causes; the usual  solutions are
to read the manual pages then download and install needed JAR files, or fix the build file:
  - You have misspelt 'replaceregexp'.    Fix: check your spelling.  - The task needs an external
JAR file to execute      and this is not found at the right place in the classpath.    Fix:
check the documentation for dependencies.    Fix: declare the task.  - The task is an Ant
optional task and the JAR file and/or libraries      implementing the functionality were not
found at the time you      yourself built your installation of Ant from the Ant
 sources.    Fix: Look in the ANT_HOME/lib for the 'ant-' JAR corresponding to the      task
and make sure it contains more than merely a META-INF/MANIFEST.MF.      If all it contains
is the manifest, then rebuild Ant with the needed      libraries present in /home/geir/dev/apache/harmony/enhanced/buildtest/trunk/cc/lib/optional/
, or alternatively,      download a pre-built release version from apache.org  - The build
file was written for a later version of Ant    Fix: upgrade to at least the latest release
version of Ant  - The task is not an Ant core or optional task       and needs to be declared
using <taskdef>.  - You are attempting to use a task defined using      <presetdef>
or <macrodef> but have spelt wrong or not     defined it at the point of use  Remember
that for JAR files to be visible to Ant tasks implemented in ANT_HOME/lib, the files must
be in the same directory or on the classpath  Please neither file bug reports on this problem,
nor email the Ant mailing 
 lists,
 until all of these causes have been explored, as this is not an Ant bug.

Date of build:	03/05/2007 06:17:18
Time to build:	109 minutes 47 seconds
Last changed:	03/05/2007 06:14:42
Last log entry:	Excluded H3228 until the issue finally fixed.

***********************************************************
Errors/Warnings:	(229)
            
Tests FAILED (timeout)
Tests FAILED (timeout)
Tests FAILED (timeout)
Tests FAILED (timeout)
Tests FAILED (timeout)

========================================
Testing class libraries...
========================================
Checking for depends/jars/yoko_M2-20070130/yoko.jar
Checking for depends/jars/yoko_M2-20070130/yoko-core.jar
Checking for depends/jars/yoko_M2-20070130/yoko-rmi-impl.jar
Checking for depends/jars/yoko_M2-20070130/yoko-rmi-spec.jar
Checking for depends/jars/bcel-5.2/bcel-5.2.jar
Checking for depends/jars/xalan-j_2.7.0/xalan.jar
Checking for depends/jars/xerces_2.8.0/resolver.jar
Checking for depends/jars/xerces_2.8.0/xercesImpl.jar
Checking for depends/jars/xerces_2.8.0/xml-apis.jar
Checking for depends/jars/junit_3.8.2/junit.jar
Checking for depends/jars/bcprov-jdk15-134/bcprov.jar
Checking for depends/jars/icu4j_3.4.4/icu4j_3_4_4.jar
Checking for depends/jars/mx4j_3.0.2/mx4j.zip
Checking for depends/jars/ecj_3.2/ecj_3.2.jar
Checking for depends/jars/jetty/jetty-6.0.0.jar
Checking for depends/jars/jetty/jetty-util-6.0.0.jar
Checking for depends/jars/jetty/servlet-api-2.5-6.0.0.jar
Checking for depends/libs/build/lcms/icc34.h
Checking for depends/libs/build/lcms/lcms.h
Checking for depends/libs/build/png/pngconf.h
Checking for depends/libs/build/png/png.h
Checking for depends/libs/build/jpeg/jconfig.lnx
Checking for depends/libs/build/jpeg/jpeglib.h
Checking for depends/libs/build/jpeg/jmorecfg.h
Checking for depends/libs/build/jpeg/jerror.h
Checking for depends/libs/build/lcms/liblcms.linux.x86
Checking for depends/libs/build/png/libpng.linux.x86
Checking for depends/libs/build/jpeg/libjpeg.linux.x86
Since fork is false, ignoring memoryMaximumSize setting
Compiling ACCESSIBILITY classes
Compiling ACCESSIBILITY tests
Since fork is false, ignoring memoryMaximumSize setting
Compiling ANNOTATION classes
Compiling ANNOTATION tests
Since fork is false, ignoring memoryMaximumSize setting
Compiling APPLET classes
Compiling APPLET tests
Since fork is false, ignoring memoryMaximumSize setting
Compiling ARCHIVE classes
Compiling ARCHIVE tests
Since fork is false, ignoring memoryMaximumSize setting
*** glibc detected *** double free or corruption (out): 0x080d6db8 ***
SIGABRT in VM code.
Stack trace:
Compiling AUTH classes
Compiling AUTH tests
Since fork is false, ignoring memoryMaximumSize setting
Compiling AWT classes
Compiling AWT tests
Since fork is false, ignoring memoryMaximumSize setting
java.lang.RuntimeException: expected from EDT
	at java.awt.EventDispatchThreadRTest$1.run(EventDispatchThreadRTest.java:29)
	at java.awt.event.InvocationEvent.runAndNotify(InvocationEvent.java:90)
	at java.awt.event.InvocationEvent.dispatch(InvocationEvent.java:77)
	at java.awt.EventQueueCore.dispatchEventImpl(EventQueueCore.java:140)
	at java.awt.EventQueue.dispatchEvent(EventQueue.java:144)
	at java.awt.EventDispatchThread.runModalLoop(EventDispatchThread.java:73)
	at java.awt.EventDispatchThread.run(EventDispatchThread.java:45)
Compiling BEANS classes
Compiling support classes for BEANS tests
Compiling internal BEANS tests
Compiling BEANS tests
Since fork is false, ignoring memoryMaximumSize setting
Running internal BEANS tests
Running BEANS tests
Compiling CRYPTO classes
Compiling CRYPTO test support files
Since fork is false, ignoring memoryMaximumSize setting
Compiling CRYPTO api tests
Since fork is false, ignoring memoryMaximumSize setting
Compiling CRYPTO api injected tests
Since fork is false, ignoring memoryMaximumSize setting
Compiling CRYPTO impl injected tests
Since fork is false, ignoring memoryMaximumSize setting
Compiling CRYPTO impl tests
Since fork is false, ignoring memoryMaximumSize setting
Running CRYPTO api tests
Running CRYPTO api.injected tests
Running CRYPTO impl tests
Running CRYPTO impl injected tests
Compiling ImageIO classes
Compiling ImageIO tests
Compiling INSTRUMENT classes
Compiling INSTRUMENT tests
Since fork is false, ignoring memoryMaximumSize setting
Compiling JNDI classes
Compiling JNDI tests
Since fork is false, ignoring memoryMaximumSize setting
Compiling LANG-MANAGEMENT classes
Compiling LANG-MANAGEMENT API tests
Compiling LANG-MANAGEMENT Implementation tests
Compiling LOGGING classes
Compiling LOGGING tests
Since fork is false, ignoring memoryMaximumSize setting
*** glibc detected *** double free or corruption (out): 0x080d6fb0 ***
SIGABRT in VM code.
Stack trace:
Compiling LUNI classes
Compiling LUNI JUnit Tests
Since fork is false, ignoring memoryMaximumSize setting
Running LUNI JUnit Tests
*** glibc detected *** double free or corruption (out): 0x080d7050 ***
SIGABRT in VM code.
Stack trace:
Compiling MATH classes
Compiling MATH tests
Since fork is false, ignoring memoryMaximumSize setting
Compiling MISC classes
Compiling MISC tests
Since fork is false, ignoring memoryMaximumSize setting
Compiling NIO classes
Compiling NIO tests
Since fork is false, ignoring memoryMaximumSize setting
*** glibc detected *** double free or corruption (out): 0x080d6db0 ***
SIGABRT in VM code.
Stack trace:
Compiling NIO_CHAR classes
Compiling NIO_CHAR tests
Since fork is false, ignoring memoryMaximumSize setting
Cannot find unmappable byte array for US-ASCII
Cannot find unmappable byte array for gb18030
Cannot find unmappable byte array for ISO-8859-1
Cannot find malform byte array for ISO-8859-1
Cannot find unmappable byte array for UTF-16BE
Cannot find malform byte array for UTF-16BE
Cannot find unmappable byte array for UTF-16LE
Cannot find malform byte array for UTF-16LE
Cannot find unmappable byte array for UTF-8
Compiling PACK200 classes
Compiling PACK200 tests
Since fork is false, ignoring memoryMaximumSize setting
Running PACK200 tests
init: passed
hyerror: passed
hytime: passed
hyfile: passed
Compiling PREFS classes
Compiling PREFS tests
Since fork is false, ignoring memoryMaximumSize setting
Compiling PRINT classes
Compiling Print tests
Since fork is false, ignoring memoryMaximumSize setting
Compiling REGEX classes
Compiling REGEX tests
Since fork is false, ignoring memoryMaximumSize setting
Compiling RMI classes
Compiling RMI api tests
Since fork is false, ignoring memoryMaximumSize setting
Running RMI api tests
Unexporting MyRemoteObject1[UnicastServerRef[endpoint:[[127.0.0.1:59794]](local), ObjID[65536,
UID[-59e36ab0:11122130548:-7ff7]]]] ...
Done.
Unexporting MyRemoteObject1[UnicastServerRef[endpoint:[[127.0.0.1:53943]](local), ObjID[65537,
UID[-59e36ab0:11122130548:-7ff6]]]] ...
Done.
Unexporting MyRemoteObject1[UnicastServerRef[endpoint:[[127.0.0.1:43131]](local), ObjID[65538,
UID[-59e36ab0:11122130548:-7ff5]]]] ...
Done.
Unexporting MyRemoteObject1[UnicastServerRef[endpoint:[[127.0.0.1:56892]](local), ObjID[65539,
UID[-59e36ab0:11122130548:-7ff4]]]] ...
Done.
Unexporting MyRemoteObject1[UnicastServerRef[endpoint:[[127.0.0.1:55103]](local), ObjID[65540,
UID[-59e36ab0:11122130548:-7ff3]]]] ...
Done.
Unexporting MyRemoteObject1[UnicastServerRef[endpoint:[[127.0.0.1:33310]](local), ObjID[65541,
UID[-59e36ab0:11122130548:-7ff2]]]] ...
Done.
Unexporting MyRemoteObject1[UnicastServerRef[endpoint:[[127.0.0.1:42696]](local), ObjID[65542,
UID[-59e36ab0:11122130548:-7ff1]]]] ...
Done.
Unexporting MyRemoteObject1[UnicastServerRef[endpoint:[[127.0.0.1:38743]](local), ObjID[65543,
UID[-59e36ab0:11122130548:-7ff0]]]] ...
Done.
Uncaught exception in Scavenger:
java.lang.NullPointerException
	at java.util.Hashtable.remove(Hashtable.java)
	at org.apache.harmony.rmi.server.RMIObjectTable.removeByRef(RMIObjectTable.java:167)
	at org.apache.harmony.rmi.server.ExportManager$Scavenger.run(ExportManager.java:303)
	at java.lang.Thread.run(Thread.java:660)
LogStream[tst]:
Compiling SECURITY classes
Compiling SECURITY test support files
Since fork is false, ignoring memoryMaximumSize setting
Compiling SECURITY api tests
Since fork is false, ignoring memoryMaximumSize setting
Compiling SECURITY api injected tests
Since fork is false, ignoring memoryMaximumSize setting
Compiling SECURITY impl injected tests
Since fork is false, ignoring memoryMaximumSize setting
Compiling SECURITY impl tests
Since fork is false, ignoring memoryMaximumSize setting
Running SECURITY api tests
*** glibc detected *** double free or corruption (out): 0x080d6fc0 ***
SIGABRT in VM code.
Stack trace:
Running SECURITY api.injected tests
Running SECURITY impl tests
*** glibc detected *** double free or corruption (out): 0x080d6fc0 ***
SIGABRT in VM code.
Stack trace:
Running SECURITY impl injected tests
Compiling SOUND classes
Compiling SOUND tests
Since fork is false, ignoring memoryMaximumSize setting
Compiling SQL classes
Compiling SQL tests
Since fork is false, ignoring memoryMaximumSize setting
Compiling Sun Compat classes
Compiling SUNCOMPAT tests
Compiling SWING classes
Compiling SWING tests
Since fork is false, ignoring memoryMaximumSize setting
Compiling TEXT classes
Compiling TEXT tests
Since fork is false, ignoring memoryMaximumSize setting
Compiling TOOLS classes
Compiling Tools tests
Since fork is false, ignoring memoryMaximumSize setting
Compiling X-NET classes
Compiling X-NET test support files
Since fork is false, ignoring memoryMaximumSize setting
Compiling X-NET api tests
Since fork is false, ignoring memoryMaximumSize setting
Compiling X-NET impl injected tests
Since fork is false, ignoring memoryMaximumSize setting
Compiling X-NET impl tests
Since fork is false, ignoring memoryMaximumSize setting
Running X-NET api tests
Running X-NET impl tests
Running X-NET impl injected tests

***********************************************************
Unit Tests: (15636)
        
All Tests Passed

***********************************************************
Modifications since last successful build:	(26)
            
modified varlax  /harmony/enhanced/drlvm/trunk/src/test/regression/excludes/exclude.linux.x86_64
03/05/2007 06:14:42 Excluded H3228 until the issue finally fixed.
add cc-drlvm log20070305060721Lbuild.138 03/05/2007 06:07:21drlvm
modified liangyx  /harmony/enhanced/classlib/trunk/modules/luni/src/main/java/java/io/InputStreamReader.java
03/05/2007 05:09:02 Apply patch for HARMONY-3238([classlib][luni] InputStreamReader allocates
fixed space internal buffer)
modified liangyx  /harmony/enhanced/classlib/trunk/modules/luni/make/exclude.common 03/05/2007
05:09:02 Apply patch for HARMONY-3238([classlib][luni] InputStreamReader allocates fixed space
internal buffer)
modified liangyx  /harmony/enhanced/classlib/trunk/support/src/test/java/tests/support/Support_Exec.java
03/05/2007 04:44:39 Fix HARMONY-1671 according to Anton's comments
modified liangyx  /harmony/enhanced/classlib/trunk/modules/jndi/src/test/java/org/apache/harmony/jndi/tests/javax/naming/ldap/whitebox/TestRdnWhiteBoxDevelopment.java
03/05/2007 04:35:01 Change the file encoding from iso8859-1 to ascii
deleted liangyx  /harmony/enhanced/classlib/trunk/modules/luni/src/test/java/org/apache/harmony/tests
03/05/2007 04:24:29 Remove package org.apache.harmony.tests
added liangyx  /harmony/enhanced/classlib/trunk/modules/luni/src/test/java/org/apache/harmony/luni/tests/internal
03/05/2007 04:17:42 refactor tests in org.apache.harmony.tests into org.apache.harmony.luni.tests
modified liangyx  /harmony/enhanced/classlib/trunk/modules/luni/src/test/java/org/apache/harmony/luni/tests/internal/net/www/protocol/https/HttpsURLConnectionTest.java
03/05/2007 04:17:42 refactor tests in org.apache.harmony.tests into org.apache.harmony.luni.tests
deleted liangyx  /harmony/enhanced/classlib/trunk/modules/luni/src/test/java/org/apache/harmony/tests/internal/net/www/protocol/https
03/05/2007 04:17:42 refactor tests in org.apache.harmony.tests into org.apache.harmony.luni.tests
added liangyx  /harmony/enhanced/classlib/trunk/modules/luni/src/test/java/org/apache/harmony/luni/tests/internal/net/www
03/05/2007 04:17:42 refactor tests in org.apache.harmony.tests into org.apache.harmony.luni.tests
added liangyx  /harmony/enhanced/classlib/trunk/modules/luni/src/test/java/org/apache/harmony/luni/tests/java/net/URITest.java
03/05/2007 04:17:42 refactor tests in org.apache.harmony.tests into org.apache.harmony.luni.tests
added liangyx  /harmony/enhanced/classlib/trunk/modules/luni/src/test/java/org/apache/harmony/luni/tests/internal/net/www/protocol
03/05/2007 04:17:42 refactor tests in org.apache.harmony.tests into org.apache.harmony.luni.tests
added liangyx  /harmony/enhanced/classlib/trunk/modules/luni/src/test/java/org/apache/harmony/luni/tests/internal/net/www/protocol/https
03/05/2007 04:17:42 refactor tests in org.apache.harmony.tests into org.apache.harmony.luni.tests
added liangyx  /harmony/enhanced/classlib/trunk/modules/luni/src/test/java/org/apache/harmony/luni/tests/java/net/URLEncoderTest.java
03/05/2007 04:17:42 refactor tests in org.apache.harmony.tests into org.apache.harmony.luni.tests
added liangyx  /harmony/enhanced/classlib/trunk/modules/luni/src/test/java/org/apache/harmony/luni/tests/java/net/URLTest.java
03/05/2007 04:17:42 refactor tests in org.apache.harmony.tests into org.apache.harmony.luni.tests
modified liangyx  /harmony/enhanced/classlib/trunk/modules/luni/src/test/java/org/apache/harmony/luni/tests/java/net/InetAddressTest.java
03/05/2007 04:17:42 refactor tests in org.apache.harmony.tests into org.apache.harmony.luni.tests
deleted liangyx  /harmony/enhanced/classlib/trunk/modules/luni/src/test/java/org/apache/harmony/tests/internal/net/www/protocol/http
03/05/2007 04:17:42 refactor tests in org.apache.harmony.tests into org.apache.harmony.luni.tests
deleted liangyx  /harmony/enhanced/classlib/trunk/modules/luni/src/test/java/org/apache/harmony/tests/java/net
03/05/2007 04:17:42 refactor tests in org.apache.harmony.tests into org.apache.harmony.luni.tests
added liangyx  /harmony/enhanced/classlib/trunk/modules/luni/src/test/java/org/apache/harmony/luni/tests/internal/net
03/05/2007 04:17:42 refactor tests in org.apache.harmony.tests into org.apache.harmony.luni.tests
modified liangyx  /harmony/enhanced/classlib/trunk/modules/luni/src/test/java/org/apache/harmony/luni/tests/java/net/test_protocol/Handler.java
03/05/2007 04:17:42 refactor tests in org.apache.harmony.tests into org.apache.harmony.luni.tests
added liangyx  /harmony/enhanced/classlib/trunk/modules/luni/src/test/java/org/apache/harmony/luni/tests/internal/net/www/protocol/http
03/05/2007 04:17:42 refactor tests in org.apache.harmony.tests into org.apache.harmony.luni.tests
added liangyx  /harmony/enhanced/classlib/trunk/modules/luni/src/test/java/org/apache/harmony/luni/tests/java/net/test_protocol
03/05/2007 04:17:42 refactor tests in org.apache.harmony.tests into org.apache.harmony.luni.tests
modified liangyx  /harmony/enhanced/classlib/trunk/modules/luni/src/test/java/org/apache/harmony/luni/tests/internal/net/www/protocol/http/HttpURLConnectionTest.java
03/05/2007 04:17:42 refactor tests in org.apache.harmony.tests into org.apache.harmony.luni.tests
added liangyx  /harmony/enhanced/classlib/trunk/modules/luni/src/test/java/org/apache/harmony/luni/tests/java/net/URLConnectionTest.java
03/05/2007 04:17:42 refactor tests in org.apache.harmony.tests into org.apache.harmony.luni.tests
add cc-classlib log20070305040914Lbuild.90 03/05/2007 04:09:14classlib


Mime
View raw message