harmony-alerts mailing list archives: February 2007

Site index · List index
Message list« Previous · 1 · 2 · 3 · 4Thread · Author · Date
nom...@intel.com [build-test alert] BUILD FAILED Linux SUSE 9 64bit gcc debug: classlib over drlvm Tue, 27 Feb, 14:51
nom...@intel.com [build-test alert] BUILD FAILED Linux SUSE 9 gcc debug: classlib over drlvm Tue, 27 Feb, 15:15
ge...@apache.org [build-test alert] BUILD SUCCEEDED lnx gcc debug: drlvm Tue, 27 Feb, 15:49
ge...@apache.org [build-test alert] BUILD FAILED lnx gcc debug: classlib over drlvm Tue, 27 Feb, 15:52
nom...@intel.com [build-test alert] BUILD FIXED SUSEL9 IA32 gcc debug: classlib tests iterative Tue, 27 Feb, 19:16
ge...@apache.org [build-test alert] BUILD SUCCEEDED lnx gcc debug: drlvm Tue, 27 Feb, 22:41
nom...@intel.com [build-test alert] BUILD FAILED Windows XP msvc debug: classlib EHWA Wed, 28 Feb, 04:01
nom...@intel.com [build-test alert] BUILD SUCCEEDED Windows XP msvc debug: classlib EHWA Wed, 28 Feb, 04:11
ge...@apache.org [build-test alert] BUILD SUCCEEDED lnx gcc debug: classlib over drlvm Wed, 28 Feb, 04:13
nom...@intel.com [build-test alert] BUILD SUCCEEDED Linux SUSE 9 64bit gcc debug: classlib over drlvm Wed, 28 Feb, 05:03
nom...@intel.com [build-test alert] BUILD SUCCEEDED Linux SUSE 9 gcc debug: classlib over drlvm Wed, 28 Feb, 05:51
nom...@intel.com [build-test alert] BUILD SUCCEEDED Windows XP SP2 msvc debug: classlib over drlvm Wed, 28 Feb, 07:07
nom...@intel.com [build-test alert] BUILD FAILED SUSEL9 64bit gcc debug: classlib tests iterative Wed, 28 Feb, 11:16
nom...@intel.com [build-test alert] BUILD FIXED WIN XP msvc debug: classlib tests iterative Wed, 28 Feb, 12:57
ge...@apache.org [build-test alert] BUILD FAILED lnx gcc debug: drlvm Wed, 28 Feb, 14:40
nom...@intel.com [build-test alert] BUILD FAILED Linux SUSE9 64bit gcc debug: classlib Wed, 28 Feb, 16:25
nom...@intel.com [build-test alert] BUILD FAILED Linux SUSE9 64bit gcc debug: drlvm Wed, 28 Feb, 16:32
nom...@intel.com [build-test alert] BUILD FAILED Windows XP ia32 msvc debug: classlib Wed, 28 Feb, 16:34
nom...@intel.com [build-test alert] BUILD FAILED Linux SUSE 9 64bit gcc debug: drlvm reg.test Wed, 28 Feb, 16:36
nom...@intel.com [build-test alert] BUILD FAILED Linux SUSE 9 64bit gcc debug: drlvm tests Wed, 28 Feb, 16:37
nom...@intel.com [build-test alert] BUILD FAILED Linux SUSE 9 64bit gcc debug: classlib over drlvm Wed, 28 Feb, 16:39
ge...@apache.org [build-test alert] BUILD FAILED lnx gcc debug: classlib Wed, 28 Feb, 16:40
ge...@apache.org [build-test alert] BUILD SUCCEEDED lnx gcc debug: drlvm Wed, 28 Feb, 16:41
nom...@intel.com [build-test alert] BUILD FAILED Windows XP ia32 msvc debug: drlvm Wed, 28 Feb, 16:42
ge...@apache.org [build-test alert] BUILD FAILED lnx gcc debug: drlvm Wed, 28 Feb, 16:43
ge...@apache.org [build-test alert] BUILD FAILED lnx gcc debug: drlvm Wed, 28 Feb, 16:44
ndbe...@apache.org [build-test alert] BUILD FAILED win msvc debug: classlib Wed, 28 Feb, 16:59
nom...@frigga.cs.uiuc.edu [build-test alert] BUILD FAILED lnx gcc debug: classlib over drlvm Wed, 28 Feb, 17:02
nom...@hursley.ibm.com [continuum] BUILD FAILURE: Classlib/linux.ia32 Build/Test Wed, 28 Feb, 17:03
ge...@apache.org [build-test alert] BUILD FAILED lnx gcc debug: classlib Wed, 28 Feb, 17:32
nom...@intel.com [build-test alert] BUILD FAILED Linux SUSE 9 gcc debug: drlvm test Wed, 28 Feb, 18:17
ge...@apache.org [build-test alert] BUILD FAILED lnx gcc debug: drlvm Wed, 28 Feb, 19:21
ge...@apache.org [build-test alert] BUILD FAILED lnx gcc debug: drlvm Wed, 28 Feb, 19:24
ge...@apache.org [build-test alert] BUILD FAILED lnx gcc debug: classlib over drlvm Wed, 28 Feb, 19:46
nom...@intel.com [build-test alert] BUILD FAILED Linux SUSE 9 gcc debug: drlvm reg.test Wed, 28 Feb, 19:49
nom...@intel.com [build-test alert] BUILD FAILED Linux SUSE 9 gcc debug: classlib over drlvm Wed, 28 Feb, 19:49
nom...@intel.com [build-test alert] BUILD FAILED Windows XP SP2 msvc debug: drlvm tests Wed, 28 Feb, 19:49
nom...@intel.com [build-test alert] BUILD FAILED Windows XP SP2 msvc debug: drlvm reg.test Wed, 28 Feb, 19:51
nom...@intel.com [build-test alert] BUILD FAILED Windows XP SP2 msvc debug: classlib over drlvm Wed, 28 Feb, 19:52
nom...@intel.com [build-test alert] BUILD FAILED SUSEL9 IA32 gcc debug: classlib tests iterative Wed, 28 Feb, 20:16
nom...@intel.com [build-test alert] BUILD FAILED SUSEL9 IA32 gcc debug: classlib tests iterative Wed, 28 Feb, 22:10
nom...@frigga.cs.uiuc.edu [build-test alert] BUILD FAILED lnx gcc debug: classlib Wed, 28 Feb, 23:35
nom...@intel.com [build-test alert] BUILD FAILED SUSEL9 IA32 gcc debug: classlib tests iterative Thu, 01 Mar, 00:05
nom...@intel.com [build-test alert] BUILD FAILED SUSEL9 IA32 gcc debug: classlib tests iterative Thu, 01 Mar, 02:00
ge...@apache.org [build-test alert] BUILD SUCCEEDED lnx gcc debug: classlib Thu, 01 Mar, 03:54
nom...@intel.com [build-test alert] BUILD SUCCEEDED Linux SUSE9 64bit gcc debug: classlib Thu, 01 Mar, 03:54
nom...@intel.com [build-test alert] BUILD FAILED SUSEL9 IA32 gcc debug: classlib tests iterative Thu, 01 Mar, 03:55
nom...@intel.com [build-test alert] BUILD SUCCEEDED Linux SUSE 9 64bit gcc debug: drlvm reg.test Thu, 01 Mar, 04:00
nom...@intel.com [build-test alert] BUILD FAILED Windows XP msvc debug: classlib EHWA Thu, 01 Mar, 04:01
ge...@apache.org [build-test alert] BUILD SUCCEEDED lnx gcc debug: drlvm Thu, 01 Mar, 04:04
ge...@apache.org [build-test alert] BUILD SUCCEEDED lnx gcc debug: classlib Thu, 01 Mar, 04:04
ndbe...@apache.org [build-test alert] BUILD SUCCEEDED win msvc debug: classlib Thu, 01 Mar, 04:05
nom...@intel.com [build-test alert] BUILD SUCCEEDED Windows XP ia32 msvc debug: classlib Thu, 01 Mar, 04:07
nom...@intel.com [build-test alert] BUILD FAILED SUSE Linux 64bit gcc debug: classlib EHWA Thu, 01 Mar, 04:09
nom...@frigga.cs.uiuc.edu [build-test alert] BUILD FAILED lnx gcc debug: drlvm Thu, 01 Mar, 04:09
ge...@apache.org [build-test alert] BUILD SUCCEEDED lnx gcc debug: drlvm Thu, 01 Mar, 04:14
nom...@intel.com [build-test alert] BUILD SUCCEEDED Windows XP SP2 msvc debug: drlvm reg.test Thu, 01 Mar, 04:14
nom...@intel.com [build-test alert] BUILD SUCCEEDED Linux SUSE9 64bit gcc debug: drlvm Thu, 01 Mar, 04:29
nom...@intel.com [build-test alert] BUILD SUCCEEDED Windows XP ia32 msvc debug: drlvm Thu, 01 Mar, 04:37
ge...@apache.org [build-test alert] BUILD SUCCEEDED lnx gcc debug: classlib over drlvm Thu, 01 Mar, 04:39
nom...@intel.com [build-test alert] BUILD SUCCEEDED Windows XP SP2 msvc debug: classlib over drlvm Thu, 01 Mar, 04:42
nom...@intel.com [build-test alert] BUILD SUCCEEDED Linux SUSE 9 64bit gcc debug: drlvm tests Thu, 01 Mar, 04:59
nom...@intel.com [build-test alert] BUILD SUCCEEDED Windows XP msvc debug: classlib EHWA Thu, 01 Mar, 05:02
nom...@hursley.ibm.com [continuum] BUILD SUCCESSFUL: Classlib/linux.ia32 Build/Test Thu, 01 Mar, 05:08
nom...@intel.com [build-test alert] BUILD SUCCEEDED Linux SUSE 9 gcc debug: drlvm test Thu, 01 Mar, 05:13
nom...@intel.com [build-test alert] BUILD SUCCEEDED SUSE Linux 64bit gcc debug: classlib EHWA Thu, 01 Mar, 05:19
nom...@intel.com [build-test alert] BUILD SUCCEEDED Linux SUSE 9 gcc debug: drlvm reg.test Thu, 01 Mar, 05:25
nom...@intel.com [build-test alert] BUILD SUCCEEDED Linux SUSE 9 64bit gcc debug: classlib over drlvm Thu, 01 Mar, 05:28
ge...@apache.org [build-test alert] BUILD SUCCEEDED lnx gcc debug: drlvm Thu, 01 Mar, 05:34
nom...@intel.com [build-test alert] BUILD SUCCEEDED Windows XP SP2 msvc debug: drlvm tests Thu, 01 Mar, 05:58
nom...@intel.com [build-test alert] BUILD SUCCEEDED Linux SUSE 9 gcc debug: classlib over drlvm Thu, 01 Mar, 06:04
nom...@intel.com [build-test alert] BUILD FAILED Linux SUSE9 64bit gcc debug: classlib Thu, 01 Mar, 06:21
nom...@intel.com [build-test alert] BUILD FAILED Windows XP ia32 msvc debug: classlib Thu, 01 Mar, 06:24
nom...@intel.com [build-test alert] BUILD FAILED Linux SUSE9 64bit gcc debug: drlvm Thu, 01 Mar, 06:29
nom...@intel.com [build-test alert] BUILD FAILED Windows XP ia32 msvc debug: drlvm Thu, 01 Mar, 06:32
ndbe...@apache.org [build-test alert] BUILD FAILED win msvc debug: classlib Thu, 01 Mar, 06:34
nom...@intel.com [build-test alert] BUILD SUCCEEDED Linux SUSE9 64bit gcc debug: classlib Thu, 01 Mar, 06:41
ge...@apache.org [build-test alert] BUILD FAILED lnx gcc debug: classlib Thu, 01 Mar, 06:43
ge...@apache.org [build-test alert] BUILD FAILED lnx gcc debug: drlvm Thu, 01 Mar, 06:46
nom...@intel.com [build-test alert] BUILD SUCCEEDED Windows XP ia32 msvc debug: classlib Thu, 01 Mar, 06:53
nom...@intel.com [build-test alert] BUILD FAILED Linux SUSE 9 64bit gcc debug: classlib over drlvm Thu, 01 Mar, 06:56
ndbe...@apache.org [build-test alert] BUILD SUCCEEDED win msvc debug: classlib Thu, 01 Mar, 06:57
nom...@intel.com [build-test alert] BUILD SUCCEEDED Linux SUSE9 64bit gcc debug: drlvm Thu, 01 Mar, 07:00
ge...@apache.org [build-test alert] BUILD SUCCEEDED lnx gcc debug: classlib Thu, 01 Mar, 07:01
nom...@intel.com [build-test alert] BUILD FAILED Linux SUSE 9 gcc debug: classlib over drlvm Thu, 01 Mar, 07:07
ge...@apache.org [build-test alert] BUILD SUCCEEDED lnx gcc debug: drlvm Thu, 01 Mar, 07:10
nom...@intel.com [build-test alert] BUILD SUCCEEDED Windows XP ia32 msvc debug: drlvm Thu, 01 Mar, 07:19
ge...@apache.org [build-test alert] BUILD FAILED lnx gcc debug: classlib Thu, 01 Mar, 07:24
nom...@hursley.ibm.com [continuum] BUILD FAILURE: Classlib/linux.ia32 Build/Test Thu, 01 Mar, 07:59
Message list« Previous · 1 · 2 · 3 · 4Thread · Author · Date
Box list
Jul 20113
Dec 201029
Nov 20106
Oct 201046
Sep 201035
Aug 201017
Jul 201029
Jun 201041
May 201020
Apr 201040
Mar 2010102
Feb 201043
Jan 201014
Dec 200911
Nov 20099
Oct 200912
Sep 20093
Aug 200915
Jul 200959
Jun 200916
May 200930
Apr 200960
Mar 200919
Feb 200945
Jan 200957
Dec 200827
Nov 200815
Oct 200824
Sep 200854
Aug 200834
Jul 200841
Jun 200899
May 200862
Apr 2008113
Mar 2008133
Feb 2008164
Jan 2008291
Dec 2007335
Nov 2007454
Oct 2007405
Sep 2007259
Aug 2007368
Jul 2007618
Jun 2007607
May 2007672
Apr 2007455
Mar 20071104
Feb 2007389
Jan 2007418
Dec 200692