harmony-alerts mailing list archives: February 2007

Site index · List index
Message list« Previous · 1 · 2 · 3 · 4 · Next »Thread · Author · Date
nom...@intel.com [build-test alert] BUILD SUCCEEDED Windows XP SP2 msvc debug: classlib over drlvm Thu, 08 Feb, 09:24
nom...@intel.com [build-test alert] BUILD FAILED Windows XP SP2 msvc debug: classlib over drlvm Thu, 08 Feb, 11:28
nom...@hursley.ibm.com [continuum] BUILD FAILURE: Classlib/linux.ia32 Build/Test Thu, 08 Feb, 12:39
nom...@intel.com [build-test alert] BUILD SUCCEEDED Windows XP SP2 msvc debug: classlib over drlvm Thu, 08 Feb, 13:23
nom...@intel.com [build-test alert] BUILD FAILED SUSEL9 64bit gcc debug: classlib tests iterative Thu, 08 Feb, 13:38
nom...@hursley.ibm.com [continuum] BUILD SUCCESSFUL: Classlib/linux.ia32 Build/Test Thu, 08 Feb, 16:24
nom...@intel.com [build-test alert] BUILD SUCCEEDED Windows XP SP2 msvc debug: drlvm reg.test Thu, 08 Feb, 16:45
nom...@intel.com [build-test alert] BUILD FAILED SUSE Linux 64bit gcc debug: classlib EHWA Thu, 08 Feb, 17:16
nom...@frigga.cs.uiuc.edu [build-test alert] BUILD FAILED lnx gcc debug: drlvm Thu, 08 Feb, 21:07
nom...@intel.com [build-test alert] BUILD FIXED WIN XP msvc debug: classlib tests iterative Thu, 08 Feb, 23:09
nom...@hursley.ibm.com [continuum] BUILD ERROR: Classlib/linux.ia32 Build/Test Fri, 09 Feb, 00:00
ge...@apache.org [build-test alert] BUILD FAILED lnx gcc debug: drlvm Fri, 09 Feb, 01:47
nom...@hursley.ibm.com [continuum] BUILD SUCCESSFUL: Classlib/linux.ia32 Build/Test Fri, 09 Feb, 06:14
nom...@intel.com [build-test alert] BUILD SUCCEEDED SUSE Linux 64bit gcc debug: classlib EHWA Fri, 09 Feb, 06:14
nom...@intel.com [build-test alert] BUILD FAILED Linux SUSE 9 64bit gcc debug: classlib over drlvm Fri, 09 Feb, 08:30
nom...@intel.com [build-test alert] BUILD SUCCEEDED Linux SUSE 9 64bit gcc debug: classlib over drlvm Fri, 09 Feb, 11:38
nom...@hursley.ibm.com [continuum] BUILD FAILURE: Classlib/linux.ia32 Build/Test Fri, 09 Feb, 15:07
nom...@intel.com [build-test alert] BUILD FAILED Linux SUSE 9 64bit gcc debug: classlib over drlvm Fri, 09 Feb, 16:45
nom...@hursley.ibm.com [continuum] BUILD SUCCESSFUL: Classlib/linux.ia32 Build/Test Fri, 09 Feb, 17:14
nom...@intel.com [build-test alert] BUILD FAILED SUSEL9 64bit gcc debug: classlib tests iterative Fri, 09 Feb, 18:05
nom...@intel.com [build-test alert] BUILD SUCCEEDED Linux SUSE 9 64bit gcc debug: classlib over drlvm Fri, 09 Feb, 18:19
nom...@intel.com [build-test alert] BUILD FAILED Linux SUSE 9 64bit gcc debug: drlvm tests Fri, 09 Feb, 19:02
nom...@intel.com [build-test alert] BUILD SUCCEEDED Linux SUSE 9 64bit gcc debug: drlvm tests Fri, 09 Feb, 19:51
nom...@intel.com [build-test alert] BUILD FAILED Windows XP SP2 msvc debug: classlib over drlvm Fri, 09 Feb, 20:37
nom...@intel.com [build-test alert] BUILD SUCCEEDED Windows XP SP2 msvc debug: classlib over drlvm Fri, 09 Feb, 21:11
nom...@frigga.cs.uiuc.edu [build-test alert] BUILD SUCCEEDED lnx gcc debug: drlvm Fri, 09 Feb, 21:33
nom...@intel.com [build-test alert] BUILD FIXED WIN XP msvc debug: classlib tests iterative Fri, 09 Feb, 23:47
nom...@hursley.ibm.com [continuum] BUILD ERROR: Classlib/linux.ia32 Build/Test Sat, 10 Feb, 00:00
nom...@frigga.cs.uiuc.edu [build-test alert] BUILD FAILED lnx gcc debug: drlvm Sat, 10 Feb, 21:36
nom...@intel.com [build-test alert] BUILD FAILED SUSEL9 64bit gcc debug: classlib tests iterative Sat, 10 Feb, 22:30
nom...@hursley.ibm.com [continuum] BUILD ERROR: Classlib/linux.ia32 Build/Test Sun, 11 Feb, 00:00
nom...@intel.com [build-test alert] BUILD FIXED WIN XP msvc debug: classlib tests iterative Sun, 11 Feb, 01:13
nom...@hursley.ibm.com [continuum] BUILD SUCCESSFUL: Classlib/linux.ia32 Build/Test Sun, 11 Feb, 02:14
ge...@apache.org [build-test alert] BUILD SUCCEEDED lnx gcc debug: drlvm Sun, 11 Feb, 13:39
nom...@frigga.cs.uiuc.edu [build-test alert] BUILD SUCCEEDED lnx gcc debug: drlvm Sun, 11 Feb, 22:02
ge...@apache.org [build-test alert] BUILD SUCCEEDED lnx gcc debug: classlib over drlvm Sun, 11 Feb, 23:38
nom...@hursley.ibm.com [continuum] BUILD ERROR: Classlib/linux.ia32 Build/Test Mon, 12 Feb, 00:00
nom...@intel.com [build-test alert] BUILD FAILED SUSEL9 64bit gcc debug: classlib tests iterative Mon, 12 Feb, 01:51
nom...@intel.com [build-test alert] BUILD FAILED WIN XP msvc debug: classlib tests iterative Mon, 12 Feb, 03:00
ge...@apache.org [build-test alert] BUILD FAILED lnx gcc debug: classlib over drlvm Mon, 12 Feb, 05:05
nom...@hursley.ibm.com [continuum] BUILD SUCCESSFUL: Classlib/linux.ia32 Build/Test Mon, 12 Feb, 06:14
ge...@apache.org [build-test alert] BUILD SUCCEEDED lnx gcc debug: classlib over drlvm Mon, 12 Feb, 06:53
nom...@hursley.ibm.com [continuum] BUILD FAILURE: Classlib/linux.ia32 Build/Test Mon, 12 Feb, 08:21
ge...@apache.org [build-test alert] BUILD FAILED lnx gcc debug: classlib over drlvm Mon, 12 Feb, 09:02
ge...@apache.org [build-test alert] BUILD SUCCEEDED lnx gcc debug: classlib over drlvm Mon, 12 Feb, 10:49
nom...@hursley.ibm.com [continuum] BUILD SUCCESSFUL: Classlib/linux.ia32 Build/Test Mon, 12 Feb, 12:05
ge...@apache.org [build-test alert] BUILD FAILED lnx gcc debug: classlib over drlvm Mon, 12 Feb, 12:59
nom...@intel.com [build-test alert] BUILD FAILED SUSEL9 64bit gcc debug: classlib tests iterative Mon, 12 Feb, 13:33
ge...@apache.org [build-test alert] BUILD SUCCEEDED lnx gcc debug: classlib over drlvm Mon, 12 Feb, 14:53
nom...@intel.com [build-test alert] BUILD FAILED Linux SUSE 9 64bit gcc debug: drlvm tests Mon, 12 Feb, 16:29
nom...@intel.com [build-test alert] BUILD SUCCEEDED Linux SUSE 9 64bit gcc debug: drlvm tests Mon, 12 Feb, 17:56
nom...@hursley.ibm.com [continuum] BUILD FAILURE: Classlib/linux.ia32 Build/Test Mon, 12 Feb, 19:27
nom...@hursley.ibm.com [continuum] BUILD ERROR: Classlib/linux.ia32 Build/Test Mon, 12 Feb, 20:29
nom...@intel.com [build-test alert] BUILD FAILED Windows XP SP2 msvc debug: classlib over drlvm Mon, 12 Feb, 20:37
nom...@hursley.ibm.com [continuum] BUILD ERROR: Classlib/linux.ia32 Build/Test Mon, 12 Feb, 21:31
nom...@intel.com [build-test alert] BUILD SUCCEEDED Windows XP SP2 msvc debug: classlib over drlvm Mon, 12 Feb, 22:15
nom...@hursley.ibm.com [continuum] BUILD ERROR: Classlib/linux.ia32 Build/Test Mon, 12 Feb, 22:23
nom...@hursley.ibm.com [continuum] BUILD ERROR: Classlib/linux.ia32 Build/Test Mon, 12 Feb, 23:25
nom...@intel.com [build-test alert] BUILD FAILED Linux SUSE 9 64bit gcc debug: drlvm tests Mon, 12 Feb, 23:40
nom...@hursley.ibm.com [continuum] BUILD ERROR: Classlib/linux.ia32 Build/Test Tue, 13 Feb, 00:00
nom...@intel.com [build-test alert] BUILD FAILED Windows XP SP2 msvc debug: classlib over drlvm Tue, 13 Feb, 00:19
nom...@intel.com [build-test alert] BUILD SUCCEEDED Linux SUSE 9 64bit gcc debug: drlvm tests Tue, 13 Feb, 01:08
nom...@hursley.ibm.com [continuum] BUILD ERROR: Classlib/linux.ia32 Build/Test Tue, 13 Feb, 01:20
nom...@intel.com [build-test alert] BUILD SUCCEEDED Windows XP SP2 msvc debug: classlib over drlvm Tue, 13 Feb, 01:58
nom...@hursley.ibm.com [continuum] BUILD ERROR: Classlib/linux.ia32 Build/Test Tue, 13 Feb, 02:23
nom...@hursley.ibm.com [continuum] BUILD ERROR: Classlib/linux.ia32 Build/Test Tue, 13 Feb, 03:26
nom...@hursley.ibm.com [continuum] BUILD ERROR: Classlib/linux.ia32 Build/Test Tue, 13 Feb, 04:28
nom...@intel.com [build-test alert] BUILD FAILED Windows XP SP2 msvc debug: classlib over drlvm Tue, 13 Feb, 05:21
nom...@hursley.ibm.com [continuum] BUILD ERROR: Classlib/linux.ia32 Build/Test Tue, 13 Feb, 05:31
nom...@intel.com [build-test alert] BUILD SUCCEEDED Windows XP SP2 msvc debug: classlib over drlvm Tue, 13 Feb, 05:55
nom...@hursley.ibm.com [continuum] BUILD ERROR: Classlib/linux.ia32 Build/Test Tue, 13 Feb, 06:33
nom...@hursley.ibm.com [continuum] BUILD ERROR: Classlib/linux.ia32 Build/Test Tue, 13 Feb, 07:26
nom...@hursley.ibm.com [continuum] BUILD ERROR: Classlib/linux.ia32 Build/Test Tue, 13 Feb, 08:28
nom...@hursley.ibm.com [continuum] BUILD ERROR: Classlib/linux.ia32 Build/Test Tue, 13 Feb, 09:30
nom...@intel.com [build-test alert] BUILD SUCCEEDED Linux SUSE 9 64bit gcc debug: drlvm reg.test Tue, 13 Feb, 10:12
nom...@hursley.ibm.com [continuum] BUILD ERROR: Classlib/linux.ia32 Build/Test Tue, 13 Feb, 10:34
nom...@hursley.ibm.com [continuum] BUILD ERROR: Classlib/linux.ia32 Build/Test Tue, 13 Feb, 11:26
nom...@hursley.ibm.com [continuum] BUILD FAILURE: Classlib/linux.ia32 Build/Test Tue, 13 Feb, 13:17
nom...@intel.com [build-test alert] BUILD FIXED WIN XP msvc debug: classlib tests iterative Tue, 13 Feb, 13:46
nom...@intel.com [build-test alert] BUILD FAILED SUSEL9 IA32 gcc debug: classlib tests iterative Tue, 13 Feb, 14:05
nom...@intel.com [build-test alert] BUILD FAILED SUSEL9 64bit gcc debug: classlib tests iterative Tue, 13 Feb, 15:03
nom...@intel.com [build-test alert] BUILD FAILED Linux SUSE 9 gcc debug: classlib over drlvm Tue, 13 Feb, 16:26
nom...@intel.com [build-test alert] BUILD FAILED Linux SUSE 9 64bit gcc debug: classlib over drlvm Tue, 13 Feb, 17:21
nom...@hursley.ibm.com [continuum] BUILD FAILURE: Classlib/linux.ia32 Build/Test Tue, 13 Feb, 17:22
nom...@frigga.cs.uiuc.edu [build-test alert] BUILD FAILED lnx gcc debug: drlvm Tue, 13 Feb, 22:28
ge...@apache.org [build-test alert] BUILD FAILED lnx gcc debug: drlvm Tue, 13 Feb, 22:45
ge...@apache.org [build-test alert] BUILD SUCCEEDED lnx gcc debug: drlvm Wed, 14 Feb, 00:07
nom...@intel.com [build-test alert] BUILD FAILED Windows XP SP2 msvc debug: drlvm reg.test Wed, 14 Feb, 03:55
nom...@intel.com [build-test alert] BUILD SUCCEEDED Windows XP SP2 msvc debug: drlvm reg.test Wed, 14 Feb, 05:48
nom...@hursley.ibm.com [continuum] BUILD FAILURE: Classlib/linux.ia32 Build/Test Wed, 14 Feb, 06:14
nom...@frigga.cs.uiuc.edu [build-test alert] BUILD FAILED lnx gcc debug: classlib over drlvm Wed, 14 Feb, 06:36
nom...@intel.com [build-test alert] BUILD SUCCEEDED Linux SUSE 9 64bit gcc debug: classlib over drlvm Wed, 14 Feb, 06:41
nom...@hursley.ibm.com [continuum] BUILD SUCCESSFUL: Classlib/linux.ia32 Build/Test Wed, 14 Feb, 10:16
nom...@intel.com [build-test alert] BUILD SUCCEEDED Linux SUSE 9 gcc debug: classlib over drlvm Wed, 14 Feb, 11:18
nom...@intel.com [build-test alert] BUILD FIXED WIN XP msvc debug: classlib tests iterative Wed, 14 Feb, 11:28
nom...@intel.com [build-test alert] BUILD FAILED SUSEL9 IA32 gcc debug: classlib tests iterative Wed, 14 Feb, 13:20
nom...@intel.com [build-test alert] BUILD FIXED SUSEL9 64bit gcc debug: classlib tests iterative Wed, 14 Feb, 16:59
nom...@frigga.cs.uiuc.edu [build-test alert] BUILD SUCCEEDED lnx gcc debug: drlvm Wed, 14 Feb, 22:53
nom...@frigga.cs.uiuc.edu [build-test alert] BUILD SUCCEEDED lnx gcc debug: classlib over drlvm Thu, 15 Feb, 07:38
nom...@intel.com [build-test alert] BUILD FAILED Windows XP SP2 msvc debug: drlvm reg.test Thu, 15 Feb, 07:41
Message list« Previous · 1 · 2 · 3 · 4 · Next »Thread · Author · Date
Box list
Jul 20113
Dec 201029
Nov 20106
Oct 201046
Sep 201035
Aug 201017
Jul 201029
Jun 201041
May 201020
Apr 201040
Mar 2010102
Feb 201043
Jan 201014
Dec 200911
Nov 20099
Oct 200912
Sep 20093
Aug 200915
Jul 200959
Jun 200916
May 200930
Apr 200960
Mar 200919
Feb 200945
Jan 200957
Dec 200827
Nov 200815
Oct 200824
Sep 200854
Aug 200834
Jul 200841
Jun 200899
May 200862
Apr 2008113
Mar 2008133
Feb 2008164
Jan 2008291
Dec 2007335
Nov 2007454
Oct 2007405
Sep 2007259
Aug 2007368
Jul 2007618
Jun 2007607
May 2007672
Apr 2007455
Mar 20071104
Feb 2007389
Jan 2007418
Dec 200692