harmony-alerts mailing list archives: February 2007

Site index · List index
Message list1 · 2 · 3 · 4 · Next »Thread · Author · Date
ge...@apache.org [build-test alert] BUILD SUCCEEDED lnx gcc debug: drlvm Thu, 01 Feb, 08:22
ge...@apache.org [build-test alert] BUILD FAILED lnx gcc debug: classlib over drlvm Thu, 01 Feb, 08:55
nom...@hursley.ibm.com [continuum] BUILD SUCCESSFUL: Classlib/linux.ia32 Build/Test Thu, 01 Feb, 09:14
nom...@intel.com [build-test alert] BUILD SUCCEEDED Linux SUSE 9 64bit gcc debug: drlvm tests Thu, 01 Feb, 09:56
nom...@intel.com [build-test alert] BUILD FAILED SUSEL9 64bit gcc debug: classlib tests iterative Thu, 01 Feb, 10:10
nom...@intel.com [build-test alert] BUILD FAILED Linux SUSE 9 gcc debug: drlvm Thu, 01 Feb, 10:41
ge...@apache.org [build-test alert] BUILD SUCCEEDED lnx gcc debug: classlib over drlvm Thu, 01 Feb, 10:44
nom...@intel.com [build-test alert] BUILD SUCCEEDED Linux SUSE 9 64bit gcc debug: classlib over drlvm Thu, 01 Feb, 11:21
nom...@intel.com [build-test alert] BUILD SUCCEEDED Linux SUSE 9 gcc debug: drlvm Thu, 01 Feb, 12:42
ge...@apache.org [build-test alert] BUILD FAILED lnx gcc debug: classlib over drlvm Thu, 01 Feb, 12:44
ge...@apache.org [build-test alert] BUILD FAILED lnx gcc debug: drlvm Thu, 01 Feb, 18:06
ge...@apache.org [build-test alert] BUILD SUCCEEDED lnx gcc debug: drlvm Thu, 01 Feb, 20:03
nom...@hursley.ibm.com [continuum] BUILD FAILURE: Classlib/linux.ia32 Build/Test Thu, 01 Feb, 20:42
ge...@apache.org [build-test alert] BUILD FAILED lnx gcc debug: drlvm Thu, 01 Feb, 22:06
ge...@apache.org [build-test alert] BUILD SUCCEEDED lnx gcc debug: classlib over drlvm Thu, 01 Feb, 22:33
nom...@hursley.ibm.com [continuum] BUILD ERROR: Classlib/linux.ia32 Build/Test Fri, 02 Feb, 00:00
nom...@intel.com [build-test alert] BUILD FAILED WIN XP msvc debug: classlib tests iterative Fri, 02 Feb, 01:00
ge...@apache.org [build-test alert] BUILD SUCCEEDED lnx gcc debug: drlvm Fri, 02 Feb, 01:33
ge...@apache.org [build-test alert] BUILD FAILED lnx gcc debug: classlib over drlvm Fri, 02 Feb, 05:05
nom...@hursley.ibm.com [continuum] BUILD SUCCESSFUL: Classlib/linux.ia32 Build/Test Fri, 02 Feb, 06:13
ge...@apache.org [build-test alert] BUILD FAILED lnx gcc debug: drlvm Fri, 02 Feb, 06:56
nom...@intel.com [build-test alert] BUILD SUCCEEDED Linux SUSE 9 gcc debug: classlib over drlvm Fri, 02 Feb, 10:38
ge...@apache.org [build-test alert] BUILD SUCCEEDED lnx gcc debug: drlvm Fri, 02 Feb, 13:19
nom...@intel.com [build-test alert] BUILD FAILED SUSEL9 64bit gcc debug: classlib tests iterative Fri, 02 Feb, 15:14
ge...@apache.org [build-test alert] BUILD FAILED lnx gcc debug: drlvm Fri, 02 Feb, 17:25
nom...@hursley.ibm.com [continuum] BUILD FAILURE: Classlib/linux.ia32 Build/Test Fri, 02 Feb, 17:59
nom...@hursley.ibm.com [continuum] BUILD ERROR: Classlib/linux.ia32 Build/Test Fri, 02 Feb, 18:00
nom...@hursley.ibm.com [continuum] BUILD ERROR: Classlib/linux.ia32 Build/Test Fri, 02 Feb, 19:00
nom...@hursley.ibm.com [continuum] BUILD ERROR: Classlib/linux.ia32 Build/Test Fri, 02 Feb, 20:00
ge...@apache.org [build-test alert] BUILD SUCCEEDED lnx gcc debug: classlib over drlvm Fri, 02 Feb, 20:00
nom...@hursley.ibm.com [continuum] BUILD ERROR: Classlib/linux.ia32 Build/Test Fri, 02 Feb, 22:00
nom...@hursley.ibm.com [continuum] BUILD ERROR: Classlib/linux.ia32 Build/Test Fri, 02 Feb, 23:00
nom...@hursley.ibm.com [continuum] BUILD ERROR: Classlib/linux.ia32 Build/Test Sat, 03 Feb, 00:00
nom...@hursley.ibm.com [continuum] BUILD ERROR: Classlib/linux.ia32 Build/Test Sat, 03 Feb, 00:00
nom...@intel.com [build-test alert] BUILD FAILED WIN XP msvc debug: classlib tests iterative Sat, 03 Feb, 00:06
nom...@hursley.ibm.com [continuum] BUILD ERROR: Classlib/linux.ia32 Build/Test Sat, 03 Feb, 01:00
nom...@hursley.ibm.com [continuum] BUILD ERROR: Classlib/linux.ia32 Build/Test Sat, 03 Feb, 02:00
nom...@hursley.ibm.com [continuum] BUILD ERROR: Classlib/linux.ia32 Build/Test Sat, 03 Feb, 03:00
nom...@hursley.ibm.com [continuum] BUILD ERROR: Classlib/linux.ia32 Build/Test Sat, 03 Feb, 04:00
nom...@hursley.ibm.com [continuum] BUILD ERROR: Classlib/linux.ia32 Build/Test Sat, 03 Feb, 05:00
ge...@apache.org [build-test alert] BUILD SUCCEEDED lnx gcc debug: drlvm Sat, 03 Feb, 05:06
nom...@hursley.ibm.com [continuum] BUILD ERROR: Classlib/linux.ia32 Build/Test Sat, 03 Feb, 06:00
nom...@intel.com [build-test alert] BUILD FAILED SUSEL9 64bit gcc debug: classlib tests iterative Sat, 03 Feb, 19:43
nom...@intel.com [build-test alert] BUILD FAILED WIN XP msvc debug: classlib tests iterative Sat, 03 Feb, 23:23
ge...@apache.org [build-test alert] BUILD FAILED lnx gcc debug: classlib over drlvm Sun, 04 Feb, 08:55
ge...@apache.org [build-test alert] BUILD FAILED lnx gcc debug: drlvm Sun, 04 Feb, 10:47
nom...@intel.com [build-test alert] BUILD FAILED Linux SUSE 9 64bit gcc debug: classlib over drlvm Sun, 04 Feb, 10:49
nom...@intel.com [build-test alert] BUILD FAILED Linux SUSE 9 gcc debug: classlib over drlvm Sun, 04 Feb, 10:57
ge...@apache.org [build-test alert] BUILD SUCCEEDED lnx gcc debug: drlvm Sun, 04 Feb, 16:38
nom...@frigga.cs.uiuc.edu [build-test alert] BUILD FAILED lnx gcc debug: classlib over drlvm Sun, 04 Feb, 21:29
nom...@intel.com [build-test alert] BUILD FAILED WIN XP msvc debug: classlib tests iterative Sun, 04 Feb, 21:53
nom...@intel.com [build-test alert] BUILD FAILED SUSEL9 64bit gcc debug: classlib tests iterative Mon, 05 Feb, 00:00
nom...@intel.com [build-test alert] BUILD SUCCEEDED Linux SUSE 9 gcc debug: classlib over drlvm Mon, 05 Feb, 05:48
ge...@apache.org [build-test alert] BUILD FAILED lnx gcc debug: drlvm Mon, 05 Feb, 06:02
nom...@intel.com [build-test alert] BUILD FAILED Windows XP SP2 msvc debug: drlvm reg.test Mon, 05 Feb, 06:25
nom...@intel.com [build-test alert] BUILD SUCCEEDED Linux SUSE 9 64bit gcc debug: classlib over drlvm Mon, 05 Feb, 07:20
nom...@intel.com [build-test alert] BUILD FAILED Linux SUSE 9 64bit gcc debug: drlvm reg.test Mon, 05 Feb, 07:29
ge...@apache.org [build-test alert] BUILD SUCCEEDED lnx gcc debug: drlvm Mon, 05 Feb, 08:38
nom...@hursley.ibm.com [continuum] BUILD FAILURE: Classlib/linux.ia32 Build/Test Mon, 05 Feb, 10:43
ge...@apache.org [build-test alert] BUILD SUCCEEDED lnx gcc debug: classlib over drlvm Mon, 05 Feb, 11:12
nom...@hursley.ibm.com [continuum] BUILD SUCCESSFUL: Classlib/linux.ia32 Build/Test Mon, 05 Feb, 11:49
ge...@apache.org [build-test alert] BUILD FAILED lnx gcc debug: drlvm Mon, 05 Feb, 13:05
ge...@apache.org [build-test alert] BUILD FAILED lnx gcc debug: classlib over drlvm Mon, 05 Feb, 16:00
nom...@intel.com [build-test alert] BUILD FAILED WIN XP msvc debug: classlib tests iterative Mon, 05 Feb, 22:12
nom...@frigga.cs.uiuc.edu [build-test alert] BUILD SUCCEEDED lnx gcc debug: classlib over drlvm Mon, 05 Feb, 22:30
nom...@hursley.ibm.com [continuum] BUILD ERROR: Classlib/linux.ia32 Build/Test Tue, 06 Feb, 00:00
ge...@apache.org [build-test alert] BUILD SUCCEEDED lnx gcc debug: drlvm Tue, 06 Feb, 01:55
ge...@apache.org [build-test alert] BUILD SUCCEEDED lnx gcc debug: classlib over drlvm Tue, 06 Feb, 04:14
nom...@intel.com [build-test alert] BUILD FAILED SUSEL9 64bit gcc debug: classlib tests iterative Tue, 06 Feb, 04:59
ge...@apache.org [build-test alert] BUILD FAILED lnx gcc debug: drlvm Tue, 06 Feb, 08:50
ge...@apache.org [build-test alert] BUILD FAILED lnx gcc debug: classlib over drlvm Tue, 06 Feb, 09:24
nom...@hursley.ibm.com [continuum] BUILD SUCCESSFUL: Classlib/linux.ia32 Build/Test Tue, 06 Feb, 10:01
nom...@hursley.ibm.com [continuum] BUILD FAILURE: Classlib/linux.ia32 Build/Test Tue, 06 Feb, 14:18
nom...@hursley.ibm.com [continuum] BUILD SUCCESSFUL: Classlib/linux.ia32 Build/Test Tue, 06 Feb, 16:14
nom...@intel.com [build-test alert] BUILD FAILED Linux SUSE 9 64bit gcc debug: classlib over drlvm Tue, 06 Feb, 16:51
nom...@intel.com [build-test alert] BUILD FAILED Linux SUSE 9 gcc debug: classlib over drlvm Tue, 06 Feb, 18:25
nom...@intel.com [build-test alert] BUILD SUCCEEDED Linux SUSE 9 64bit gcc debug: classlib over drlvm Tue, 06 Feb, 19:11
ge...@apache.org [build-test alert] BUILD SUCCEEDED lnx gcc debug: drlvm Tue, 06 Feb, 19:50
nom...@intel.com [build-test alert] BUILD FAILED Linux SUSE 9 gcc debug: drlvm test Tue, 06 Feb, 20:05
nom...@intel.com [build-test alert] BUILD SUCCEEDED Linux SUSE 9 gcc debug: classlib over drlvm Tue, 06 Feb, 20:45
nom...@intel.com [build-test alert] BUILD SUCCEEDED Linux SUSE 9 gcc debug: drlvm test Tue, 06 Feb, 21:38
nom...@intel.com [build-test alert] BUILD FAILED Linux SUSE 9 64bit gcc debug: classlib Tue, 06 Feb, 22:02
nom...@intel.com [build-test alert] BUILD FIXED WIN XP msvc debug: classlib tests iterative Tue, 06 Feb, 22:12
nom...@intel.com [build-test alert] BUILD FAILED Linux SUSE 9 64bit gcc debug: drlvm Tue, 06 Feb, 22:12
nom...@intel.com [build-test alert] BUILD FAILED Linux SUSE 9 64bit gcc debug: classlib over drlvm Tue, 06 Feb, 22:13
nom...@intel.com [build-test alert] BUILD SUCCEEDED Linux SUSE 9 64bit gcc debug: classlib Tue, 06 Feb, 22:23
nom...@intel.com [build-test alert] BUILD SUCCEEDED Linux SUSE 9 64bit gcc debug: drlvm Tue, 06 Feb, 22:32
nom...@hursley.ibm.com [continuum] BUILD ERROR: Classlib/linux.ia32 Build/Test Wed, 07 Feb, 00:00
nom...@intel.com [build-test alert] BUILD SUCCEEDED Linux SUSE 9 64bit gcc debug: classlib over drlvm Wed, 07 Feb, 00:25
nom...@intel.com [build-test alert] BUILD FAILED Windows XP msvc debug: classlib EHWA Wed, 07 Feb, 06:14
nom...@intel.com [build-test alert] BUILD SUCCEEDED Windows XP msvc debug: classlib EHWA Wed, 07 Feb, 06:51
nom...@hursley.ibm.com [continuum] BUILD SUCCESSFUL: Classlib/linux.ia32 Build/Test Wed, 07 Feb, 07:15
nom...@intel.com [build-test alert] BUILD FAILED SUSEL9 64bit gcc debug: classlib tests iterative Wed, 07 Feb, 09:09
nom...@intel.com [build-test alert] BUILD FAILED Windows XP SP2 msvc debug: classlib over drlvm Wed, 07 Feb, 14:42
nom...@intel.com [build-test alert] BUILD FAILED Windows XP SP2 msvc debug: drlvm reg.test Wed, 07 Feb, 16:08
nom...@intel.com [build-test alert] BUILD SUCCEEDED Windows XP SP2 msvc debug: classlib over drlvm Wed, 07 Feb, 16:34
nom...@intel.com [build-test alert] BUILD FAILED WIN XP msvc debug: classlib tests iterative Wed, 07 Feb, 22:36
nom...@hursley.ibm.com [continuum] BUILD ERROR: Classlib/linux.ia32 Build/Test Thu, 08 Feb, 00:00
nom...@hursley.ibm.com [continuum] BUILD SUCCESSFUL: Classlib/linux.ia32 Build/Test Thu, 08 Feb, 07:16
nom...@intel.com [build-test alert] BUILD FAILED Windows XP SP2 msvc debug: classlib over drlvm Thu, 08 Feb, 07:29
Message list1 · 2 · 3 · 4 · Next »Thread · Author · Date
Box list
Jul 20113
Dec 201029
Nov 20106
Oct 201046
Sep 201035
Aug 201017
Jul 201029
Jun 201041
May 201020
Apr 201040
Mar 2010102
Feb 201043
Jan 201014
Dec 200911
Nov 20099
Oct 200912
Sep 20093
Aug 200915
Jul 200959
Jun 200916
May 200930
Apr 200960
Mar 200919
Feb 200945
Jan 200957
Dec 200827
Nov 200815
Oct 200824
Sep 200854
Aug 200834
Jul 200841
Jun 200899
May 200862
Apr 2008113
Mar 2008133
Feb 2008164
Jan 2008291
Dec 2007335
Nov 2007454
Oct 2007405
Sep 2007259
Aug 2007368
Jul 2007618
Jun 2007607
May 2007672
Apr 2007455
Mar 20071104
Feb 2007389
Jan 2007418
Dec 200692