harmony-alerts mailing list archives

Site index · List index
Message view « Date » · « Thread »
Top « Date » · « Thread »
From nom...@intel.com
Subject [build-test alert] BUILD FAILED Linux SUSE 9 64bit gcc debug: drlvm reg.test
Date Wed, 28 Feb 2007 16:36:47 GMT
BUILD FAILED:
	Ant Error Message:
/export/cruise/trunk/cc/projects/drlvm/trunk/build/make/build.xml:443: The following error
occurred while executing this line: /export/cruise/trunk/cc/projects/drlvm/trunk/build/make/targets/reg.test.xml:123:
The following error occurred while executing this line: /export/cruise/trunk/cc/projects/drlvm/trunk/build/make/targets/reg.test.xml:164:
gcc failed with return code 1

Date of build:	02/28/2007 22:36:32
Time to build:	7 seconds
Last changed:	02/28/2007 22:32:05
Last log entry:	Applied HARMONY-3261 [drlvm][test] Remove kernel test java/lang/ThreadRTest
from excluded lists



***********************************************************
Execution log (errors/warnings messages):	
/export/cruise/trunk/cc/projects/drlvm/trunk/src/test/regression/H2151/VMInit1.cpp:2:19: jvmti.h:
No such file or directory
/export/cruise/trunk/cc/projects/drlvm/trunk/src/test/regression/H2151/VMInit1.cpp:4: error:
syntax
   error before `(' token
/export/cruise/trunk/cc/projects/drlvm/trunk/src/test/regression/H2151/VMInit1.cpp:10: error:
syntax
   error before `=' token
/export/cruise/trunk/cc/projects/drlvm/trunk/src/test/regression/H2151/VMInit1.cpp:14: error:
syntax
   error before `->' token
/export/cruise/trunk/cc/projects/drlvm/trunk/src/test/regression/H2151/VMInit1.cpp:17: error:
syntax
   error before `Agent_OnLoad'
/export/cruise/trunk/cc/projects/drlvm/trunk/src/test/regression/H2151/VMInit1.cpp:24: error:
'
   jvmtiCapabilities' is used as a type, but is not defined as a type.
/export/cruise/trunk/cc/projects/drlvm/trunk/src/test/regression/H2151/VMInit1.cpp:25: error:
syntax
   error before `=' token
/export/cruise/trunk/cc/projects/drlvm/trunk/src/test/regression/H2151/VMInit1.cpp:30: error:
ISO
   C++ forbids declaration of `result' with no type
/export/cruise/trunk/cc/projects/drlvm/trunk/src/test/regression/H2151/VMInit1.cpp:30: error:
`
   jvmti_env' was not declared in this scope
/export/cruise/trunk/cc/projects/drlvm/trunk/src/test/regression/H2151/VMInit1.cpp:30: error:
`
   capabilities' was not declared in this scope
/export/cruise/trunk/cc/projects/drlvm/trunk/src/test/regression/H2151/VMInit1.cpp:31: error:
syntax
   error before `if'
/export/cruise/trunk/cc/projects/drlvm/trunk/src/test/regression/H2151/VMInit1.cpp:34: error:
'
   jvmtiEventCallbacks' is used as a type, but is not defined as a type.
/export/cruise/trunk/cc/projects/drlvm/trunk/src/test/regression/H2151/VMInit1.cpp:35: error:
`
   callbacks' was not declared in this scope
/export/cruise/trunk/cc/projects/drlvm/trunk/src/test/regression/H2151/VMInit1.cpp:35: error:
`
   jvmtiEventCallbacks' was not declared in this scope
/export/cruise/trunk/cc/projects/drlvm/trunk/src/test/regression/H2151/VMInit1.cpp:35: error:
ISO
   C++ forbids declaration of `memset' with no type
/export/cruise/trunk/cc/projects/drlvm/trunk/src/test/regression/H2151/VMInit1.cpp:35: error:
`
   int memset' redeclared as different kind of symbol
/usr/include/string.h:58: error: previous declaration of `void* memset(void*, 
   int, long unsigned int)'
/export/cruise/trunk/cc/projects/drlvm/trunk/src/test/regression/H2151/VMInit1.cpp:35: error:
initializer
   list being treated as compound expression
/export/cruise/trunk/cc/projects/drlvm/trunk/src/test/regression/H2151/VMInit1.cpp:36: error:
syntax
   error before `.' token
/export/cruise/trunk/cc/projects/drlvm/trunk/src/test/regression/H2151/VMInit1.cpp:39: error:
ISO
   C++ forbids declaration of `result' with no type
/export/cruise/trunk/cc/projects/drlvm/trunk/src/test/regression/H2151/VMInit1.cpp:39: error:
redefinition
   of `int result'
/export/cruise/trunk/cc/projects/drlvm/trunk/src/test/regression/H2151/VMInit1.cpp:30: error:
`
   int result' previously defined here
/export/cruise/trunk/cc/projects/drlvm/trunk/src/test/regression/H2151/VMInit1.cpp:39: error:
`
   jvmti_env' was not declared in this scope
/export/cruise/trunk/cc/projects/drlvm/trunk/src/test/regression/H2151/VMInit1.cpp:39: error:
`
   callbacks' was not declared in this scope
/export/cruise/trunk/cc/projects/drlvm/trunk/src/test/regression/H2151/VMInit1.cpp:39: error:
`
   jint' was not declared in this scope
/export/cruise/trunk/cc/projects/drlvm/trunk/src/test/regression/H2151/VMInit1.cpp:39: error:
syntax
   error before `sizeof'
/export/cruise/trunk/cc/projects/drlvm/trunk/src/test/regression/H2151/VMInit1.cpp:44: error:
ISO
   C++ forbids declaration of `result' with no type
/export/cruise/trunk/cc/projects/drlvm/trunk/src/test/regression/H2151/VMInit1.cpp:44: error:
redefinition
   of `int result'
/export/cruise/trunk/cc/projects/drlvm/trunk/src/test/regression/H2151/VMInit1.cpp:39: error:
`
   int result' previously defined here
/export/cruise/trunk/cc/projects/drlvm/trunk/src/test/regression/H2151/VMInit1.cpp:44: error:
`
   jvmti_env' was not declared in this scope
/export/cruise/trunk/cc/projects/drlvm/trunk/src/test/regression/H2151/VMInit1.cpp:44: error:
`
   JVMTI_ENABLE' was not declared in this scope
/export/cruise/trunk/cc/projects/drlvm/trunk/src/test/regression/H2151/VMInit1.cpp:44: error:
`
   JVMTI_EVENT_VM_INIT' was not declared in this scope
/export/cruise/trunk/cc/projects/drlvm/trunk/src/test/regression/H2151/VMInit1.cpp:45: error:
syntax
Configuration:
    classlib root = /export/cruise/trunk/cc/projects/classlib/trunk
               os = Linux
             arch = em64t
              cxx = gcc
              cfg = debug
       components = deploy
[parsing started /export/cruise/trunk/cc/projects/drlvm/trunk/src/test/regression/H0000/DirectByteBufferTest.java]
[parsing completed 32ms]
[parsing started /export/cruise/trunk/cc/projects/drlvm/trunk/src/test/regression/H1578/NaNTest.java]
[parsing completed 4ms]
[parsing started /export/cruise/trunk/cc/projects/drlvm/trunk/src/test/regression/H1694/H1694.java]
[parsing completed 7ms]
[parsing started /export/cruise/trunk/cc/projects/drlvm/trunk/src/test/regression/H1800/ExecTest.java]
[parsing completed 7ms]
[parsing started /export/cruise/trunk/cc/projects/drlvm/trunk/src/test/regression/H1802/UnresolvedHandlerTest.java]
[parsing completed 4ms]
[parsing started /export/cruise/trunk/cc/projects/drlvm/trunk/src/test/regression/H1802/UnresolvedParamTest.java]
[parsing completed 5ms]
[parsing started /export/cruise/trunk/cc/projects/drlvm/trunk/src/test/regression/H1857/Test.java]
[parsing completed 2ms]
[parsing started /export/cruise/trunk/cc/projects/drlvm/trunk/src/test/regression/H2083/Test.java]
[parsing completed 9ms]
[parsing started /export/cruise/trunk/cc/projects/drlvm/trunk/src/test/regression/H2103/Test.java]
[parsing completed 5ms]
[parsing started /export/cruise/trunk/cc/projects/drlvm/trunk/src/test/regression/H2151/VMInit1Test.java]
[parsing completed 7ms]
[parsing started /export/cruise/trunk/cc/projects/drlvm/trunk/src/test/regression/H2259/H2259.java]
[parsing completed 9ms]
[parsing started /export/cruise/trunk/cc/projects/drlvm/trunk/src/test/regression/H2261/RCETest.java]
[parsing completed 16ms]
[parsing started /export/cruise/trunk/cc/projects/drlvm/trunk/src/test/regression/H2335/SimplestLibraryPathTest.java]
[parsing completed 16ms]
[parsing started /export/cruise/trunk/cc/projects/drlvm/trunk/src/test/regression/H2808/finTest.java]
[parsing completed 5ms]
[parsing started /export/cruise/trunk/cc/projects/drlvm/trunk/src/test/regression/H2873/RemTest.java]
[parsing completed 9ms]
[parsing started /export/cruise/trunk/cc/projects/drlvm/trunk/src/test/regression/H2899/ManyArgsTest.java]
[parsing completed 21ms]
[parsing started /export/cruise/trunk/cc/projects/drlvm/trunk/src/test/regression/H2926/MyException.java]
[parsing completed 3ms]
[parsing started /export/cruise/trunk/cc/projects/drlvm/trunk/src/test/regression/H2926/Test.java]
[parsing completed 5ms]
[parsing started /export/cruise/trunk/cc/projects/drlvm/trunk/src/test/regression/H3027/AgentLibTest.java]
[parsing completed 43ms]
[parsing started /export/cruise/trunk/cc/projects/drlvm/trunk/src/test/regression/H3048/H3048.java]
[parsing completed 7ms]
[parsing started /export/cruise/trunk/cc/projects/drlvm/trunk/src/test/regression/H3067/Test.java]
[parsing completed 8ms]
[parsing started /export/cruise/trunk/cc/projects/drlvm/trunk/src/test/regression/H3074/AnotherClass.java]
[parsing completed 8ms]
[parsing started /export/cruise/trunk/cc/projects/drlvm/trunk/src/test/regression/H3074/Test.java]
[parsing completed 6ms]
[parsing started /export/cruise/trunk/cc/projects/drlvm/trunk/src/test/regression/H3121/H3121.java]
[parsing completed 6ms]
[parsing started /export/cruise/trunk/cc/projects/drlvm/trunk/src/test/regression/H3130/CallNativeTest.java]
[parsing completed 7ms]
[parsing started /export/cruise/trunk/cc/projects/drlvm/trunk/src/test/regression/H3150/Test.java]
[parsing completed 4ms]
[parsing started /export/cruise/trunk/cc/projects/drlvm/trunk/src/test/regression/H788/Test.java]
[parsing completed 6ms]
[search path for source files: [/export/cruise/trunk/cc/projects/drlvm/trunk/src/test/regression]]
[search path for class files: [/export/cruise/jdk1.5.0/jre/lib/rt.jar, /export/cruise/jdk1.5.0/jre/lib/jsse.jar,
/export/cruise/jdk1.5.0/jre/lib/jce.jar, /export/cruise/jdk1.5.0/jre/lib/charsets.jar, /export/cruise/jdk1.5.0/jre/lib/ext/dnsns.jar,
/export/cruise/jdk1.5.0/jre/lib/ext/sunjce_provider.jar, /export/cruise/jdk1.5.0/jre/lib/ext/localedata.jar,
/export/cruise/trunk/cc/projects/drlvm/trunk/build/lnx_em64t_gcc_debug/semis/reg.tests/classes,
/export/cruise/trunk/cc/lib/ant-launcher.jar, /export/cruise/jdk1.5.0/lib/tools.jar, /export/cruise/trunk/cc/lib/cruisecontrol.jar,
/export/cruise/trunk/cc/lib/../lib/activation.jar, /export/cruise/trunk/cc/lib/../lib/comm.jar,
/export/cruise/trunk/cc/lib/../lib/commons-net-1.1.0.jar, /export/cruise/trunk/cc/lib/../lib/fast-md5.jar,
/export/cruise/trunk/cc/lib/../lib/jakarta-oro-2.0.3.jar, /export/cruise/trunk/cc/lib/../lib/jdom.jar,
/export/cruise/trunk/cc/lib/../lib/log4j.jar, /export/cruise/trunk/cc/lib/../lib/mail.jar,
/export/!
 cruise/trunk/cc/lib/../lib/mx4j-tools.jar, /export/cruise/trunk/cc/lib/../lib/mx4j-remote.jar,
/export/cruise/trunk/cc/lib/../lib/mx4j.jar, /export/cruise/trunk/cc/lib/../lib/smack.jar,
/export/cruise/trunk/cc/lib/../lib/x10.jar, /export/cruise/trunk/cc/lib/../lib/xmlrpc-2.0.1.jar,
/export/cruise/trunk/cc/lib/log4j.jar, /export/cruise/trunk/cc/lib/jdom.jar, /export/cruise/trunk/cc/lib/ant.jar,
/export/apache-ant-1.6.5/lib/ant-apache-regexp.jar, /export/apache-ant-1.6.5/lib/ecj_3.2.jar,
/export/apache-ant-1.6.5/lib/ant-nodeps.jar, /export/apache-ant-1.6.5/lib/ant-xslp.jar, /export/apache-ant-1.6.5/lib/ant-trax.jar,
/export/cruise/trunk/cc/projects/drlvm/trunk/build/make/tmp/ant-contrib.jar, /export/cruise/trunk/cc/projects/drlvm/trunk/build/make/tmp/cpptasks.jar,
/export/cruise/trunk/cc/lib/jasper-compiler.jar, /export/cruise/trunk/cc/lib/jasper-runtime.jar,
/export/cruise/trunk/cc/lib/xercesImpl-2.8.0.jar, /export/cruise/trunk/cc/lib/xml-apis-2.8.0.jar,
/export/cruise/trunk!
 /cc/lib/xmlrpc-2.0.1.jar, /export/cruise/trunk/cc/lib/xalan-2.7.0.jar,
 /export/cruise/trunk/cc/lib/serializer-2.7.0.jar, /export/cruise/trunk/cc/lib/jakarta-oro-2.0.3.jar,
/export/cruise/trunk/cc/lib/mail.jar, /export/cruise/trunk/cc/lib/junit.jar, /export/cruise/trunk/cc/lib/activation.jar,
/export/cruise/trunk/cc/lib/commons-net-1.1.0.jar, /export/cruise/trunk/cc/lib/mx4j.jar, /export/cruise/trunk/cc/lib/mx4j-tools.jar,
/export/cruise/trunk/cc/lib/mx4j-remote.jar, /export/cruise/trunk/cc/lib/smack.jar, /export/cruise/trunk/cc/lib/comm.jar,
/export/cruise/trunk/cc/lib/x10.jar, /export/cruise/trunk/cc/lib/fast-md5.jar, /export/cruise/trunk/cc/lib/maven-embedder-2.0.3-dep.jar,
/export/cruise/trunk/cc/lib/javax.servlet.jar, /export/cruise/trunk/cc/lib/org.mortbay.jetty.jar,
/export/cruise/trunk/cc/lib/commons-logging.jar, /export/cruise/trunk/cc/lib/commons-el.jar,
/export/cruise/trunk/cc/projects/drlvm/trunk/build/make, /export/cruise/trunk/cc/lib/emma_ant.jar,
/export/cruise/trunk/cc/lib/emma.jar, /export/cruise/trunk/cc/lib/jaxen-1.1-beta-8.j!
 ar, /export/cruise/trunk/cc/lib/smackx.jar, /export/cruise/trunk/cc/lib/checkstyle-all-3.1.jar,
/export/cruise/trunk/cc/lib/ant-junit-1.6.5.jar]]
[loading /export/cruise/trunk/cc/lib/junit.jar(junit/framework/TestCase.class)]
[loading /export/cruise/trunk/cc/lib/junit.jar(junit/framework/Test.class)]
[loading /export/cruise/jdk1.5.0/jre/lib/rt.jar(java/lang/Object.class)]
[loading /export/cruise/trunk/cc/lib/junit.jar(junit/framework/Assert.class)]
[loading /export/cruise/jdk1.5.0/jre/lib/rt.jar(java/lang/String.class)]
[loading /export/cruise/jdk1.5.0/jre/lib/rt.jar(java/lang/Exception.class)]
[loading /export/cruise/jdk1.5.0/jre/lib/rt.jar(java/lang/Throwable.class)]
[loading /export/cruise/jdk1.5.0/jre/lib/rt.jar(java/io/Serializable.class)]
[loading /export/cruise/jdk1.5.0/jre/lib/rt.jar(java/lang/Thread.class)]
[loading /export/cruise/jdk1.5.0/jre/lib/rt.jar(java/lang/Runnable.class)]
[loading /export/cruise/jdk1.5.0/jre/lib/rt.jar(java/lang/reflect/InvocationHandler.class)]
[loading /export/cruise/jdk1.5.0/jre/lib/rt.jar(java/lang/reflect/Method.class)]
[loading /export/cruise/jdk1.5.0/jre/lib/rt.jar(java/lang/reflect/Proxy.class)]
[loading /export/cruise/jdk1.5.0/jre/lib/rt.jar(java/lang/reflect/UndeclaredThrowableException.class)]
[loading /export/cruise/jdk1.5.0/jre/lib/rt.jar(java/lang/ClassLoader.class)]
[loading /export/cruise/jdk1.5.0/jre/lib/rt.jar(java/lang/Class.class)]
[loading /export/cruise/jdk1.5.0/jre/lib/rt.jar(java/lang/ClassNotFoundException.class)]
[checking org.apache.harmony.drlvm.tests.regression.h0000.DirectByteBufferTest]
[loading /export/cruise/jdk1.5.0/jre/lib/rt.jar(java/lang/System.class)]
[wrote /export/cruise/trunk/cc/projects/drlvm/trunk/build/lnx_em64t_gcc_debug/semis/reg.tests/classes/org/apache/harmony/drlvm/tests/regression/h0000/DirectByteBufferTest.class]
[checking org.apache.harmony.drlvm.tests.regression.H1578.NaNTest]
[loading /export/cruise/trunk/cc/projects/drlvm/trunk/build/lnx_em64t_gcc_debug/semis/reg.tests/classes/org/apache/harmony/drlvm/tests/regression/H1578/dcmp1.class]
[loading /export/cruise/trunk/cc/projects/drlvm/trunk/build/lnx_em64t_gcc_debug/semis/reg.tests/classes/org/apache/harmony/drlvm/tests/regression/H1578/fcmp1.class]
[loading /export/cruise/jdk1.5.0/jre/lib/rt.jar(java/lang/Float.class)]
[loading /export/cruise/jdk1.5.0/jre/lib/rt.jar(java/lang/Number.class)]
[loading /export/cruise/jdk1.5.0/jre/lib/rt.jar(java/lang/Double.class)]
[wrote /export/cruise/trunk/cc/projects/drlvm/trunk/build/lnx_em64t_gcc_debug/semis/reg.tests/classes/org/apache/harmony/drlvm/tests/regression/H1578/NaNTest.class]
[checking org.apache.harmony.drlvm.tests.regression.h1694.H1694]
[loading /export/cruise/jdk1.5.0/jre/lib/rt.jar(java/io/PrintStream.class)]
[loading /export/cruise/jdk1.5.0/jre/lib/rt.jar(java/io/FilterOutputStream.class)]
[loading /export/cruise/jdk1.5.0/jre/lib/rt.jar(java/io/OutputStream.class)]
[loading /export/cruise/jdk1.5.0/jre/lib/rt.jar(java/lang/OutOfMemoryError.class)]
[loading /export/cruise/jdk1.5.0/jre/lib/rt.jar(java/lang/VirtualMachineError.class)]
[loading /export/cruise/jdk1.5.0/jre/lib/rt.jar(java/lang/Error.class)]
[wrote /export/cruise/trunk/cc/projects/drlvm/trunk/build/lnx_em64t_gcc_debug/semis/reg.tests/classes/org/apache/harmony/drlvm/tests/regression/h1694/H1694.class]
[checking org.apache.harmony.drlvm.tests.regression.h1694.StressTest01Object1]
[wrote /export/cruise/trunk/cc/projects/drlvm/trunk/build/lnx_em64t_gcc_debug/semis/reg.tests/classes/org/apache/harmony/drlvm/tests/regression/h1694/StressTest01Object1.class]
[checking org.apache.harmony.drlvm.tests.regression.h1800.ExecTest]
[loading /export/cruise/jdk1.5.0/jre/lib/rt.jar(java/io/File.class)]
[loading /export/cruise/jdk1.5.0/jre/lib/rt.jar(java/lang/Process.class)]
[loading /export/cruise/jdk1.5.0/jre/lib/rt.jar(java/lang/Runtime.class)]
[loading /export/cruise/jdk1.5.0/jre/lib/rt.jar(java/io/InputStream.class)]
[loading /export/cruise/jdk1.5.0/jre/lib/rt.jar(java/io/Closeable.class)]
[loading /export/cruise/jdk1.5.0/jre/lib/rt.jar(java/lang/StringBuilder.class)]
[loading /export/cruise/jdk1.5.0/jre/lib/rt.jar(java/lang/StringBuffer.class)]
[loading /export/cruise/jdk1.5.0/jre/lib/rt.jar(java/lang/NullPointerException.class)]
[loading /export/cruise/jdk1.5.0/jre/lib/rt.jar(java/lang/RuntimeException.class)]
[loading /export/cruise/jdk1.5.0/jre/lib/rt.jar(java/io/IOException.class)]
[loading /export/cruise/jdk1.5.0/jre/lib/rt.jar(java/lang/InterruptedException.class)]
[loading /export/cruise/jdk1.5.0/jre/lib/rt.jar(java/lang/AbstractStringBuilder.class)]
[loading /export/cruise/jdk1.5.0/jre/lib/rt.jar(java/lang/CharSequence.class)]
[loading /export/cruise/jdk1.5.0/jre/lib/rt.jar(java/lang/Comparable.class)]
[wrote /export/cruise/trunk/cc/projects/drlvm/trunk/build/lnx_em64t_gcc_debug/semis/reg.tests/classes/org/apache/harmony/drlvm/tests/regression/h1800/ExecTest.class]
[checking org.apache.harmony.drlvm.tests.regression.h1802.UnresolvedHandlerTest]
[loading /export/cruise/jdk1.5.0/jre/lib/rt.jar(java/lang/NoClassDefFoundError.class)]
[loading /export/cruise/jdk1.5.0/jre/lib/rt.jar(java/lang/LinkageError.class)]
[wrote /export/cruise/trunk/cc/projects/drlvm/trunk/build/lnx_em64t_gcc_debug/semis/reg.tests/classes/org/apache/harmony/drlvm/tests/regression/h1802/UnresolvedHandlerTest$X.class]
[wrote /export/cruise/trunk/cc/projects/drlvm/trunk/build/lnx_em64t_gcc_debug/semis/reg.tests/classes/org/apache/harmony/drlvm/tests/regression/h1802/UnresolvedHandlerTest.class]
[checking org.apache.harmony.drlvm.tests.regression.h1802.MissedThrowable]
[wrote /export/cruise/trunk/cc/projects/drlvm/trunk/build/lnx_em64t_gcc_debug/semis/reg.tests/classes/org/apache/harmony/drlvm/tests/regression/h1802/MissedThrowable.class]
[checking org.apache.harmony.drlvm.tests.regression.h1802.UnresolvedParamTest]
[wrote /export/cruise/trunk/cc/projects/drlvm/trunk/build/lnx_em64t_gcc_debug/semis/reg.tests/classes/org/apache/harmony/drlvm/tests/regression/h1802/UnresolvedParamTest$X.class]
[wrote /export/cruise/trunk/cc/projects/drlvm/trunk/build/lnx_em64t_gcc_debug/semis/reg.tests/classes/org/apache/harmony/drlvm/tests/regression/h1802/UnresolvedParamTest.class]
[checking org.apache.harmony.drlvm.tests.regression.h1802.Missed]
[wrote /export/cruise/trunk/cc/projects/drlvm/trunk/build/lnx_em64t_gcc_debug/semis/reg.tests/classes/org/apache/harmony/drlvm/tests/regression/h1802/Missed.class]
[checking org.apache.harmony.drlvm.tests.regression.h1857.Test]
[wrote /export/cruise/trunk/cc/projects/drlvm/trunk/build/lnx_em64t_gcc_debug/semis/reg.tests/classes/org/apache/harmony/drlvm/tests/regression/h1857/Test.class]
[checking org.apache.harmony.drlvm.tests.regression.h1857.MissedThrowable]
[wrote /export/cruise/trunk/cc/projects/drlvm/trunk/build/lnx_em64t_gcc_debug/semis/reg.tests/classes/org/apache/harmony/drlvm/tests/regression/h1857/MissedThrowable.class]
[checking org.apache.harmony.drlvm.tests.regression.h1857.TestClass]
[wrote /export/cruise/trunk/cc/projects/drlvm/trunk/build/lnx_em64t_gcc_debug/semis/reg.tests/classes/org/apache/harmony/drlvm/tests/regression/h1857/TestClass.class]
[checking org.apache.harmony.drlvm.tests.regression.h2083.Test]
[wrote /export/cruise/trunk/cc/projects/drlvm/trunk/build/lnx_em64t_gcc_debug/semis/reg.tests/classes/org/apache/harmony/drlvm/tests/regression/h2083/Test.class]
[checking org.apache.harmony.drlvm.tests.regression.h2083.TestThread]
[wrote /export/cruise/trunk/cc/projects/drlvm/trunk/build/lnx_em64t_gcc_debug/semis/reg.tests/classes/org/apache/harmony/drlvm/tests/regression/h2083/TestThread.class]
[checking org.apache.harmony.drlvm.tests.regression.h2083.Missed]
[wrote /export/cruise/trunk/cc/projects/drlvm/trunk/build/lnx_em64t_gcc_debug/semis/reg.tests/classes/org/apache/harmony/drlvm/tests/regression/h2083/Missed.class]
[checking org.apache.harmony.drlvm.tests.regression.h2103.Test]
[loading /export/cruise/trunk/cc/projects/drlvm/trunk/build/lnx_em64t_gcc_debug/semis/reg.tests/classes/org/apache/harmony/drlvm/tests/regression/h2103/SupClass.class]
[loading /export/cruise/jdk1.5.0/jre/lib/rt.jar(java/lang/VerifyError.class)]
[wrote /export/cruise/trunk/cc/projects/drlvm/trunk/build/lnx_em64t_gcc_debug/semis/reg.tests/classes/org/apache/harmony/drlvm/tests/regression/h2103/Test.class]
[checking org.apache.harmony.drlvm.tests.regression.h2151.VMInit1Test]
[wrote /export/cruise/trunk/cc/projects/drlvm/trunk/build/lnx_em64t_gcc_debug/semis/reg.tests/classes/org/apache/harmony/drlvm/tests/regression/h2151/VMInit1Test.class]
[checking org.apache.harmony.drlvm.tests.regression.h2151.Status]
[wrote /export/cruise/trunk/cc/projects/drlvm/trunk/build/lnx_em64t_gcc_debug/semis/reg.tests/classes/org/apache/harmony/drlvm/tests/regression/h2151/Status.class]
[checking org.apache.harmony.drlvm.tests.regression.h2259.I1]
[wrote /export/cruise/trunk/cc/projects/drlvm/trunk/build/lnx_em64t_gcc_debug/semis/reg.tests/classes/org/apache/harmony/drlvm/tests/regression/h2259/I1.class]
[checking org.apache.harmony.drlvm.tests.regression.h2259.ParentException]
[wrote /export/cruise/trunk/cc/projects/drlvm/trunk/build/lnx_em64t_gcc_debug/semis/reg.tests/classes/org/apache/harmony/drlvm/tests/regression/h2259/ParentException.class]
[checking org.apache.harmony.drlvm.tests.regression.h2259.I2]
[wrote /export/cruise/trunk/cc/projects/drlvm/trunk/build/lnx_em64t_gcc_debug/semis/reg.tests/classes/org/apache/harmony/drlvm/tests/regression/h2259/I2.class]
[checking org.apache.harmony.drlvm.tests.regression.h2259.SubException]
[wrote /export/cruise/trunk/cc/projects/drlvm/trunk/build/lnx_em64t_gcc_debug/semis/reg.tests/classes/org/apache/harmony/drlvm/tests/regression/h2259/SubException.class]
[checking org.apache.harmony.drlvm.tests.regression.h2259.H2259]
[loading /export/cruise/jdk1.5.0/jre/lib/rt.jar(java/lang/ArrayStoreException.class)]
[loading /export/cruise/jdk1.5.0/jre/lib/rt.jar(java/lang/IllegalArgumentException.class)]
[wrote /export/cruise/trunk/cc/projects/drlvm/trunk/build/lnx_em64t_gcc_debug/semis/reg.tests/classes/org/apache/harmony/drlvm/tests/regression/h2259/H2259$1.class]
[wrote /export/cruise/trunk/cc/projects/drlvm/trunk/build/lnx_em64t_gcc_debug/semis/reg.tests/classes/org/apache/harmony/drlvm/tests/regression/h2259/H2259.class]
[checking org.apache.harmony.drlvm.tests.regression.h2261.RCETest]
[loading /export/cruise/jdk1.5.0/jre/lib/rt.jar(java/lang/Integer.class)]
[loading /export/cruise/jdk1.5.0/jre/lib/rt.jar(java/lang/Math.class)]
[wrote /export/cruise/trunk/cc/projects/drlvm/trunk/build/lnx_em64t_gcc_debug/semis/reg.tests/classes/org/apache/harmony/drlvm/tests/regression/h2261/RCETest.class]
[checking org.apache.harmony.drlvm.tests.regression.h2335.SimplestLibraryPathTest]
[wrote /export/cruise/trunk/cc/projects/drlvm/trunk/build/lnx_em64t_gcc_debug/semis/reg.tests/classes/org/apache/harmony/drlvm/tests/regression/h2335/SimplestLibraryPathTest.class]
[checking org.apache.harmony.drlvm.tests.regression.h2808.finTest]
[loading /export/cruise/trunk/cc/projects/drlvm/trunk/build/lnx_em64t_gcc_debug/semis/reg.tests/classes/org/apache/harmony/drlvm/tests/regression/h2808/finTest1.class]
[wrote /export/cruise/trunk/cc/projects/drlvm/trunk/build/lnx_em64t_gcc_debug/semis/reg.tests/classes/org/apache/harmony/drlvm/tests/regression/h2808/finTest.class]
[checking org.apache.harmony.drlvm.tests.regression.H2873.RemTest]
[loading /export/cruise/jdk1.5.0/jre/lib/rt.jar(java/lang/Byte.class)]
[loading /export/cruise/jdk1.5.0/jre/lib/rt.jar(java/lang/Character.class)]
[loading /export/cruise/jdk1.5.0/jre/lib/rt.jar(java/lang/Short.class)]
[loading /export/cruise/jdk1.5.0/jre/lib/rt.jar(java/lang/Long.class)]
[loading /export/cruise/jdk1.5.0/jre/lib/rt.jar(java/lang/Boolean.class)]
[loading /export/cruise/jdk1.5.0/jre/lib/rt.jar(java/lang/Void.class)]
[wrote /export/cruise/trunk/cc/projects/drlvm/trunk/build/lnx_em64t_gcc_debug/semis/reg.tests/classes/org/apache/harmony/drlvm/tests/regression/H2873/RemTest.class]
[checking org.apache.harmony.drlvm.tests.regression.h2899.ManyArgsTest]
[wrote /export/cruise/trunk/cc/projects/drlvm/trunk/build/lnx_em64t_gcc_debug/semis/reg.tests/classes/org/apache/harmony/drlvm/tests/regression/h2899/ManyArgsTest.class]
[checking org.apache.harmony.drlvm.tests.regression.h2926.MyException]
[wrote /export/cruise/trunk/cc/projects/drlvm/trunk/build/lnx_em64t_gcc_debug/semis/reg.tests/classes/org/apache/harmony/drlvm/tests/regression/h2926/MyException.class]
[checking org.apache.harmony.drlvm.tests.regression.h2926.Test]
[loading /export/cruise/trunk/cc/projects/drlvm/trunk/build/lnx_em64t_gcc_debug/semis/reg.tests/classes/org/apache/harmony/drlvm/tests/regression/h2926/TestClass.class]
[wrote /export/cruise/trunk/cc/projects/drlvm/trunk/build/lnx_em64t_gcc_debug/semis/reg.tests/classes/org/apache/harmony/drlvm/tests/regression/h2926/Test.class]
[checking org.apache.harmony.drlvm.tests.regression.h2926.Status]
[wrote /export/cruise/trunk/cc/projects/drlvm/trunk/build/lnx_em64t_gcc_debug/semis/reg.tests/classes/org/apache/harmony/drlvm/tests/regression/h2926/Status.class]
[checking org.apache.harmony.drlvm.tests.regression.h3027.AgentLibTest]
[wrote /export/cruise/trunk/cc/projects/drlvm/trunk/build/lnx_em64t_gcc_debug/semis/reg.tests/classes/org/apache/harmony/drlvm/tests/regression/h3027/AgentLibTest.class]
[checking org.apache.harmony.drlvm.tests.regression.h3027.Status]
[wrote /export/cruise/trunk/cc/projects/drlvm/trunk/build/lnx_em64t_gcc_debug/semis/reg.tests/classes/org/apache/harmony/drlvm/tests/regression/h3027/Status.class]
[checking org.apache.harmony.drlvm.tests.regression.h3048.H3048]
[wrote /export/cruise/trunk/cc/projects/drlvm/trunk/build/lnx_em64t_gcc_debug/semis/reg.tests/classes/org/apache/harmony/drlvm/tests/regression/h3048/H3048.class]
[checking org.apache.harmony.drlvm.tests.regression.h3048.MyTest]
[wrote /export/cruise/trunk/cc/projects/drlvm/trunk/build/lnx_em64t_gcc_debug/semis/reg.tests/classes/org/apache/harmony/drlvm/tests/regression/h3048/MyTest.class]
[checking org.apache.harmony.drlvm.tests.regression.h3048.MyTestSuper]
[wrote /export/cruise/trunk/cc/projects/drlvm/trunk/build/lnx_em64t_gcc_debug/semis/reg.tests/classes/org/apache/harmony/drlvm/tests/regression/h3048/MyTestSuper.class]
[checking org.apache.harmony.drlvm.tests.regression.h3048.MyException]
[wrote /export/cruise/trunk/cc/projects/drlvm/trunk/build/lnx_em64t_gcc_debug/semis/reg.tests/classes/org/apache/harmony/drlvm/tests/regression/h3048/MyException.class]
[checking org.apache.harmony.drlvm.tests.regression.h3067.Test]
[loading /export/cruise/jdk1.5.0/jre/lib/rt.jar(java/lang/Package.class)]
[loading /export/cruise/jdk1.5.0/jre/lib/rt.jar(java/nio/ByteBuffer.class)]
[loading /export/cruise/jdk1.5.0/jre/lib/rt.jar(java/lang/ClassFormatError.class)]
[loading /export/cruise/jdk1.5.0/jre/lib/rt.jar(java/lang/InstantiationException.class)]
[loading /export/cruise/jdk1.5.0/jre/lib/rt.jar(java/lang/IllegalAccessException.class)]
[wrote /export/cruise/trunk/cc/projects/drlvm/trunk/build/lnx_em64t_gcc_debug/semis/reg.tests/classes/org/apache/harmony/drlvm/tests/regression/h3067/Test$Loader.class]
[wrote /export/cruise/trunk/cc/projects/drlvm/trunk/build/lnx_em64t_gcc_debug/semis/reg.tests/classes/org/apache/harmony/drlvm/tests/regression/h3067/Test.class]
[checking org.apache.harmony.drlvm.tests.regression.h3074.AnotherClass]
[wrote /export/cruise/trunk/cc/projects/drlvm/trunk/build/lnx_em64t_gcc_debug/semis/reg.tests/classes/org/apache/harmony/drlvm/tests/regression/h3074/AnotherClass.class]
[checking org.apache.harmony.drlvm.tests.regression.h3074.Test]
[wrote /export/cruise/trunk/cc/projects/drlvm/trunk/build/lnx_em64t_gcc_debug/semis/reg.tests/classes/org/apache/harmony/drlvm/tests/regression/h3074/Test.class]
[checking org.apache.harmony.drlvm.tests.regression.h3121.H3121]
[wrote /export/cruise/trunk/cc/projects/drlvm/trunk/build/lnx_em64t_gcc_debug/semis/reg.tests/classes/org/apache/harmony/drlvm/tests/regression/h3121/H3121.class]
[checking org.apache.harmony.drlvm.tests.regression.h3121.Intf]
[wrote /export/cruise/trunk/cc/projects/drlvm/trunk/build/lnx_em64t_gcc_debug/semis/reg.tests/classes/org/apache/harmony/drlvm/tests/regression/h3121/Intf.class]
[checking org.apache.harmony.drlvm.tests.regression.h3121.IntfClass]
[wrote /export/cruise/trunk/cc/projects/drlvm/trunk/build/lnx_em64t_gcc_debug/semis/reg.tests/classes/org/apache/harmony/drlvm/tests/regression/h3121/IntfClass.class]
[checking org.apache.harmony.drlvm.tests.regression.h3130.CallNativeTest]
[wrote /export/cruise/trunk/cc/projects/drlvm/trunk/build/lnx_em64t_gcc_debug/semis/reg.tests/classes/org/apache/harmony/drlvm/tests/regression/h3130/CallNativeTest.class]
[checking org.apache.harmony.drlvm.tests.regression.h3150.Test]
[wrote /export/cruise/trunk/cc/projects/drlvm/trunk/build/lnx_em64t_gcc_debug/semis/reg.tests/classes/org/apache/harmony/drlvm/tests/regression/h3150/Test.class]
[checking org.apache.harmony.drlvm.tests.regression.h3150.classToDelete]
[wrote /export/cruise/trunk/cc/projects/drlvm/trunk/build/lnx_em64t_gcc_debug/semis/reg.tests/classes/org/apache/harmony/drlvm/tests/regression/h3150/classToDelete.class]
[checking org.apache.harmony.drlvm.tests.regression.h788.Test]
[wrote /export/cruise/trunk/cc/projects/drlvm/trunk/build/lnx_em64t_gcc_debug/semis/reg.tests/classes/org/apache/harmony/drlvm/tests/regression/h788/Test.class]
[total 1850ms]
## Compiling reg native ${outname}
## Compiling reg native ${outname}

***********************************************************
Unit Tests: (0)
        
No Tests Run: This project doesn't have any tests or tests were not run

***********************************************************
Modifications since last successful build:	(5)
            
modified gshimansky  /harmony/enhanced/drlvm/trunk/build/make/excludes/exclude.drlvm_kernel.linux.x86_64.int
02/28/2007 22:32:05 Applied HARMONY-3261 [drlvm][test] Remove kernel test java/lang/ThreadRTest
from excluded lists
modified gshimansky  /harmony/enhanced/drlvm/trunk/build/make/excludes/exclude.drlvm_kernel.windows.x86.int
02/28/2007 22:32:05 Applied HARMONY-3261 [drlvm][test] Remove kernel test java/lang/ThreadRTest
from excluded lists
modified gshimansky  /harmony/enhanced/drlvm/trunk/build/make/excludes/exclude.drlvm_kernel.linux.x86.int
02/28/2007 22:32:05 Applied HARMONY-3261 [drlvm][test] Remove kernel test java/lang/ThreadRTest
from excluded lists
modified gshimansky  /harmony/enhanced/drlvm/trunk/build/build.bat 02/28/2007 21:30:41 Applied
HARMONY-3255 [drlvm][winx64][build] COMPILER_CFG_SCRIPT must be set automaticallyBuild seems
to work ok on both x86 and x86_64 windows platforms
modified gshimansky  /harmony/enhanced/drlvm/trunk/vm/vmcore/src/util/linux/signals_ipf.cpp
02/28/2007 21:27:14 Make asm_jvmti_exception_catch_callback to be extern "C" on IPF

Mime
View raw message