harmony-alerts mailing list archives

Site index · List index
Message view « Date » · « Thread »
Top « Date » · « Thread »
From nom...@intel.com
Subject [build-test alert] BUILD FAILED Linux SUSE 9 64bit gcc debug: classlib over drlvm
Date Tue, 27 Feb 2007 14:51:53 GMT
BUILD FAILED:
	Ant Error Message:
/export/cruise/trunk/cc/projects/classlib/trunk/build.xml:167: The following error occurred
while executing this line: /export/cruise/trunk/cc/projects/classlib/trunk/make/build-test.xml:52:
The following error occurred while executing this line: /export/cruise/trunk/cc/projects/classlib/trunk/make/properties.xml:354:
The following error occurred while executing this line: /export/cruise/trunk/cc/projects/classlib/trunk/modules/jndi/build.xml:133:
Compile failed; see the compiler error output for details.

Date of build:	02/27/2007 20:47:46
Time to build:	3 minutes 50 seconds
Last changed:	02/27/2007 20:29:40
Last log entry:	Applied HARMONY-3248 [drlvm][classloader] Unexpected assertion failed in case
of class format error in LVT

Tests passed on win32. Attached test doesn't crash VM any more.



***********************************************************
Execution log (errors/warnings messages):	

========================================
Testing class libraries...
========================================
Checking for depends/jars/yoko_M2-20070130/yoko.jar
Checking for depends/jars/yoko_M2-20070130/yoko-core.jar
Checking for depends/jars/yoko_M2-20070130/yoko-rmi-impl.jar
Checking for depends/jars/yoko_M2-20070130/yoko-rmi-spec.jar
Checking for depends/jars/bcel-5.2/bcel-5.2.jar
Checking for depends/jars/xalan-j_2.7.0/xalan.jar
Checking for depends/jars/xerces_2.8.0/resolver.jar
Checking for depends/jars/xerces_2.8.0/xercesImpl.jar
Checking for depends/jars/xerces_2.8.0/xml-apis.jar
Checking for depends/jars/junit_3.8.2/junit.jar
Checking for depends/jars/bcprov-jdk15-134/bcprov.jar
Checking for depends/jars/icu4j_3.4.4/icu4j_3_4_4.jar
Checking for depends/jars/mx4j_3.0.2/mx4j.zip
Checking for depends/jars/ecj_3.2/ecj_3.2.jar
Checking for depends/jars/jetty/jetty-6.0.0.jar
Checking for depends/jars/jetty/jetty-util-6.0.0.jar
Checking for depends/jars/jetty/servlet-api-2.5-6.0.0.jar
Checking for depends/libs/build/lcms/icc34.h
Checking for depends/libs/build/lcms/lcms.h
Checking for depends/libs/build/png/pngconf.h
Checking for depends/libs/build/png/png.h
Checking for depends/libs/build/jpeg/jconfig.lnx
Checking for depends/libs/build/jpeg/jpeglib.h
Checking for depends/libs/build/jpeg/jmorecfg.h
Checking for depends/libs/build/jpeg/jerror.h
Checking for depends/libs/build/lcms/liblcms.linux.x86_64
Checking for depends/libs/build/png/libpng.linux.x86_64
Checking for depends/libs/build/jpeg/libjpeg.linux.x86_64
Since fork is false, ignoring memoryMaximumSize setting
Compiling ACCESSIBILITY classes
Compiling ACCESSIBILITY tests
Since fork is false, ignoring memoryMaximumSize setting
Compiling ANNOTATION classes
Compiling ANNOTATION tests
Since fork is false, ignoring memoryMaximumSize setting
Compiling APPLET classes
Compiling APPLET tests
Since fork is false, ignoring memoryMaximumSize setting
Compiling ARCHIVE classes
Compiling ARCHIVE tests
Since fork is false, ignoring memoryMaximumSize setting
Compiling AUTH classes
Compiling AUTH tests
Since fork is false, ignoring memoryMaximumSize setting
Compiling AWT classes
Compiling AWT tests
Since fork is false, ignoring memoryMaximumSize setting
java.lang.RuntimeException: expected from EDT
	at java.awt.EventDispatchThreadRTest$1.run(EventDispatchThreadRTest.java:29)
	at java.awt.event.InvocationEvent.runAndNotify(InvocationEvent.java:98)
	at java.awt.event.InvocationEvent.dispatch(InvocationEvent.java:77)
	at java.awt.EventQueueCore.dispatchEventImpl(EventQueueCore.java:140)
	at java.awt.EventQueue.dispatchEvent(EventQueue.java:144)
	at java.awt.EventDispatchThread.runModalLoop(EventDispatchThread.java:73)
	at java.awt.EventDispatchThread.run(EventDispatchThread.java:45)
Compiling BEANS classes
Compiling support classes for BEANS tests
Compiling internal BEANS tests
Compiling BEANS tests
Since fork is false, ignoring memoryMaximumSize setting
Running internal BEANS tests
Running BEANS tests
Compiling CRYPTO classes
Compiling CRYPTO test support files
Since fork is false, ignoring memoryMaximumSize setting
Compiling CRYPTO api tests
Since fork is false, ignoring memoryMaximumSize setting
Compiling CRYPTO api injected tests
Since fork is false, ignoring memoryMaximumSize setting
Compiling CRYPTO impl injected tests
Since fork is false, ignoring memoryMaximumSize setting
Compiling CRYPTO impl tests
Since fork is false, ignoring memoryMaximumSize setting
Running CRYPTO api tests
Running CRYPTO api.injected tests
Running CRYPTO impl tests
Running CRYPTO impl injected tests
Compiling ImageIO classes
Compiling ImageIO tests
Compiling INSTRUMENT classes
Compiling INSTRUMENT tests
Since fork is false, ignoring memoryMaximumSize setting
Compiling JNDI classes
Compiling JNDI tests
Since fork is false, ignoring memoryMaximumSize setting
----------
1. ERROR in /export/cruise/trunk/cc/projects/classlib/trunk/modules/jndi/src/test/java/org/apache/harmony/jndi/tests/javax/naming/ldap/AllTestLdap.java
 (at line 49)
	suite.addTest(new TestSuite(TestBasicControl.class));
	                            ^^^^^^^^^^^^^^^^
TestBasicControl cannot be resolved to a type
----------
1 problem (1 error)

***********************************************************
Unit Tests: (3561)
        

***********************************************************
Modifications since last successful build:	(8)
            
modified gshimansky  /harmony/enhanced/drlvm/trunk/vm/vmcore/src/class_support/Class_File_Loader.cpp
02/27/2007 20:29:40 Applied HARMONY-3248 [drlvm][classloader] Unexpected assertion failed
in case of class format error in LVTTests passed on win32. Attached test doesn't crash VM
any more.
modified gshimansky  /harmony/enhanced/drlvm/trunk/vm/interpreter/src/interp_native_em64t.cpp
02/27/2007 20:26:20 Applied HARMONY-3249 and HARMONY-3250 - fixes for interpreter native callingconventions
on windows x86_64Tests passes on SuSE9 x86_64
modified ayza  /harmony/enhanced/classlib/trunk/modules/luni/src/test/java/tests/api/java/net/DatagramPacketTest.java
02/27/2007 20:04:04 Applying patch from HARMONY-3046 ([classli][luni] intermittent failures
of tests.api.java.net.DatagramSocketTest)
modified ayza  /harmony/enhanced/classlib/trunk/modules/luni/src/test/java/tests/api/java/net/DatagramSocketTest.java
02/27/2007 20:04:04 Applying patch from HARMONY-3046 ([classli][luni] intermittent failures
of tests.api.java.net.DatagramSocketTest)
modified ayza  /harmony/enhanced/classlib/trunk/modules/luni/src/test/java/tests/api/java/net/MulticastSocketTest.java
02/27/2007 20:04:04 Applying patch from HARMONY-3046 ([classli][luni] intermittent failures
of tests.api.java.net.DatagramSocketTest)
add cc-drlvm log20070227193119Lbuild.334 02/27/2007 19:31:19drlvm
add cc-classlib log20070227191807Lbuild.275 02/27/2007 19:18:07classlib
modified gshimansky  /harmony/enhanced/drlvm/trunk/vm/vmcore/src/init/vm_init.cpp 02/27/2007
18:52:28 Applied HARMONY-3252 [drlvm][winx64][build] Fixing importing JNI NIO function for
Intel64 architectureNow on windows x86_64 NIO natives are found correctly

Mime
View raw message